{"text_format":"1","workbook":"xlsx","n_sheets":19,"sheets":["Setup","Lists","DATA","Weigh-In","最初の入力","Lifting","QuickPrint","集計用","集計１","表彰状","団体用","Awards","SpeakersCard","ContestResults","ContestLog","KG Records","LB Records","Quick-Reference","IPF Formula"],"not_rendered":{"charts":1,"images":34,"macros":1,"external_links":5,"defined_names":8,"comments":3,"pivot_tables":0},"unopened":[],"bounds":{"document_bytes":16777216,"sheet_cells":100000,"rows_first":2000,"rows_last":500,"rows_between":2000,"halvings":0,"cell_chars":16384,"cell_head_chars":4096},"cells_cut":0,"cells_raw":0,"read":"whole","date_system":"1900"}

{"sheet":"Setup","index":0,"n_rows":101,"n_cols":26,"rows_kept":101,"cut":false,"hidden":false,"merged":[[39,16,39,21],[37,21,37,26],[5,1,6,6],[8,1,9,6],[11,1,12,6],[14,1,15,3],[14,4,15,5],[14,6,15,6],[32,1,33,1],[32,2,33,3],[32,4,33,4],[32,5,33,6],[0,1,0,6],[2,16,3,16],[2,12,3,13],[2,1,3,6],[2,8,3,10],[0,8,0,9]]}
[null,"video tutorial:  https://www.youtube.com/watch?v=o-PyI1n_EMI",null,null,null,null,null,null,null,null,"2019-02-27",null,null,null,null,null,null,null,null,{"$f":"MATCH(B9,T2:T6,0)","v":1},null,null,null,null,null,{"$f":"MAX(K:K)","v":43523}]
[null,null,null,null,null,null,null,null,null,null,null,null,null,null,null,null,null,null,null,"Powerlifting (3 lift meet)"]
[null,"Reset for New Contest",null,null,null,null,null,null,"IPF Divisions",null,null,null,"Teams",null,null,null,"Grp",null,null,"Bench Press Only"]
[null,null,null,null,null,null,null,null,null,null,null,null,null,null,null,null,null,null,null,"Squat Only"]
[null,null,null,null,null,null,null,null,"Abbrev","Description","Pl Code",null,"Abrev","Team Name",null,{"$f":"CONCATENATE($Q$3,\" \",Q5)","v":"Grp A"},"A",{"$f":"IF(ROW(P5)<$S$5,ROW(P5)+$S$5+1,ROW(P5)-$S$5)","v":0},{"$f":"IFERROR(MATCH(Lifting!A11,Setup!P5:P20,0)+4,0)","v":5},"Deadlift Only"]
[null,"〇〇パワーリフティング選手権",null,null,null,null,null,null,"F-SJR-U","Raw Women (14-18)",1,null,null,null,null,"Grp B","B",{"$f":"IF(ROW(P6)<$S$5,ROW(P6)+$S$5+1,ROW(P6)-$S$5)","v":1},null,"Push Pull (Bench & Deadlift)"]
[null,null,null,null,null,null,null,null,"F-JR-U","Raw Women (19-23)",1,null,null,null,null,"Grp C","C",2]
[null,null,null,null,null,null,null,null,"F-O-U","Raw Women",1,null,null,null,null,"Grp D","D",3]
[null,"Powerlifting (3 lift meet)",null,null,null,null,null,null,"F-M1-U","Raw Women (40-49)",1,null,null,null,null,"Grp E","E",4,null,"Data!M1:M51"]
[null,null,null,null,null,null,null,null,"F-M2-U","Raw Women (50-59)",1,null,null,null,null,"Grp F","F",5]
[null,null,null,null,null,null,null,null,"F-M3-U","Raw Women (60-69)",1,null,null,null,null,"Grp G","G",6]
[null,"実験",null,null,null,null,null,null,"F-M4-U","Raw Women (70+)-",1,null,null,null,null,"Grp H","H",7]
[null,null,null,null,null,null,null,null,"M-SJR-U","Raw Men (14-18)",1,null,null,null,null,"Grp I","I",8]
[null,null,null,null,null,null,null,null,"M-JR-U","Raw Men (19-23)",1,null,null,null,null,"Grp ",null,9]
[null,"Platform Weights",null,null,"Platform Weight Set",null,"Kg",null,"M-O-U","Raw Men",1,null,null,null,null,"Grp ",null,10]
[null,null,null,null,null,null,null,null,"M-M1-U","Raw Men (40-49)",1,null,null,null,null,"Grp ",null,11]
[null,null,{"$f":"G15","v":"Kg"},null,"Eleiko",{"$f":"G15","v":"Kg"},null,null,"M-M2-U","Raw Men (50-59)",1,null,null,null,null,"Grp ",null,12]
[null,null,{"$f":"Lists!B36","v":{"$error":"#N/A"}},{"$f":"2*(D21*C21+D22*C22+D23*C23+D24*C24+D25*C25+D26*C26+D27*C27+D28*C28+D29*C29+D30*C30+D31*C31)+D32","v":{"$error":"#N/A"}},null,{"$f":"C18","v":{"$error":"#N/A"}},{"$f":"2*(G21*F21+G22*F22+G23*F23+G24*F24+G25*F25+G26*F26+F27*G27+G28*F28+G29*F29+G30*F30+G31*F31)+G32","v":{"$error":"#N/A"}},null,"M-M3-U","Raw Men (60-69)",1,null,null,null,null,"Grp ",null,13]
[null,"How","Pound","LOAD","How","Kilo","LOAD",null,"M-M4-U","Raw Men (70+)-",1,null,null,null,null,"Grp ",null,14]
[null,"Many?","Plates","on Bar","Many?","Plates","on Bar",null,"F-SJR","Women (14 -18)",1,null,null,null,null,"Grp ",null,15]
[null,0,110,{"$f":"IF(OR(C18<D32,C17=\"Kg\"),0,MIN(INT((C18-D32)/(2*C21)),B21/2))","v":{"$error":"#N/A"}},0,50,{"$f":"IF(OR(C18<G32,F17=\"Lb\"),0,MIN(INT((F18-G32)/(2*F21)),E21/2))","v":{"$error":"#N/A"}},null,"F-JR","Women (19 -23)",1]
[null,0,100,{"$f":"IF(OR(C18<D32,C17=\"Kg\"),0,MIN(INT((C18-D32-2*D21*C21)/(2*C22)),B22/2))","v":{"$error":"#N/A"}},0,45,{"$f":"IF(OR(C18<G32,F17=\"Lb\"),0,MIN(INT((F18-G32-2*G21*F21)/(2*F22)),E22/2))","v":{"$error":"#N/A"}},null,"F-O","Women",1]
[null,0,55,{"$f":"IF(OR(C18<D32,C17=\"Kg\"),0,MIN(INT((C18-D32-2*D21*C21-2*D22*C22)/(2*C23)),B23/2))","v":{"$error":"#N/A"}},14,25,{"$f":"IF(OR(C18<G32,F17=\"Lb\"),0,MIN(INT((F18-G32-2*G21*F21-2*G22*F22)/(2*F23)),E23/2))","v":{"$error":"#N/A"}},null,"F-M1","Women (40 -49)",1]
[null,16,45,{"$f":"IF(OR(C18<D32,C17=\"Kg\"),0,MIN(INT((C18-D32-2*D21*C21-2*D22*C22-2*D23*C23)/(2*C24)),B24/2))","v":{"$error":"#N/A"}},2,20,{"$f":"IF(OR(C18<G32,F17=\"Lb\"),0,MIN(INT((F18-G32-2*G21*F21-2*G22*F22-2*G23*F23)/(2*F24)),E24/2))","v":{"$error":"#N/A"}},null,"F-M2","Women (50 -59)",1]
[null,2,35,{"$f":"IF(OR(C18<D32,C17=\"Kg\"),0,MIN(INT((C18-D32-2*D21*C21-2*D22*C22-2*D23*C23-2*D24*C24)/(2*C25)),B25/2))","v":{"$error":"#N/A"}},2,15,{"$f":"IF(OR(C18<G32,F17=\"Lb\"),0,MIN(INT((F18-G32-2*G21*F21-2*G22*F22-2*G23*F23-2*G24*F24)/(2*F25)),E25/2))","v":{"$error":"#N/A"}},null,"F-M3","Women (60 -69)",1]
[null,2,25,{"$f":"IF(OR(C18<D32,C17=\"Kg\"),0,MIN(INT((C18-D32-2*D21*C21-2*D22*C22-2*D23*C23-2*D24*C24-2*D25*C25)/(2*C26)),B26/2))","v":{"$error":"#N/A"}},2,10,{"$f":"IF(OR(C18<G32,F17=\"Lb\"),0,MIN(INT((F18-G32-2*G21*F21-2*G22*F22-2*G23*F23-2*G24*F24-2*G25*F25)/(2*F26)),E26/2))","v":{"$error":"#N/A"}},null,"F-M4","Women (70+) -",1]
[null,4,10,{"$f":"IF(OR(C18<D32,C17=\"Kg\"),0,MIN(INT((C18-D32-2*D21*C21-2*D22*C22-2*D23*C23-2*D24*C24-2*D25*C25-2*D26*C26)/(2*C27)),B27/2))","v":{"$error":"#N/A"}},2,5,{"$f":"IF(OR(C18<G32,F17=\"Lb\"),0,MIN(INT((F18-G32-2*G21*F21-2*G22*F22-2*G23*F23-2*G24*F24-2*G25*F25-2*F26*G26)/(2*F27)),E27/2))","v":{"$error":"#N/A"}},null,"M-SJR","Men (14 -18)",1]
[null,2,5,{"$f":"IF(OR(C18<D32,C17=\"Kg\"),0,MIN(INT((C18-D32-2*D21*C21-2*D22*C22-2*D23*C23-2*D24*C24-2*D25*C25-2*D26*C26-2*D27*C27)/(2*C28)),B28/2))","v":{"$error":"#N/A"}},2,2.5,{"$f":"IF(OR(C18<G32,F17=\"Lb\"),0,MIN(INT((F18-G32-2*G21*F21-2*G22*F22-2*G23*F23-2*G24*F24-2*G25*F25-2*F26*G26-2*F27*G27)/(2*F28)),E28/2))","v":{"$error":"#N/A"}},null,"M-JR","Men (19 -23)",1]
[null,2,2.5,{"$f":"IF(OR(C18<D32,C17=\"Kg\"),0,MIN(INT((C18-D32-2*D21*C21-2*D22*C22-2*D23*C23-2*D24*C24-2*D25*C25-2*D26*C26-2*D27*C27-2*D28*C28)/(2*C29)),B29/2))","v":{"$error":"#N/A"}},2,1.25,{"$f":"IF(OR(C18<G32,F17=\"Lb\"),0,MIN(INT((F18-G32-2*G21*F21-2*G22*F22-2*G23*F23-2*G24*F24-2*G25*F25-2*F26*G26-2*F27*G27-2*G28*F28)/(2*F29)),E29/2))","v":{"$error":"#N/A"}},null,"M-O","Men",1]
[null,4,1.25,{"$f":"IF(OR(C18<D32,C17=\"Kg\"),0,MIN(INT((C18-D32-2*D21*C21-2*D22*C22-2*D23*C23-2*D24*C24-2*D25*C25-2*D26*C26-2*D27*C27-2*D28*C28-2*D29*C29)/(2*C30)),B30/2))","v":{"$error":"#N/A"}},2,0.5,{"$f":"IF(OR(C18<G32,F17=\"Lb\"),0,MIN(INT((F18-G32-2*G21*F21-2*G22*F22-2*G23*F23-2*G24*F24-2*G25*F25-2*F26*G26-2*G27*F27-2*G28*F28-2*G29*F29)/(2*F30)),E30/2))","v":{"$error":"#N/A"}},null,"M-M1","Men (40 -49)",1]
[null,2,0.5,{"$f":"IF(OR(C18<D32,C17=\"Kg\"),0,MIN(INT((C18-D32-2*D21*C21-2*D22*C22-2*D23*C23-2*D24*C24-2*D25*C25-2*D26*C26-2*D27*C27-2*D28*C28-2*D29*C29-2*D30*C30)/(2*C31)),B31/2))","v":{"$error":"#N/A"}},2,0.25,{"$f":"IF(OR(C18<G32,F17=\"Lb\"),0,MIN(INT((F18-G32-2*G21*F21-2*G22*F22-2*G23*F23-2*G24*F24-2*G25*F25-2*G26*F26-2*G27*F27-2*G28*F28-2*G29*F29-2*G30*F30)/(2*F31)),E31/2))","v":{"$error":"#N/A"}},null,"M-M2","Men (50 -59)",1]
[null,"bar & collars",null,55,"bar & collars",null,25,null,"M-M3","Men (60 -69)",1]
[null,{"$f":"B21*C21+B22*C22+B23*C23+B24*C24+B25*C25+B26*C26+B27*C27+B28*C28+B29*C29+B30*C30+B31*C31+D32","v":956},"Lbs Available on the Platform",null,{"$f":"E21*F21+E22*F22+E23*F23+E24*F24+E25*F25+E26*F26+E27*F27+E28*F28+E29*F29+E30*F30+E31*F31+G32","v":484},"Kilos Available on the Platform",null,null,"M-M4","Men (70+) -",1]
[null,null,null,null,null,null,null,null,"F-P-U","Raw Women",1]
[null,null,null,null,null,null,null,null,"F-P","Women",1]
[null,null,null,null,null,null,null,null,"M-P-U","Raw Men",1]
[null,null,null,null,null,null,null,null,"M-P","Men",1]
[]
[]
[]
[]
[]
[]
[]
[]
[]
[]
[]
[]
[]
[]
[]
[]
[]
[]
[]
[]
[]
[]
[]
[]
[]
[]
[]
[]
[]
[]
[]
[]
[]
[]
[]
[]
[]
[]
[]
[]
[]
[]
[]
[]
[]
[]
[]
[]
[]
[]
[]
[]
[]
[]
[]
[]
[]
[null,null,null,null,"Eleiko","Ivanko","Titex"]
[null,null,null,10,{"$f":"IF(E17=E95,G26,0)","v":{"$error":"#N/A"}},{"$f":"IF(F95=E17,G26,0)","v":0},{"$f":"IF(G95=E17,G26,0)","v":0}]
[null,null,null,5,{"$f":"IF(E95=E17,G27,0)","v":{"$error":"#N/A"}},{"$f":"IF(F95=E17,G27,0)","v":0},{"$f":"IF(G95=E17,G27,0)","v":0}]
[null,null,null,2.5,{"$f":"IF(E95=E17,G28,0)","v":{"$error":"#N/A"}},{"$f":"IF(F95=E17,G28,0)","v":0},{"$f":"IF(G95=E17,G28,0)","v":0}]
[]
[]
[null,null,"2015_Nextlifter_R102 Scoreboard.xlsx"]

{"sheet":"Lists","index":1,"n_rows":67,"n_cols":23,"rows_kept":67,"cut":false,"hidden":true,"merged":[]}
["Attempts",null,"col",null,{"$f":"MATCH(Setup!B9,Lists!F1:J1,0)","v":1},"Powerlifting (3 lift meet)","Squat Only","Bench Press Only","Deadlift Only","Push Pull (Bench & Deadlift)",null,"column #","column Ltr",null,"Barload for Next Lifter"]
["Squat 1","SQ-1",11,null,{"$f":"OFFSET(E2,0,$E$1)","v":"Squat 1"},"Squat 1","Squat 1","Bench Press 1","Deadlift 1","Bench Press 1",null,1,"A",null,null,{"$f":"Setup!G15","v":"Kg"},null,null,null,null,null,null,"Y1"]
["Squat 2","SQ-2",12,null,"Squat 2","Squat 2","Squat 2","Bench Press 2","Deadlift 2","Bench Press 2",null,2,"B",null,null,{"$f":"ABS(Lists!B41)","v":{"$error":"#N/A"}},{"$f":"2*(Q6*P6+Q7*P7+Q8*P8+Q9*P9+Q10*P10+Q11*P11+Q12*P12+Q13*P13+Q14*P14+Q15*P15+Q16*P16)+Q35","v":{"$error":"#N/A"}},null,null,null,null,null,"Y2"]
["Squat 3","SQ-3",13,null,"Squat 3","Squat 3","Squat 3","Bench Press 3","Deadlift 3","Bench Press 3",null,3,"C",null,"How","Pound","LOAD",null,null,null,null,null,"Y3"]
["Bench Press 1","BP-1",16,null,"Bench Press 1","Bench Press 1","------------","------------","------------","Deadlift 1",null,4,"D",null,"Many?","Plates","on Bar",null,null,null,null,null,"T1"]
["Bench Press 2","BP-2",17,null,"Bench Press 2","Bench Press 2","New Lifter","New Lifter","New Lifter","Deadlift 2",null,5,"E",null,{"$f":"Setup!B21","v":0},110,{"$f":"IF(OR(P3<Q35,P2=\"Kg\"),0,MIN(INT((P3-Q35)/(2*P6)),O6/2))","v":{"$error":"#N/A"}},{"$f":"IF(Q6=0,\"\",IF(Q6>1,CONCATENATE(Q6,\"/\",P6,\" \"),CONCATENATE(P6,\" \")))","v":{"$error":"#N/A"}},null,null,null,null,"T2"]
["Bench Press 3","BP-3",18,null,"Bench Press 3","Bench Press 3",null,null,null,"Deadlift 3",null,6,"F",null,{"$f":"Setup!B22","v":0},100,{"$f":"IF(OR(P3<Q35,P2=\"Kg\"),0,MIN(INT((P3-Q35-2*Q6*P6)/(2*P7)),O7/2))","v":{"$error":"#N/A"}},{"$f":"IF(Q7=0,\"\",IF(Q7>1,CONCATENATE(Q7,\"/\",P7,\" \"),CONCATENATE(P7,\" \")))","v":{"$error":"#N/A"}},null,null,null,null,"T3"]
["Deadlift 1","DL-1",21,null,"Deadlift 1","Deadlift 1",null,null,null,"------------",null,7,"G",null,{"$f":"Setup!B23","v":0},55,{"$f":"IF(OR(P3<Q35,P2=\"Kg\"),0,MIN(INT((P3-Q35-2*Q6*P6-2*Q7*P7)/(2*P8)),O8/2))","v":{"$error":"#N/A"}},{"$f":"IF(Q8=0,\"\",IF(Q8>1,CONCATENATE(Q8,\"/\",P8,\" \"),CONCATENATE(P8,\" \")))","v":{"$error":"#N/A"}},null,null,null,null,"JR"]
["Deadlift 2","DL-2",22,null,"Deadlift 2","Deadlift 2",null,null,null,"New Lifter",null,8,"H",null,{"$f":"Setup!B24","v":16},45,{"$f":"IF(OR(P3<Q35,P2=\"Kg\"),0,MIN(INT((P3-Q35-2*Q6*P6-2*Q7*P7-2*Q8*P8)/(2*P9)),O9/2))","v":{"$error":"#N/A"}},{"$f":"IF(Q9=0,\"\",IF(Q9>1,CONCATENATE(Q9,\"/\",P9,\" \"),CONCATENATE(P9,\" \")))","v":{"$error":"#N/A"}},null,null,null,null,"O"]
["Deadlift 3","DL-3",23,null,"Deadlift 3","Deadlift 3",null,null,null,null,null,9,"I",null,{"$f":"Setup!B25","v":2},35,{"$f":"IF(OR(P3<Q35,P2=\"Kg\"),0,MIN(INT((P3-Q35-2*Q6*P6-2*Q7*P7-2*Q8*P8-2*Q9*P9)/(2*P10)),O10/2))","v":{"$error":"#N/A"}},{"$f":"IF(Q10=0,\"\",IF(Q10>1,CONCATENATE(P10,\"/\",Q10,\" \"),CONCATENATE(P10,\" \")))","v":{"$error":"#N/A"}},null,null,null,null,"M1a"]
["------------",null,null,null,"------------","------------",null,null,null,null,null,10,"J",null,{"$f":"Setup!B26","v":2},25,{"$f":"IF(OR(P3<Q35,P2=\"Kg\"),0,MIN(INT((P3-Q35-2*Q6*P6-2*Q7*P7-2*Q8*P8-2*Q9*P9-2*Q10*P10)/(2*P11)),O11/2))","v":{"$error":"#N/A"}},{"$error":"#N/A"},null,null,null,null,"M1b"]
["New Lifter",null,null,null,{"$f":"OFFSET(E12,0,$E$1)","v":"New Lifter"},"New Lifter",null,null,null,null,null,11,"K",null,{"$f":"Setup!B27","v":4},10,{"$f":"IF(OR(P3<Q35,P2=\"Kg\"),0,MIN(INT((P3-Q35-2*Q6*P6-2*Q7*P7-2*Q8*P8-2*Q9*P9-2*Q10*P10-2*Q11*P11)/(2*P12)),O12/2))","v":{"$error":"#N/A"}},{"$error":"#N/A"},null,null,null,null,"M2a"]
["Bench Press 1",null,null,null,null,null,null,null,null,null,null,12,"L",null,{"$f":"Setup!B28","v":2},5,{"$f":"IF(OR(P3<Q35,P2=\"Kg\"),0,MIN(INT((P3-Q35-2*Q6*P6-2*Q7*P7-2*Q8*P8-2*Q9*P9-2*Q10*P10-2*Q11*P11-2*Q12*P12)/(2*P13)),O13/2))","v":{"$error":"#N/A"}},{"$error":"#N/A"},null,null,null,null,"M2b"]
["Weigh-in Macro values",null,null,null,null,null,null,null,null,null,null,13,"M",null,{"$f":"Setup!B29","v":2},2.5,{"$f":"IF(OR(P3<Q35,P2=\"Kg\"),0,MIN(INT((P3-Q35-2*Q6*P6-2*Q7*P7-2*Q8*P8-2*Q9*P9-2*Q10*P10-2*Q11*P11-2*Q12*P12-2*Q13*P13)/(2*P14)),O14/2))","v":{"$error":"#N/A"}},{"$error":"#N/A"},null,null,null,null,"M3a"]
["Endrow (RowSort, EndSort for SQ1 BP1 DL1)",{"$f":"COUNTA(INDIRECT(\"Lifting!B13:B500\"))+12","v":12},null,null,null,null,null,null,null,null,null,14,"N",null,{"$f":"Setup!B30","v":4},1.25,{"$f":"IF(OR(P3<Q35,P2=\"Kg\"),0,MIN(INT((P3-Q35-2*Q6*P6-2*Q7*P7-2*Q8*P8-2*Q9*P9-2*Q10*P10-2*Q11*P11-2*Q12*P12-2*Q13*P13-2*Q14*P14)/(2*P15)),O15/2))","v":{"$error":"#N/A"}},{"$error":"#N/A"},null,null,null,null,"M3b"]
["CopyRows",{"$f":"COUNTA(INDIRECT(\"'Weigh-In'!F1:F500\"))+1","v":2},null,null,null,null,null,null,null,null,null,15,"O",null,{"$f":"Setup!B31","v":2},0.5,{"$f":"IF(OR(P3<Q35,P2=\"Kg\"),0,MIN(INT((P3-Q35-2*Q6*P6-2*Q7*P7-2*Q8*P8-2*Q9*P9-2*Q10*P10-2*Q11*P11-2*Q12*P12-2*Q13*P13-2*Q14*P14-2*Q15*P15)/(2*P16)),O16/2))","v":{"$error":"#N/A"}},{"$error":"#N/A"},null,null,null,null,"M4a"]
[null,null,null,null,null,null,null,null,null,null,null,16,"P",null,null,{"$f":"Setup!G15","v":"Kg"},null,null,null,null,null,null,"M4b"]
["Lifting Sheet Macro Values",null,null,null,null,null,null,null,null,null,null,17,"Q",null,null,{"$f":"P3","v":{"$error":"#N/A"}},{"$f":"2*(Q21*P21+Q22*P22+Q23*P23+Q24*P24+Q25*P25+Q26*P26+Q27*P27+Q28*P28+Q29*P29+Q30*P30+Q31*P31)+Q36","v":{"$error":"#N/A"}},null,null,null,null,null,"M5a"]
["Lifting Sheet Sort","on",null,null,null,null,null,null,null,null,null,18,"R",null,"How","Kilo","LOAD",null,null,null,null,null,"M5b"]
["Lifting sheet row",32,null,null,null,null,null,null,null,null,null,19,"S",null,"Many?","Plates","on Bar",null,null,null,null,null,"M6"]
["Lifting sheet column",6,null,null,null,null,null,null,null,null,null,20,"T",null,{"$f":"Setup!E21","v":0},50,{"$f":"IF(OR(P3<Q36,P17=\"Lb\"),0,MIN(INT((P18-Q36)/(2*P21)),O21/2))","v":{"$error":"#N/A"}},{"$f":"IF(Q21=0,\"\",IF(Q21>1,CONCATENATE(Q21,\"/\",P21,\" \"),CONCATENATE(P21,\" \")))","v":{"$error":"#N/A"}},null,null,null,null,"R-T1"]
["Lifting Sheet Cell",{"$f":"ADDRESS(B20,B21,,1,\"Lifting\")","v":"Lifting!$F$32"},null,null,null,null,null,null,null,null,null,21,"U",null,{"$f":"Setup!E22","v":0},45,{"$f":"IF(OR(P3<Q36,P17=\"Lb\"),0,MIN(INT((P18-Q36-2*Q21*P21)/(2*P22)),O22/2))","v":{"$error":"#N/A"}},{"$f":"IF(Q22=0,\"\",IF(Q22>1,CONCATENATE(Q22,\"/\",P22,\" \"),CONCATENATE(P22,\" \")))","v":{"$error":"#N/A"}},null,null,null,null,"R-T2"]
["Attempt",{"$f":"VLOOKUP(Lifting!A3,Lists!A2:C10,2,FALSE)","v":"DL-1"},null,null,null,null,null,null,null,null,null,22,"V",null,{"$f":"Setup!E23","v":14},25,{"$f":"IF(OR(P3<Q36,P17=\"Lb\"),0,MIN(INT((P18-Q36-2*Q21*P21-2*Q22*P22)/(2*P23)),O23/2))","v":{"$error":"#N/A"}},{"$f":"IF(Q23=0,\"\",IF(Q23>1,CONCATENATE(Q23,\"/\",P23,\" \"),CONCATENATE(P23,\" \")))","v":{"$error":"#N/A"}},null,null,null,null,"R-T3"]
["Attempt column",{"$f":"MATCH(B23,INDIRECT(\"Lifting!A11:AZ11\"),0)","v":21},null,null,null,null,null,null,null,null,null,23,"W",null,{"$f":"Setup!E24","v":2},20,{"$f":"IF(OR(P3<Q36,P17=\"Lb\"),0,MIN(INT((P18-Q36-2*Q21*P21-2*Q22*P22-2*Q23*P23)/(2*P24)),O24/2))","v":{"$error":"#N/A"}},{"$f":"IF(Q24=0,\"\",IF(Q24>1,CONCATENATE(P24,\"/\",Q24,\" \"),CONCATENATE(P24,\" \")))","v":{"$error":"#N/A"}},null,null,null,null,"R-Y1"]
["Active lifter row",{"$f":"MATCH(Lifting!A1,INDIRECT(\"Lifting!B1:B500\"),0)","v":{"$error":"#N/A"}},null,null,null,null,null,null,null,null,null,24,"X",null,{"$f":"Setup!E25","v":2},15,{"$f":"IF(OR(P3<Q36,P17=\"Lb\"),0,MIN(INT((P18-Q36-2*Q21*P21-2*Q22*P22-2*Q23*P23-2*Q24*P24)/(2*P25)),O25/2))","v":{"$error":"#N/A"}},{"$error":"#N/A"},null,null,null,null,"R-Y2"]
["Last Row",{"$f":"COUNTA(INDIRECT(\"Lifting!B12:B500\"))+12","v":12},null,null,null,null,null,null,null,null,null,25,"Y",null,{"$f":"Setup!E26","v":2},10,{"$f":"IF(OR(P3<Q36,P17=\"Lb\"),0,MIN(INT((P18-Q36-2*Q21*P21-2*Q22*P22-2*Q23*P23-2*Q24*P24-2*Q25*P25)/(2*P26)),O26/2))","v":{"$error":"#N/A"}},{"$error":"#N/A"},null,null,null,null,"R-Y3"]
["Event Flight","A",{"$f":"VLOOKUP(Lifting!A11,Setup!P5:Q20,2,FALSE)","v":"A"},null,null,null,null,null,null,null,null,26,"Z",null,{"$f":"Setup!E27","v":2},5,{"$f":"IF(OR(P3<Q36,P17=\"Lb\"),0,MIN(INT((P18-Q36-2*Q21*P21-2*Q22*P22-2*Q23*P23-2*Q24*P24-2*Q25*P25-2*Q26*P26)/(2*P27)),O27/2))","v":{"$error":"#N/A"}},{"$error":"#N/A"},null,null,null,null,"R-JR"]
["event flight 1st row (RowSort, StartSort)",{"$f":"MATCH(B27,INDIRECT(\"Lifting!A1:A500\"),0)","v":{"$error":"#N/A"}},null,null,null,null,null,null,null,null,null,null,null,null,{"$f":"Setup!E28","v":2},2.5,{"$f":"IF(OR(P3<Q36,P17=\"Lb\"),0,MIN(INT((P18-Q36-2*Q21*P21-2*Q22*P22-2*Q23*P23-2*Q24*P24-2*Q25*P25-2*Q26*P26-2*Q27*P27)/(2*P28)),O28/2))","v":{"$error":"#N/A"}},{"$error":"#N/A"},null,null,null,null,"R-O"]
["event flight last row (RowSort, EndSort)",{"$f":"COUNTIF(INDIRECT(\"Lifting!A1:A500\"),B27)+B28-1","v":{"$error":"#N/A"}},null,null,null,null,null,null,null,null,null,null,null,null,{"$f":"Setup!E29","v":2},1.25,{"$f":"IF(OR(P3<Q36,P17=\"Lb\"),0,MIN(INT((P18-Q36-2*Q21*P21-2*Q22*P22-2*Q23*P23-2*Q24*P24-2*Q25*P25-2*Q26*P26-2*Q27*P27-2*Q28*P28)/(2*P29)),O29/2))","v":{"$error":"#N/A"}},{"$error":"#N/A"},null,null,null,null,"R-M1A"]
["Sort Column #",21,null,null,null,null,null,null,null,null,null,null,null,null,{"$f":"Setup!E30","v":2},0.5,{"$f":"IF(OR(P3<Q36,P17=\"Lb\"),0,MIN(INT((P18-Q36-2*Q21*P21-2*Q22*P22-2*Q23*P23-2*Q24*P24-2*Q25*P25-2*Q26*P26-2*Q27*P27-2*Q28*P28-2*Q29*P29)/(2*P30)),O30/2))","v":{"$error":"#N/A"}},{"$error":"#N/A"},null,null,null,null,"R-M1B"]
["Sort Column Ltr",{"$f":"VLOOKUP(B30,L2:M27,2,FALSE)","v":"U"},null,null,null,null,null,null,null,null,null,null,null,null,{"$f":"Setup!E31","v":2},0.25,{"$f":"IF(OR(P3<Q36,P17=\"Lb\"),0,MIN(INT((P18-Q36-2*Q21*P21-2*Q22*P22-2*Q23*P23-2*Q24*P24-2*Q25*P25-2*Q26*P26-2*Q27*P27-2*Q28*P28-2*Q29*P29-2*Q30*P30)/(2*P31)),O31/2))","v":{"$error":"#N/A"}},{"$error":"#N/A"},null,null,null,null,"R-M2A"]
["Active Flt Last Row",{"$f":"COUNTIF(INDIRECT(\"Lifting!A1:A500\"),B27)+12","v":12},null,null,null,null,null,null,null,null,null,null,null,null,null,null,null,null,null,null,null,null,"R-M2B"]
["Max index SQ",{"$f":"MAX(INDIRECT(\"Lifting!AJ1:AJ500\"))","v":0},null,null,null,null,null,null,null,null,null,null,null,null,null,null,null,null,null,null,null,null,"R-M3A"]
["Max index BP",{"$f":"MAX(INDIRECT(\"Lifting!AK1:AK500\"))","v":0},null,null,null,null,null,null,null,null,null,null,null,null,null,null,null,null,null,null,null,null,"R-M3B"]
["Max index DL",{"$f":"MAX(INDIRECT(\"Lifting!AL1:AL500\"))","v":0},null,"Total?",null,null,null,null,null,null,null,null,null,null,"bar & collars - lbs",null,{"$f":"Setup!D32","v":55},null,null,null,null,null,"R-M4A"]
["Wt on Bar",{"$f":"ABS(INDIRECT(CONCATENATE(\"Lifting!\",VLOOKUP(B24,L2:M27,2,FALSE),B25)))","v":{"$error":"#N/A"}},null,{"$f":"INDIRECT(ADDRESS(B25,25,1,1,\"Lifting\"))","v":{"$error":"#N/A"}},null,null,null,null,null,null,null,null,null,null,"bar & collars - kg",null,{"$f":"Setup!G32","v":25},null,null,null,null,null,"R-M4B"]
["Rack Height",{"$f":"IF(LEFT(B23,1)=\"D\",\"\",CONCATENATE(\"Rack \",INDIRECT(CONCATENATE(\"Lifting!\",IF(LEFT(B23,1)=\"S\",\"J\",IF(LEFT(B23,1)=\"B\",\"O\",\"Z\")),B25))))","v":""},null,null,null,null,null,null,null,null,null,null,null,null,null,null,null,null,null,null,null,null,"R-M5A"]
["Placing Code Max",{"$f":"MAX(INDIRECT(\"Setup!K6:K500\"))","v":1},null,null,null,null,null,null,null,null,null,null,null,"on deck barload",{"$f":"IF(AND(RIGHT(B23,1)=\"3\",B25=B32),\"\",IF(B36=B41,\"On Deck Barload - No Change\",CONCATENATE(\"On Deck Barload \",R6,R7,R8,R9,R10,R11,R12,R13,R14,R15,R16,R21,R22,R23,R24,R25,R26,R27,R28,R29,R30,R31)))","v":{"$error":"#N/A"}},null,null,null,null,null,null,null,"R-M5B"]
["Lifter Wt Cls",{"$f":"Lifting!D2","v":{"$error":"#N/A"}}]
["Lifter Div",{"$f":"INDIRECT(CONCATENATE(\"Lifting!D\",B25))","v":{"$error":"#N/A"}},null,null,"Lifter Lot#","Repeats"]
["Next Barload",{"$f":"INDIRECT(ADDRESS(IF(B25+F41>B29,13,B25+F41),IF(B25+F41>B29,B24+1,B24),1,1,\"Lifting\"))","v":{"$error":"#N/A"}},null,{"$f":"AND(B32=B25,RIGHT(B23,1)=3)","v":{"$error":"#N/A"}},{"$f":"INDIRECT(ADDRESS(Lists!B25,7,1,1,\"Lifting\"))","v":{"$error":"#N/A"}},{"$f":"COUNTIF(INDIRECT(\"Lifting!B13:B100\"),Lifting!A1)","v":0}]
["QuickPrint PasteCol",{"$f":"COUNTA(INDIRECT(\"QuickPrint!A2:A500\"))+1","v":1}]
["QuickPrint RowClear",{"$f":"COUNTA(INDIRECT(\"QuickPrint!B1:B500\"))+6","v":6}]
["Entered in Event",{"$f":"COUNTIF(INDIRECT(\"Lifting!AM1:AM500\"),1)","v":0}]
["PasteRow on QuickPrint",{"$f":"C45+D45","v":1},{"$f":"COUNTA(INDIRECT(\"QuickPrint!B1:B200\"))+1","v":1},{"$f":"COUNTIF(QuickPrint!B:B,\"Name\")","v":0}]
["Next Flt Sort Value",{"$f":"INDIRECT(CONCATENATE(\"Lifting!\",IF(B23=\"SQ-3\",\"AK\",\"AL\"),B32+1))","v":0},"sorts next flt if = 0"]
["Next Flt sort Col",{"$f":"IF(B23=\"SQ-3\",\"P\",\"U\")","v":"U"}]
["Next flt Start",{"$f":"IFERROR(MATCH(1,INDIRECT(\"Lifting!AH1:AH500\"),0),0)","v":0}]
["Next flt end",{"$f":"COUNTIF(INDIRECT(\"Lifting!$A$1:$A$100\"),INDIRECT(ADDRESS(B32+1,1,1,1,\"Lifting\")))+B32","v":12},null,null,"Wt Class-Event-Div","BP only","DL only",{"$f":"IF(IFERROR(SEARCH(\"PL\",INDIRECT(CONCATENATE(\"Lifting!AE\",B25))),0)>0,\"PL\",\"\")","v":""},"div","lookup Event"]
["Concatenated Record Data",null,null,null,{"$f":"CONCATENATE(Lists!B39,\"-\",J50)","v":{"$error":"#N/A"}},{"$f":"IFERROR(IF(AND(SEARCH(\"BP\",INDIRECT(CONCATENATE(\"Lifting!AE\",B25))),LEFT(B23,2)=\"BP\"),\"BPO\",\"\"),\"\")","v":""},{"$f":"IFERROR(IF(AND(SEARCH(\"DL\",INDIRECT(CONCATENATE(\"Lifting!AE\",B25))),LEFT(B23,2)=\"DL\"),\"DLO\",\"\"),\"\")","v":""},{"$f":"LEFT(B23,2)","v":"DL"},{"$f":"CONCATENATE(IF(MID(B40,2,1)=\"R\",\"R-\",\"\"),VLOOKUP(INDIRECT(CONCATENATE(\"Lifting!AS\",B25)),DATA!E35:F52,2,TRUE))","v":{"$error":"#N/A"}},{"$f":"IF(IFERROR(SEARCH(\"PL\",INDIRECT(CONCATENATE(\"Lifting!AE\",B25))),0)+IFERROR(SEARCH(\"PP\",INDIRECT(CONCATENATE(\"Lifting!AE\",B25))),0)>0,H50,CONCATENATE(F50,G50))","v":""}]
["Number of lifter in Event",{"$f":"SUM(INDIRECT(\"Lifting!AM1:AM500\"))","v":0},null,null,{"$f":"IFERROR(OFFSET(INDIRECT(B56),MATCH(E50,DATA!AF1:AF150,0)-1,I51-1),\"\")","v":""},{"$f":"IFERROR(OFFSET(INDIRECT(B56),MATCH(E50,DATA!AF1:AF150,0)-1,I53-1),\"\")","v":""},null,null,{"$f":"IFERROR(MATCH(I50,INDIRECT(\"'KG Records'!1:1\"),0),\"\")","v":""}]
[null,null,null,null,{"$f":"CONCATENATE(Lists!B39,\"-TL\")","v":{"$error":"#N/A"}},null,null,null,{"$f":"CONCATENATE(IF(LEFT(I50,1)=\"R\",\"R-\",\"\"),\"O\")","v":{"$error":"#N/A"}}]
[null,null,null,null,{"$f":"IFERROR(IF(H49=\"PL\",OFFSET(INDIRECT(B56),MATCH(E52,DATA!AF1:AF150,0)-1,I51-1),\"\"),\"\")","v":""},{"$f":"IFERROR(IF(H49=\"PL\",OFFSET(INDIRECT(B56),MATCH(E52,DATA!AF1:AF150,0)-1,I53-1),\"\"),\"\")","v":""},null,null,{"$f":"IFERROR(MATCH(I52,INDIRECT(\"'KG Records'!1:1\"),0),\"\")","v":""}]
[]
["Record Lookups LB or Kilos",{"$f":"Setup!G15","v":"Kg"}]
[null,{"$f":"IF(B55=\"Kg\",\"'KG Records'!$A$1\",\"'LB Records'!$A$1\")","v":"'KG Records'!$A$1"}]
[null,{"$f":"IF(B55=\"Kg\",\"'KG Records'!$A1:$AO1\",\"'LB Records'!$A1:$AO1\")","v":"'KG Records'!$A1:$AO1"}]
[null,{"$f":"IF(B55=\"Kg\",\"'KG Records'!$A1:$A110\",\"'LB Records'!$A1:$A110\")","v":"'KG Records'!$A1:$A110"}]
[]
[]
["Record Lookups"]
["body weights in",{"$f":"Setup!B39","v":0},null,null,null,null,null,null,{"$f":"VLOOKUP(INDIRECT(CONCATENATE(\"Lifting!AS\",B25)),DATA!E35:F52,2,TRUE)","v":{"$error":"#N/A"}}]
["Weight classes ",{"$f":"Setup!E39","v":0}]
["bodyweight",{"$f":"INDIRECT(CONCATENATE(\"Lifting!E\",B25))","v":{"$error":"#N/A"}},null,{"$f":"VLOOKUP(B64,INDIRECT(E64),IF(LEFT(B40,1)=\"M\",2,3),TRUE)","v":{"$error":"#N/A"}},{"$f":"IF(AND(B62=\"Kilograms\",B63=\"High School Wt Classes\"),\"DATA!X2:Z22\",IF(AND(B62=\"Pounds\",B63=\"High School Wt Classes\"),\"DATA!R2:T22\",IF(AND(B62=\"Kilograms\",B63=\"IPF Wt Classes\"),\"DATA!X2:Z22\",\"DATA!R2:T22\")))","v":"DATA!R2:T22"}]
[]
[]
["pasterow on Results sheet",{"$f":"COUNTA(ContestResults!#REF!)+1","v":2}]

{"sheet":"DATA","index":2,"n_rows":151,"n_cols":43,"rows_kept":151,"cut":false,"hidden":true,"merged":[[0,36,0,38],[0,40,0,42]]}
["Age","Coeff",null,null,"wt","IPF Men-kg","IPF women-kg",null,"wt class list","rank",null,"US State:","USAPL",null,"WT","HS Men-lb","HS Women-lb","WT","IPF Men-lb","IPF women-lb","wt","HS Men-kg","HS women-kg","wt","IPF Men-kg","IPF women-kg",null,"wt class rank kg","wt class rank lb","wt class rank kg",null,null,null,null,null,null,"USAPL Dvisions",null,null,null,"IPF Divisions"]
[14,1.23,"Foster",null,10,30,30,null,43,1,null,"Alabama","AL",null,88.186204599999996,114,97,22.045999999999999,66,66,10,52,44,10,30,30,null,30,66,30,null,"30-SQ","30-SQ","66-SQ",null,null,"FR-Y1","Raw Women (8-9)",1,null,"FR-SJr","Raw Women (14-18)",1]
[15,1.18,null,null,30.001000000000001,35,35,null,44,2,null,"Alaska","AK",null,97.004604599999993,114,105,66.140204600000004,77,77,44.000999999999998,52,48,30.001000000000001,35,35,null,35,77,35,null,"30-BP","30-BP","66-BP",null,null,"FR-Y2","Raw Women (10-11)",1,null,"FR-Jr","Raw Women (19-23)",1]
[16,1.1299999999999999,null,null,35.000999999999998,40,40,null,47,3,null,"Arizona","AZ",null,105.8230046,114,114,77.1632046,88,88,48.000999999999998,52,52,35.000999999999998,40,40,null,40,88,40,null,"30-DL","30-DL","66-DL",null,null,"FR-Y3","Raw Women (12-13)",1,null,"FR-O","Raw Women",1]
[17,1.08,null,null,40.000999999999998,44,43,null,48,4,null,"Arkansas","AR",null,114.6414046,123,123,88.186204599999996,97,94,52.000999999999998,56,56,40.000999999999998,44,43,null,43,94,43,null,"30-TL","30-TL","66-TL",null,null,"FR-T1","Raw Women (14-15)",1,null,"FR-M1","Raw Women (40-49)",1]
[18,1.06,null,null,43.000999999999998,44,47,null,52,5,null,"California","CA",null,123.4598046,132,132,94.800004599999994,97,103,56.000999999999998,60,60,43.000999999999998,44,47,null,44,97,44,null,"35-SQ","35-SQ","77-SQ",null,null,"FR-T2","Raw Women (16-17)",1,null,"FR-M2","Raw Women (50-59)",1]
[19,1.04,null,null,44.000999999999998,48,47,null,53,6,null,"Colorado","CO",null,132.27820460000001,148,148,97.004604599999993,105,103,60.000999999999998,67.5,67.5,44.000999999999998,48,47,null,47,103,47,null,"35-BP","35-BP","77-BP",null,null,"FR-T3","Raw Women (18-19)",1,null,"FR-M3","Raw Women (60-69)",1]
[20,1.03,null,null,47.000999999999998,48,52,null,56,7,null,"Connecticut","CT",null,148.81270460000002,165,165,103.61840460000001,105,114,67.501000000000005,75,75,47.000999999999998,48,52,null,48,105,48,null,"35-DL","35-DL","77-DL",null,null,"FR-JR","Raw Women (20-23)",1,null,"FR-M4","Raw Women (70+)-",1]
[21,1.02,null,null,48.000999999999998,53,52,null,57,8,null,"Delaware","DE",null,165.34720460000003,181,181,105.8230046,116,114,75.001000000000005,82.5,82.5,48.000999999999998,53,52,null,52,114,52,null,"35-TL","35-TL","77-TL",null,null,"FR-O","Raw Women",1,null,"MR-SJr","Raw Men (14-18)",1]
[22,1.01,null,null,52.000999999999998,53,57,null,59,9,null,"Florida","FL",null,181.88170460000001,198,198,114.6414046,116,125,82.501000000000005,90,90,52.000999999999998,53,57,null,53,116,53,null,"40-SQ","40-SQ","88-SQ",null,null,"FR-M1a","Raw Women (40-44)",1,null,"MR-Jr","Raw Men (19-23)",1]
[23,1,null,null,53.000999999999998,59,57,null,60,10,null,"Georgia","GA",null,198.41620460000001,220,"198+",116.8460046,130,125,90.001000000000005,100,"90+",53.000999999999998,59,57,null,56,123,56,null,"40-BP","40-BP","88-BP",null,null,"FR-M1b","Raw Women (45-49)",1,null,"MR-O","Raw Men",1]
[30,1,null,null,57.000999999999998,59,63,null,63,11,null,"Hawaii","HI",null,220.46220460000004,242,"198+",125.6644046,130,138,100.001,110,"90+",57.000999999999998,59,63,null,57,125,57,null,"40-DL","40-DL","88-DL",null,null,"FR-M2a","Raw Women (50-54)",1,null,"MR-M1","Raw Men (40-49)",1]
[40,1,"McCulloch",null,59.000999999999998,66,63,null,66,12,null,"Idaho","ID",null,242.50820460000003,275,"198+",130.07360460000001,130,138,110.001,125,"90+",59.000999999999998,66,63,null,59,130,59,null,"40-TL","40-TL","88-TL",null,null,"FR-M2b","Raw Women (55-59)",1,null,"MR-M2","Raw Men (50-59)",1]
[41,1.01,null,null,63.000999999999998,66,72,null,67.5,13,null,"Illinois","IL",null,275.57720460000002,"275+","198+",138.89200460000001,145,158,125.001,"125+","90+",63.000999999999998,66,72,null,60,132,60,null,"44-SQ","44-SQ","97-SQ",null,null,"FR-M3a","Raw Women (60-64)",1,null,"MR-M3","Raw Men (60-69)",1]
[42,1.02,null,null,66.001000000000005,74,72,null,72,14,null,"Indiana","IN",null,null,null,null,145.5058046,163,158,null,null,null,66.001000000000005,74,72,null,63,138,63,null,"44-BP","44-BP","97-BP",null,null,"FR-M3b","Raw Women (65-69)",1,null,"MR-M4","Raw Men (70+)-",1]
[43,1.0309999999999999,null,null,72.001000000000005,74,84,null,74,15,null,"Iowa","IA",null,null,null,null,158.73340460000003,163,185,null,null,null,72.001000000000005,74,84,null,66,145,66,null,"44-DL","44-DL","97-DL",null,null,"FR-M4a","Raw Women (70-74)",1,null,"F-SJr"," Women (14 -18)",1]
[44,1.0429999999999999,null,null,74.001000000000005,83,84,null,75,16,null,"Kansas","KS",null,null,null,null,163.14260460000003,183,185,null,null,null,74.001000000000005,83,84,null,67.5,148,67.5,null,"44-TL","44-TL","97-TL",null,null,"FR-M4b","Raw Women (75-79)",1,null,"F-Jr"," Women (19 -23)",1]
[45,1.0549999999999999,null,null,83.001000000000005,93,84,null,82.5,17,null,"Kentucky","KY",null,null,null,null,183.00384600000001,183,185,null,null,null,83.01,93,84,null,72,158,72,null,"48-SQ","48-SQ","105-SQ",null,null,"FR-M5a","Raw Women (80-84)",1,null,"F-O"," Women",1]
[46,1.0680000000000001,null,null,84.001000000000005,93,"84+",null,83,18,null,"Louisiana","LA",null,null,null,null,185.18860460000002,205,"185+",null,null,null,84.001000000000005,93,"84+",null,74,163,74,null,"48-BP","48-BP","105-BP",null,null,"FR-M5b","Raw Women (85-89)",1,null,"F-M1"," Women (40 -49)",1]
[47,1.0820000000000001,null,null,93.001000000000005,105,"84+",null,84,19,null,"Maine","ME",null,null,null,null,205.03000460000001,231,"185+",null,null,null,93.001000000000005,105,"84+",null,75,165,75,null,"48-DL","48-DL","105-DL",null,null,"FR-M6","Raw Women (90+)-",1,null,"F-M2"," Women (50 -59)",1]
[48,1.097,null,null,105.001,120,"84+",null,"84+",20,null,"Maryland","MD",null,null,null,null,231.48520460000003,264,"185+",null,null,null,105.001,120,"84+",null,82.5,181,82.5,null,"48-TL","48-TL","105-TL",null,null,"MR-Y1","Raw Men (8-9)",1,null,"F-M3"," Women (60 -69)",1]
[49,1.113,null,null,120.001,"120+","84+",null,90,21,null,"Massachusetts","MA",null,null,null,null,264.55420460000005,"264+","185+",null,null,null,120.001,"120+","84+",null,83,183,83,null,"53-SQ","53-SQ","116-SQ",null,null,"MR-Y2","Raw Men (10-11)",1,null,"F-M4"," Women (70+) -",1]
[50,1.1299999999999999,null,null,null,null,null,null,"90+",22,null,"Michigan","MI",null,null,null,null,null,null,null,null,null,null,null,null,null,null,84,185,84,null,"53-BP","53-BP","116-BP",null,null,"MR-Y3","Raw Men (12-13)",1,null,"M-SJr"," Men (14 -18)",1]
[51,1.147,null,null,null,null,null,null,93,23,null,"Minnesota","MN",null,null,null,null,null,null,null,null,null,null,null,null,null,null,"84+","185+","84+",null,"53-DL","53-DL","116-DL",null,null,"MR-T1","Raw Men (14-15)",1,null,"M-Jr"," Men (19 -23)",1]
[52,1.165,null,null,null,null,null,null,100,24,null,"Mississippi","MS",null,null,null,null,null,null,null,null,null,null,null,null,null,null,90,198,90,null,"53-TL","53-TL","116-TL",null,null,"MR-T2","Raw Men (16-17)",1,null,"M-O"," Men",1]
[53,1.1839999999999999,null,null,null,null,null,null,105,25,null,"Missouri","MO",null,null,null,null,null,null,null,null,null,null,null,null,null,null,"90+","198+","90+",null,"59-SQ","59-SQ","130-SQ",null,null,"MR-T3","Raw Men (18-19)",1,null,"M-M1"," Men (40 -49)",1]
[54,1.204,null,null,null,null,null,null,110,26,null,"Montana","MT",null,null,null,null,null,null,null,null,null,null,null,null,null,null,93,205,93,null,"59-BP","59-BP","130-BP",null,null,"MR-JR","Raw Men (20-23)",1,null,"M-M2"," Men (50 -59)",1]
[55,1.2250000000000001,null,null,null,null,null,null,120,27,null,"Nebraska","NE",null,null,null,null,null,null,null,null,null,null,null,null,null,null,100,220,100,null,"59-DL","59-DL","130-DL",null,null,"MR-O","Raw Men",1,null,"M-M3"," Men (60 -69)",1]
[56,1.246,null,null,null,null,null,null,"120+",28,null,"Nevada","NV",null,null,null,null,null,null,null,null,null,null,null,null,null,null,105,231,105,null,"59-TL","59-TL","130-TL",null,null,"MR-M1a","Raw Men (40-44)",1,null,"M-M4"," Men (70+) -",1]
[57,1.258,null,null,null,null,null,null,125,29,null,"New Hampshire","NH",null,null,null,null,null,null,null,null,null,null,null,null,null,null,110,242,110,null,"66-SQ","66-SQ","145-SQ",null,null,"MR-M1b","Raw Men (45-49)",1]
[58,1.292,null,null,null,null,null,null,"125+",30,null,"New Jersey","NJ",null,null,null,null,null,null,null,null,null,null,null,null,null,null,120,264,120,null,"66-BP","66-BP","145-BP",null,null,"MR-M2a","Raw Men (50-54)",1]
[59,1.3149999999999999,null,null,null,null,null,null,94,31,null,"New Mexico","NM",null,null,null,null,null,null,null,null,null,null,null,null,null,null,125,275,125,null,"66-DL","66-DL","145-DL",null,null,"MR-M2b","Raw Men (55-59)",1]
[60,1.34,null,null,null,null,null,null,97,32,null,"New York","NY",null,null,null,null,null,null,null,null,null,null,null,null,null,null,"120+","264+","120+",null,"66-TL","66-TL","145-TL",null,null,"MR-M3a","Raw Men (60-64)",1]
[61,1.3660000000000001,null,null,"Age","USAPL Age Div",null,null,103,33,null,"North Carolina","NC",null,null,null,null,null,null,null,null,null,null,null,null,null,null,"125+","275+","125+",null,"74-SQ","74-SQ","163-SQ",null,null,"MR-M3b","Raw Men (65-69)",1]
[62,1.393,null,null,8,"Y1",null,null,105,34,null,"North Dakota","ND",null,null,null,null,null,null,null,null,null,null,null,null,null,null,null,null,null,null,"74-BP","74-BP","163-BP",null,null,"MR-M4a","Raw Men (70-74)",1]
[63,1.421,null,null,10,"Y2",null,null,114,35,null,"Ohio","OH",null,null,null,null,null,null,null,null,null,null,null,null,null,null,null,null,null,null,"74-DL","74-DL","163-DL",null,null,"MR-M4b","Raw Men (75-79)",1]
[64,1.45,null,null,12,"Y3",null,null,116,36,null,"Oklahoma","OK",null,null,null,null,null,null,null,null,null,null,null,null,null,null,null,null,null,null,"74-TL","74-TL","163-TL",null,null,"MR-M5a","Raw Men (80-84)",1]
[65,1.48,null,null,14,"T1",null,null,123,37,null,"Oregon","OR",null,null,null,null,null,null,null,null,null,null,null,null,null,null,null,null,null,null,"83-SQ","83-SQ","183-SQ",null,null,"MR-M5b","Raw Men (85-89)",1]
[66,1.5109999999999999,null,null,16,"T2",null,null,125,38,null,"Pennsylvania","PA",null,null,null,null,null,null,null,null,null,null,null,null,null,null,null,null,null,null,"83-BP","83-BP","183-BP",null,null,"MR-M6","Raw Men (90+)-",1]
[67,1.5429999999999999,null,null,18,"T3",null,null,130,39,null,"Rhode Island","RI",null,null,null,null,null,null,null,null,null,null,null,null,null,null,null,null,null,null,"83-DL","83-DL","183-DL",null,null,"F-T1","Women (14-15)",1]
[68,1.5780000000000001,null,null,20,"Jr",null,null,132,40,null,"South Carolina","SC",null,null,null,null,null,null,null,null,null,null,null,null,null,null,null,null,null,null,"83-TL","83-TL","183-TL",null,null,"F-T2","Women (16-17)",1]
[69,1.61,null,null,24,"O",null,null,138,41,null,"South Dakota","SD",null,null,null,null,null,null,null,null,null,null,null,null,null,null,null,null,null,null,"93-SQ","93-SQ","205-SQ",null,null,"F-T3","Women (18-19)",1]
[70,1.645,null,null,40,"M1a",null,null,145,42,null,"Tennessee","TN",null,null,null,null,null,null,null,null,null,null,null,null,null,null,null,null,null,null,"93-BP","93-BP","205-BP",null,null,"F-JR","Women (20-23)",1]
[71,1.681,null,null,45,"M1b",null,null,148,43,null,"Texas","TX",null,null,null,null,null,null,null,null,null,null,null,null,null,null,null,null,null,null,"93-DL","93-DL","205-DL",null,null,"F-O","Women",1]
[72,1.718,null,null,50,"M2a",null,null,158,44,null,"Utah","UT",null,null,null,null,null,null,null,null,null,null,null,null,null,null,null,null,null,null,"93-TL","93-TL","205-TL",null,null,"F-M1a","Women (40-44)",1]
[73,1.756,null,null,55,"M2b",null,null,163,45,null,"Vermont","VT",null,null,null,null,null,null,null,null,null,null,null,null,null,null,null,null,null,null,"105-SQ","105-SQ","231-SQ",null,null,"F-M1b","Women (45-49)",1]
[74,1.7949999999999999,null,null,60,"M3a",null,null,165,46,null,"Virginia","VA",null,null,null,null,null,null,null,null,null,null,null,null,null,null,null,null,null,null,"105-BP","105-BP","231-BP",null,null,"F-M2a","Women (50-54)",1]
[75,1.835,null,null,65,"M3b",null,null,181,47,null,"Washington","WA",null,null,null,null,null,null,null,null,null,null,null,null,null,null,null,null,null,null,"105-DL","105-DL","231-DL",null,null,"F-M2b","Women (55-59)",1]
[76,1.8759999999999999,null,null,70,"M4a",null,null,182,48,null,"West Virginia","WV",null,null,null,null,null,null,null,null,null,null,null,null,null,null,null,null,null,null,"105-TL","105-TL","231-TL",null,null,"F-M3a","Women (60-64)",1]
[77,1.9179999999999999,null,null,75,"M4b",null,null,185,49,null,"Wisconsin","WI",null,null,null,null,null,null,null,null,null,null,null,null,null,null,null,null,null,null,"120-SQ","120-SQ","264-SQ",null,null,"F-M3b","Women (65-69)",1]
[78,1.9610000000000001,null,null,80,"M5a",null,null,"185+",50,null,"Wyoming","WY",null,null,null,null,null,null,null,null,null,null,null,null,null,null,null,null,null,null,"120-BP","120-BP","264-BP",null,null,"F-M4a","Women (70-74)",1]
[79,2.0049999999999999,null,null,85,"M5b","",null,198,51,null,"American Samoa","AS",null,null,null,null,null,null,null,null,null,null,null,null,null,null,null,null,null,null,"120-DL","120-DL","264-DL",null,null,"F-M4b","Women (75-79)",1]
[80,2.0499999999999998,null,null,90,"M6","",null,"198+",52,null,"District of Columbia","DC",null,null,null,null,null,null,null,null,null,null,null,null,null,null,null,null,null,null,"120-TL","120-TL","264-TL",null,null,"F-M5a","Women (80-84)",1]
[81,2.0960000000000001,null,null,null,null,"",null,205,53,null,"Federated States of Micronesia","FM",null,null,null,null,null,null,null,null,null,null,null,null,null,null,null,null,null,null,"120+-SQ","120+-SQ","264+-SQ",null,null,"F-M5b","Women (85-89)",1]
[82,2.1429999999999998,null,null,null,null,"",null,220,54,null,"Guam","GU",null,null,null,null,null,null,null,null,null,null,null,null,null,null,null,null,null,null,"120+-BP","120+-BP","264+-BP",null,null,"F-M6","Women (90+)-",1]
[83,2.19,null,null,null,null,"",null,231,55,null,"Marshall Islands","MH",null,null,null,null,null,null,null,null,null,null,null,null,null,null,null,null,null,null,"120+-DL","120+-DL","264+-DL",null,null,"M-T1","Men (14-15)",1]
[84,2.238,null,null,null,null,"",null,242,56,null,"Northern Mariana Islands","MP",null,null,null,null,null,null,null,null,null,null,null,null,null,null,null,null,null,null,"120+-TL","120+-TL","264+-TL",null,null,"M-T2","Men (16-17)",1]
[85,2.2869999999999999,null,null,null,null,"",null,264,57,null,"Palau","PW",null,null,null,null,null,null,null,null,null,null,null,null,null,null,null,null,null,null,"30-BPO","30-BPO","66-BPO",null,null,"M-T3","Men (18-19)",1]
[86,2.3370000000000002,null,null,null,null,"",null,"264+",58,null,"Puerto Rico","PR",null,null,null,null,null,null,null,null,null,null,null,null,null,null,null,null,null,null,"35-BPO","35-BPO","77-BPO",null,null,"M-JR","Men (20-23)",1]
[87,2.3879999999999999,null,null,null,null,"",null,275,59,null,"Virgin Islands","VI",null,null,null,null,null,null,null,null,null,null,null,null,null,null,null,null,null,null,"40-BPO","40-BPO","88-BPO",null,null,"M-O","Men",1]
[88,2.44,null,null,null,null,"",null,"275+",60,null,null,"OOS",null,null,null,null,null,null,null,null,null,null,null,null,null,null,null,null,null,null,"44-BPO","44-BPO","97-BPO",null,null,"M-M1a","Men (40-44)",1]
[89,2.4940000000000002,null,null,null,null,null,null,null,null,null,null,null,null,null,null,null,null,null,null,null,null,null,null,null,null,null,null,null,null,null,"48-BPO","48-BPO","105-BPO",null,null,"M-M1b","Men (45-49)",1]
[90,2.5489999999999999,null,null,null,null,null,null,null,null,null,null,null,null,null,null,null,null,null,null,null,null,null,null,null,null,null,null,null,null,null,"53-BPO","53-BPO","116-BPO",null,null,"M-M2a","Men (50-54)",1]
[null,null,null,null,null,null,null,null,null,null,null,null,null,null,null,null,null,null,null,null,null,null,null,null,null,null,null,null,null,null,null,"59-BPO","59-BPO","130-BPO",null,null,"M-M2b","Men (55-59)",1]
[null,null,null,null,null,null,null,null,null,null,null,null,null,null,null,null,null,null,null,null,null,null,null,null,null,null,null,null,null,null,null,"66-BPO","66-BPO","145-BPO",null,null,"M-M3a","Men (60-64)",1]
[null,null,null,null,null,null,null,null,null,null,null,null,null,null,null,null,null,null,null,null,null,null,null,null,null,null,null,null,null,null,null,"74-BPO","74-BPO","163-BPO",null,null,"M-M3b","Men (65-69)",1]
[null,null,null,null,null,null,null,null,null,null,null,null,null,null,null,null,null,null,null,null,null,null,null,null,null,null,null,null,null,null,null,"83-BPO","83-BPO","183-BPO",null,null,"M-M4a","Men (70-74)",1]
[null,null,null,null,null,null,null,null,null,null,null,null,null,null,null,null,null,null,null,null,null,null,null,null,null,null,null,null,null,null,null,"93-BPO","93-BPO","205-BPO",null,null,"M-M4b","Men (75-79)",1]
[null,null,null,null,null,null,null,null,null,null,null,null,null,null,null,null,null,null,null,null,null,null,null,null,null,null,null,null,null,null,null,"105-BPO","105-BPO","231-BPO",null,null,"M-M5a","Men (80-84)",1]
[null,null,null,null,null,null,null,null,null,null,null,null,null,null,null,null,null,null,null,null,null,null,null,null,null,null,null,null,null,null,null,"120-BPO","120-BPO","264-BPO",null,null,"M-M5b","Men (85-89)",1]
[null,null,null,null,null,null,null,null,null,null,null,null,null,null,null,null,null,null,null,null,null,null,null,null,null,null,null,null,null,null,null,"120+-BPO","120+-BPO","264+-BPO",null,null,"M-M6","Men (90+)-",1]
[null,null,null,null,null,null,null,null,null,null,null,null,null,null,null,null,null,null,null,null,null,null,null,null,null,null,null,null,null,null,null,"30-DLO","30-DLO","66-DLO"]
[null,null,null,null,null,null,null,null,null,null,null,null,null,null,null,null,null,null,null,null,null,null,null,null,null,null,null,null,null,null,null,"35-DLO","35-DLO","77-DLO"]
[null,null,null,null,null,null,null,null,null,null,null,null,null,null,null,null,null,null,null,null,null,null,null,null,null,null,null,null,null,null,null,"40-DLO","40-DLO","88-DLO"]
[null,null,null,null,null,null,null,null,null,null,null,null,null,null,null,null,null,null,null,null,null,null,null,null,null,null,null,null,null,null,null,"44-DLO","44-DLO","97-DLO"]
[null,null,null,null,null,null,null,null,null,null,null,null,null,null,null,null,null,null,null,null,null,null,null,null,null,null,null,null,null,null,null,"48-DLO","48-DLO","105-DLO"]
[null,null,null,null,null,null,null,null,null,null,null,null,null,null,null,null,null,null,null,null,null,null,null,null,null,null,null,null,null,null,null,"53-DLO","53-DLO","116-DLO"]
[null,null,null,null,null,null,null,null,null,null,null,null,null,null,null,null,null,null,null,null,null,null,null,null,null,null,null,null,null,null,null,"59-DLO","59-DLO","130-DLO"]
[null,null,null,null,null,null,null,null,null,null,null,null,null,null,null,null,null,null,null,null,null,null,null,null,null,null,null,null,null,null,null,"66-DLO","66-DLO","145-DLO"]
[null,null,null,null,null,null,null,null,null,null,null,null,null,null,null,null,null,null,null,null,null,null,null,null,null,null,null,null,null,null,null,"74-DLO","74-DLO","163-DLO"]
[null,null,null,null,null,null,null,null,null,null,null,null,null,null,null,null,null,null,null,null,null,null,null,null,null,null,null,null,null,null,null,"83-DLO","83-DLO","183-DLO"]
[null,null,null,null,null,null,null,null,null,null,null,null,null,null,null,null,null,null,null,null,null,null,null,null,null,null,null,null,null,null,null,"93-DLO","93-DLO","205-DLO"]
[null,null,null,null,null,null,null,null,null,null,null,null,null,null,null,null,null,null,null,null,null,null,null,null,null,null,null,null,null,null,null,"105-DLO","105-DLO","231-DLO"]
[null,null,null,null,null,null,null,null,null,null,null,null,null,null,null,null,null,null,null,null,null,null,null,null,null,null,null,null,null,null,null,"120-DLO","120-DLO","264-DLO"]
[null,null,null,null,null,null,null,null,null,null,null,null,null,null,null,null,null,null,null,null,null,null,null,null,null,null,null,null,null,null,null,"120+-DLO","120+-DLO","264+-DLO"]
[null,null,null,null,null,null,null,null,null,null,null,null,null,null,null,null,null,null,null,null,null,null,null,null,null,null,null,null,null,null,null,"30-SQ","30-SQ","66-SQ"]
[null,null,null,null,null,null,null,null,null,null,null,null,null,null,null,null,null,null,null,null,null,null,null,null,null,null,null,null,null,null,null,"30-BP","30-BP","66-BP"]
[null,null,null,null,null,null,null,null,null,null,null,null,null,null,null,null,null,null,null,null,null,null,null,null,null,null,null,null,null,null,null,"30-DL","30-DL","66-DL"]
[null,null,null,null,null,null,null,null,null,null,null,null,null,null,null,null,null,null,null,null,null,null,null,null,null,null,null,null,null,null,null,"30-TL","30-TL","66-TL"]
[null,null,null,null,null,null,null,null,null,null,null,null,null,null,null,null,null,null,null,null,null,null,null,null,null,null,null,null,null,null,null,"35-SQ","35-SQ","77-SQ"]
[null,null,null,null,null,null,null,null,null,null,null,null,null,null,null,null,null,null,null,null,null,null,null,null,null,null,null,null,null,null,null,"35-BP","35-BP","77-BP"]
[null,null,null,null,null,null,null,null,null,null,null,null,null,null,null,null,null,null,null,null,null,null,null,null,null,null,null,null,null,null,null,"35-DL","35-DL","77-DL"]
[null,null,null,null,null,null,null,null,null,null,null,null,null,null,null,null,null,null,null,null,null,null,null,null,null,null,null,null,null,null,null,"35-TL","35-TL","77-TL"]
[null,null,null,null,null,null,null,null,null,null,null,null,null,null,null,null,null,null,null,null,null,null,null,null,null,null,null,null,null,null,null,"40-SQ","40-SQ","88-SQ"]
[null,null,null,null,null,null,null,null,null,null,null,null,null,null,null,null,null,null,null,null,null,null,null,null,null,null,null,null,null,null,null,"40-BP","40-BP","88-BP"]
[null,null,null,null,null,null,null,null,null,null,null,null,null,null,null,null,null,null,null,null,null,null,null,null,null,null,null,null,null,null,null,"40-DL","40-DL","88-DL"]
[null,null,null,null,null,null,null,null,null,null,null,null,null,null,null,null,null,null,null,null,null,null,null,null,null,null,null,null,null,null,null,"40-TL","40-TL","88-TL"]
[null,null,null,null,null,null,null,null,null,null,null,null,null,null,null,null,null,null,null,null,null,null,null,null,null,null,null,null,null,null,null,"43-SQ","43-SQ","94-SQ"]
[null,null,null,null,null,null,null,null,null,null,null,null,null,null,null,null,null,null,null,null,null,null,null,null,null,null,null,null,null,null,null,"43-BP","43-BP","94-BP"]
[null,null,null,null,null,null,null,null,null,null,null,null,null,null,null,null,null,null,null,null,null,null,null,null,null,null,null,null,null,null,null,"43-DL","43-DL","94-DL"]
[null,null,null,null,null,null,null,null,null,null,null,null,null,null,null,null,null,null,null,null,null,null,null,null,null,null,null,null,null,null,null,"43-TL","43-TL","94-TL"]
[null,null,null,null,null,null,null,null,null,null,null,null,null,null,null,null,null,null,null,null,null,null,null,null,null,null,null,null,null,null,null,"47-SQ","47-SQ","103-SQ"]
[null,null,null,null,null,null,null,null,null,null,null,null,null,null,null,null,null,null,null,null,null,null,null,null,null,null,null,null,null,null,null,"47-BP","47-BP","103-BP"]
[null,null,null,null,null,null,null,null,null,null,null,null,null,null,null,null,null,null,null,null,null,null,null,null,null,null,null,null,null,null,null,"47-DL","47-DL","103-DL"]
[null,null,null,null,null,null,null,null,null,null,null,null,null,null,null,null,null,null,null,null,null,null,null,null,null,null,null,null,null,null,null,"47-TL","47-TL","103-TL"]
[null,null,null,null,null,null,null,null,null,null,null,null,null,null,null,null,null,null,null,null,null,null,null,null,null,null,null,null,null,null,null,"52-SQ","52-SQ","114-SQ"]
[null,null,null,null,null,null,null,null,null,null,null,null,null,null,null,null,null,null,null,null,null,null,null,null,null,null,null,null,null,null,null,"52-BP","52-BP","114-BP"]
[null,null,null,null,null,null,null,null,null,null,null,null,null,null,null,null,null,null,null,null,null,null,null,null,null,null,null,null,null,null,null,"52-DL","52-DL","114-DL"]
[null,null,null,null,null,null,null,null,null,null,null,null,null,null,null,null,null,null,null,null,null,null,null,null,null,null,null,null,null,null,null,"52-TL","52-TL","114-TL"]
[null,null,null,null,null,null,null,null,null,null,null,null,null,null,null,null,null,null,null,null,null,null,null,null,null,null,null,null,null,null,null,"57-SQ","57-SQ","125-SQ"]
[null,null,null,null,null,null,null,null,null,null,null,null,null,null,null,null,null,null,null,null,null,null,null,null,null,null,null,null,null,null,null,"57-BP","57-BP","125-BP"]
[null,null,null,null,null,null,null,null,null,null,null,null,null,null,null,null,null,null,null,null,null,null,null,null,null,null,null,null,null,null,null,"57-DL","57-DL","125-DL"]
[null,null,null,null,null,null,null,null,null,null,null,null,null,null,null,null,null,null,null,null,null,null,null,null,null,null,null,null,null,null,null,"57-TL","57-TL","125-TL"]
[null,null,null,null,null,null,null,null,null,null,null,null,null,null,null,null,null,null,null,null,null,null,null,null,null,null,null,null,null,null,null,"63-SQ","63-SQ","138-SQ"]
[null,null,null,null,null,null,null,null,null,null,null,null,null,null,null,null,null,null,null,null,null,null,null,null,null,null,null,null,null,null,null,"63-BP","63-BP","138-BP"]
[null,null,null,null,null,null,null,null,null,null,null,null,null,null,null,null,null,null,null,null,null,null,null,null,null,null,null,null,null,null,null,"63-DL","63-DL","138-DL"]
[null,null,null,null,null,null,null,null,null,null,null,null,null,null,null,null,null,null,null,null,null,null,null,null,null,null,null,null,null,null,null,"63-TL","63-TL","138-TL"]
[null,null,null,null,null,null,null,null,null,null,null,null,null,null,null,null,null,null,null,null,null,null,null,null,null,null,null,null,null,null,null,"72-SQ","72-SQ","158-SQ"]
[null,null,null,null,null,null,null,null,null,null,null,null,null,null,null,null,null,null,null,null,null,null,null,null,null,null,null,null,null,null,null,"72-BP","72-BP","158-BP"]
[null,null,null,null,null,null,null,null,null,null,null,null,null,null,null,null,null,null,null,null,null,null,null,null,null,null,null,null,null,null,null,"72-DL","72-DL","158-DL"]
[null,null,null,null,null,null,null,null,null,null,null,null,null,null,null,null,null,null,null,null,null,null,null,null,null,null,null,null,null,null,null,"72-TL","72-TL","158-TL"]
[null,null,null,null,null,null,null,null,null,null,null,null,null,null,null,null,null,null,null,null,null,null,null,null,null,null,null,null,null,null,null,"84-SQ","84-SQ","185-SQ"]
[null,null,null,null,null,null,null,null,null,null,null,null,null,null,null,null,null,null,null,null,null,null,null,null,null,null,null,null,null,null,null,"84-BP","84-BP","185-BP"]
[null,null,null,null,null,null,null,null,null,null,null,null,null,null,null,null,null,null,null,null,null,null,null,null,null,null,null,null,null,null,null,"84-DL","84-DL","185-DL"]
[null,null,null,null,null,null,null,null,null,null,null,null,null,null,null,null,null,null,null,null,null,null,null,null,null,null,null,null,null,null,null,"84-TL","84-TL","185-TL"]
[null,null,null,null,null,null,null,null,null,null,null,null,null,null,null,null,null,null,null,null,null,null,null,null,null,null,null,null,null,null,null,"84+-SQ","84+-SQ","185+-SQ"]
[null,null,null,null,null,null,null,null,null,null,null,null,null,null,null,null,null,null,null,null,null,null,null,null,null,null,null,null,null,null,null,"84+-BP","84+-BP","185+-BP"]
[null,null,null,null,null,null,null,null,null,null,null,null,null,null,null,null,null,null,null,null,null,null,null,null,null,null,null,null,null,null,null,"84+-DL","84+-DL","185+-DL"]
[null,null,null,null,null,null,null,null,null,null,null,null,null,null,null,null,null,null,null,null,null,null,null,null,null,null,null,null,null,null,null,"84+-TL","84+-TL","185+-TL"]
[null,null,null,null,null,null,null,null,null,null,null,null,null,null,null,null,null,null,null,null,null,null,null,null,null,null,null,null,null,null,null,"30-BPO","30-BPO","66-BPO"]
[null,null,null,null,null,null,null,null,null,null,null,null,null,null,null,null,null,null,null,null,null,null,null,null,null,null,null,null,null,null,null,"35-BPO","35-BPO","77-BPO"]
[null,null,null,null,null,null,null,null,null,null,null,null,null,null,null,null,null,null,null,null,null,null,null,null,null,null,null,null,null,null,null,"40-BPO","40-BPO","88-BPO"]
[null,null,null,null,null,null,null,null,null,null,null,null,null,null,null,null,null,null,null,null,null,null,null,null,null,null,null,null,null,null,null,"43-BPO","43-BPO","94-BPO"]
[null,null,null,null,null,null,null,null,null,null,null,null,null,null,null,null,null,null,null,null,null,null,null,null,null,null,null,null,null,null,null,"47-BPO","47-BPO","103-BPO"]
[null,null,null,null,null,null,null,null,null,null,null,null,null,null,null,null,null,null,null,null,null,null,null,null,null,null,null,null,null,null,null,"52-BPO","52-BPO","114-BPO"]
[null,null,null,null,null,null,null,null,null,null,null,null,null,null,null,null,null,null,null,null,null,null,null,null,null,null,null,null,null,null,null,"57-BPO","57-BPO","125-BPO"]
[null,null,null,null,null,null,null,null,null,null,null,null,null,null,null,null,null,null,null,null,null,null,null,null,null,null,null,null,null,null,null,"63-BPO","63-BPO","138-BPO"]
[null,null,null,null,null,null,null,null,null,null,null,null,null,null,null,null,null,null,null,null,null,null,null,null,null,null,null,null,null,null,null,"72-BPO","72-BPO","158-BPO"]
[null,null,null,null,null,null,null,null,null,null,null,null,null,null,null,null,null,null,null,null,null,null,null,null,null,null,null,null,null,null,null,"84-BPO","84-BPO","185-BPO"]
[null,null,null,null,null,null,null,null,null,null,null,null,null,null,null,null,null,null,null,null,null,null,null,null,null,null,null,null,null,null,null,"84+-BPO","84+-BPO","185+-BPO"]
[null,null,null,null,null,null,null,null,null,null,null,null,null,null,null,null,null,null,null,null,null,null,null,null,null,null,null,null,null,null,null,"30-DLO","30-DLO","66-DLO"]
[null,null,null,null,null,null,null,null,null,null,null,null,null,null,null,null,null,null,null,null,null,null,null,null,null,null,null,null,null,null,null,"35-DLO","35-DLO","77-DLO"]
[null,null,null,null,null,null,null,null,null,null,null,null,null,null,null,null,null,null,null,null,null,null,null,null,null,null,null,null,null,null,null,"40-DLO","40-DLO","88-DLO"]
[null,null,null,null,null,null,null,null,null,null,null,null,null,null,null,null,null,null,null,null,null,null,null,null,null,null,null,null,null,null,null,"43-DLO","43-DLO","94-DLO"]
[null,null,null,null,null,null,null,null,null,null,null,null,null,null,null,null,null,null,null,null,null,null,null,null,null,null,null,null,null,null,null,"47-DLO","47-DLO","103-DLO"]
[null,null,null,null,null,null,null,null,null,null,null,null,null,null,null,null,null,null,null,null,null,null,null,null,null,null,null,null,null,null,null,"52-DLO","52-DLO","114-DLO"]
[null,null,null,null,null,null,null,null,null,null,null,null,null,null,null,null,null,null,null,null,null,null,null,null,null,null,null,null,null,null,null,"57-DLO","57-DLO","125-DLO"]
[null,null,null,null,null,null,null,null,null,null,null,null,null,null,null,null,null,null,null,null,null,null,null,null,null,null,null,null,null,null,null,"63-DLO","63-DLO","138-DLO"]
[null,null,null,null,null,null,null,null,null,null,null,null,null,null,null,null,null,null,null,null,null,null,null,null,null,null,null,null,null,null,null,"72-DLO","72-DLO","158-DLO"]
[null,null,null,null,null,null,null,null,null,null,null,null,null,null,null,null,null,null,null,null,null,null,null,null,null,null,null,null,null,null,null,"84-DLO","84-DLO","185-DLO"]
[null,null,null,null,null,null,null,null,null,null,null,null,null,null,null,null,null,null,null,null,null,null,null,null,null,null,null,null,null,null,null,"84+-DLO","84+-DLO","185+-DLO"]

{"sheet":"Weigh-In","index":3,"n_rows":908,"n_cols":64,"rows_kept":908,"cut":false,"hidden":false,"merged":[]}
[null,null,null,null,null,null,null,null,null,null,null,null,null,null,null,null,null,null,null,null,null,null,null,null,null,3]
[{"$f":"Setup!Q3","v":"Grp"},"Name","MemberID","Team","M/F-Div","Bwt - kg","lot#","Birth Year","SQ rack",{"$f":"CONCATENATE(\"SQ-1 (\",T2,\")\")","v":"SQ-1 (Kg)"},"BP rack",{"$f":"CONCATENATE(\"BP-1 (\",T2,\")\")","v":"BP-1 (Kg)"},{"$f":"CONCATENATE(\"DL-1 (\",T2,\")\")","v":"DL-1 (Kg)"},"Events Entered","State","Print Card","Nominated Wt Class",null,null,{"$f":"Setup!G15","v":"Kg"},{"$f":"COUNTA(F:F)+1","v":2},{"$f":"CONCATENATE(\"Setup!I6:I\",COUNTA(Setup!I:I)+3)","v":"Setup!I6:I37"},{"$f":"CONCATENATE(\"Setup!M6:M\",COUNTA(Setup!M:M)+3)","v":"Setup!M6:M5"},{"$f":"CONCATENATE(\"Setup!Q5:Q\",COUNTA(Setup!Q:Q)+4)","v":"Setup!Q5:Q14"},{"$f":"CONCATENATE(\"DATA!$M$2:$M$61\")","v":"DATA!$M$2:$M$61"},5,{"$f":"COUNTA(F:F)+1","v":2},null,null,null,null,null,null,null,null,null,null,null,null,"flight sort data","att sort data",null,null,null,null,null,null,null,null,null,"SQ-1","SQ-2","SQ-3","Best SQ Att","BP rack","BP-1","BP-2","BP-3","Best BP Att","Sub Total","DL-1","DL-2","DL-3","Best DL Att"]
[null,null,null," ","-"]
[null,null,null," ","-"]
[null,null,null," ","-"]
[null,null,null," ","-"]
[null,null,null," ","-"]
[null,null,null," ","-"]
[null,null,null," ","-"]
[null,null,null," ","-"]
[null,null,null," ","-"]
[null,null,null," ","-"]
[null,null,null," ","-"]
[null,null,null," ","-"]
[null,null,null," ","-"]
[null,null,null," ","-"]
[null,null,null," ","-"]
[null,null,null," ","-"]
[null,null,null," ","-"]
[null,null,null," ","-"]
[null,null,null," ","-"]
[null,null,null," ","-"]
[null,null,null," ","-"]
[null,null,null," ","-"]
[null,null,null," ","-"]
[null,null,null," ","-"]
[null,null,null," ","-"]
[null,null,null," ","-"]
[null,null,null," ","-"]
[null,null,null," ","-"]
[null,null,null," ","-"]
[null,null,null," ","-"]
[null,null,null," ","-"]
[null,null,null," ","-"]
[null,null,null," ","-"]
[null,null,null," ","-"]
[null,null,null," ","-"]
[null,null,null," ","-"]
[null,null,null," ","-"]
[null,null,null," ","-"]
[null,null,null," ","-"]
[null,null,null," ","-"]
[null,null,null," ","-"]
[null,null,null," ","-"]
[null,null,null," ","-"]
[null,null,null," ","-"]
[null,null,null," ","-"]
[null,null,null," ","-"]
[null,null,null," ","-"]
[null,null,null," ","-"]
[null,null,null," ","-"]
[null,null,null," ","-"]
[null,null,null," ","-"]
[null,null,null," ","-"]
[null,null,null," ","-"]
[null,null,null," ","-"]
[null,null,null," ","-"]
[null,null,null," ","-"]
[null,null,null," ","-"]
[null,null,null," ","-"]
[null,null,null," ","-"]
[null,null,null," ","-"]
[null,null,null," ","-"]
[null,null,null," ","-"]
[null,null,null," ","-"]
[null,null,null," ","-"]
[null,null,null," ","-"]
[null,null,null," ","-"]
[null,null,null," ","-"]
[null,null,null," ","-"]
[null,null,null," ","-"]
[null,null,null," ","-"]
[null,null,null," ","-"]
[null,null,null," ","-"]
[null,null,null," ","-"]
[null,null,null," ","-"]
[null,null,null," ","-"]
[null,null,null," ","-"]
[null,null,null," ","-"]
[null,null,null," ","-"]
[null,null,null," ","-"]
[null,null,null," ","-"]
[null,null,null," ","-"]
[null,null,null," ","-"]
[null,null,null," ","-"]
[null,null,null," ","-"]
[null,null,null," ","-"]
[null,null,null," ","-"]
[null,null,null," ","-"]
[null,null,null," ","-"]
[null,null,null," ","-"]
[null,null,null," ","-"]
[null,null,null," ","-"]
[null,null,null," ","-"]
[null,null,null," ","-"]
[null,null,null," ","-"]
[null,null,null," ","-"]
[null,null,null," ","-"]
[null,null,null," ","-"]
[null,null,null," ","-"]
[null,null,null," ","-"]
[null,null,null," ","-"]
[null,null,null," ","-"]
[null,null,null," ","-"]
[null,null,null," ","-"]
[null,null,null," ","-"]
[null,null,null," ","-"]
[null,null,null," ","-"]
[null,null,null," ","-"]
[null,null,null," ","-"]
[null,null,null," ","-"]
[null,null,null," ","-"]
[null,null,null," ","-"]
[null,null,null," ","-"]
[null,null,null," ","-"]
[null,null,null," ","-"]
[null,null,null," ","-"]
[null,null,null," ","-"]
[null,null,null," ","-"]
[null,null,null," ","-"]
[null,null,null," ","-"]
[null,null,null," ","-"]
[null,null,null," ","-"]
[null,null,null," ","-"]
[null,null,null," ","-"]
[null,null,null," ","-"]
[null,null,null," ","-"]
[null,null,null," ","-"]
[null,null,null," ","-"]
[null,null,null," ","-"]
[null,null,null," ","-"]
[null,null,null," ","-"]
[null,null,null," ","-"]
[null,null,null," ","-"]
[null,null,null," ","-"]
[null,null,null," ","-"]
[null,null,null," ","-"]
[null,null,null," ","-"]
[null,null,null," ","-"]
[null,null,null," ","-"]
[null,null,null," ","-"]
[null,null,null," ","-"]
[null,null,null," ","-"]
[null,null,null," ","-"]
[null,null,null," ","-"]
[null,null,null," ","-"]
[null,null,null," ","-"]
[null,null,null," ","-"]
[null,null,null," ","-"]
[null,null,null," ","-"]
[null,null,null," ","-"]
[null,null,null," ","-"]
[null,null,null," ","-"]
[null,null,null," ","-"]
[null,null,null," ","-"]
[null,null,null," ","-"]
[null,null,null," ","-"]
[null,null,null," ","-"]
[null,null,null," ","-"]
[null,null,null," ","-"]
[null,null,null," ","-"]
[null,null,null," ","-"]
[null,null,null," ","-"]
[null,null,null," ","-"]
[null,null,null," ","-"]
[null,null,null," ","-"]
[null,null,null," ","-"]
[null,null,null," ","-"]
[null,null,null," ","-"]
[null,null,null," ","-"]
[null,null,null," ","-"]
[null,null,null," ","-"]
[null,null,null," ","-"]
[null,null,null," ","-"]
[null,null,null," ","-"]
[null,null,null," ","-"]
[null,null,null," ","-"]
[null,null,null," ","-"]
[null,null,null," ","-"]
[null,null,null," ","-"]
[null,null,null," ","-"]
[null,null,null," ","-"]
[null,null,null," ","-"]
[null,null,null," ","-"]
[null,null,null," ","-"]
[null,null,null," ","-"]
[null,null,null," ","-"]
[null,null,null," ","-"]
[null,null,null," ","-"]
[null,null,null," ","-"]
[null,null,null," ","-"]
[null,null,null," ","-"]
[null,null,null," ","-"]
[null,null,null," ","-"]
[null,null,null," ","-"]
[null,null,null," ","-"]
[null,null,null," ","-"]
[null,null,null," ","-"]
[null,null,null," ","-"]
[null,null,null," ","-"]
[null,null,null," ","-"]
[null,null,null," ","-"]
[null,null,null," ","-"]
[null,null,null," ","-"]
[null,null,null," ","-"]
[null,null,null," ","-"]
[null,null,null," ","-"]
[null,null,null," ","-"]
[null,null,null," ","-"]
[null,null,null," ","-"]
[null,null,null," ","-"]
[null,null,null," ","-"]
[null,null,null," ","-"]
[null,null,null," ","-"]
[null,null,null," ","-"]
[null,null,null," ","-"]
[null,null,null," ","-"]
[null,null,null," ","-"]
[null,null,null," ","-"]
[null,null,null," ","-"]
[null,null,null," ","-"]
[null,null,null," ","-"]
[null,null,null," ","-"]
[null,null,null," ","-"]
[null,null,null," ","-"]
[null,null,null," ","-"]
[null,null,null," ","-"]
[null,null,null," ","-"]
[null,null,null," ","-"]
[null,null,null," ","-"]
[null,null,null," ","-"]
[null,null,null," ","-"]
[null,null,null," ","-"]
[null,null,null," ","-"]
[null,null,null," ","-"]
[null,null,null," ","-"]
[null,null,null," ","-"]
[null,null,null," ","-"]
[null,null,null," ","-"]
[null,null,null," ","-"]
[null,null,null," ","-"]
[null,null,null," ","-"]
[null,null,null," ","-"]
[null,null,null," ","-"]
[null,null,null," ","-"]
[null,null,null," ","-"]
[null,null,null," ","-"]
[null,null,null," ","-"]
[null,null,null," ","-"]
[null,null,null," ","-"]
[null,null,null," ","-"]
[null,null,null," ","-"]
[null,null,null," ","-"]
[null,null,null," ","-"]
[null,null,null," ","-"]
[null,null,null," ","-"]
[null,null,null," ","-"]
[null,null,null," ","-"]
[null,null,null," ","-"]
[null,null,null," ","-"]
[null,null,null," ","-"]
[null,null,null," ","-"]
[null,null,null," ","-"]
[null,null,null," ","-"]
[null,null,null," ","-"]
[null,null,null," ","-"]
[null,null,null," ","-"]
[null,null,null," ","-"]
[null,null,null," ","-"]
[null,null,null," ","-"]
[null,null,null," ","-"]
[null,null,null," ","-"]
[null,null,null," ","-"]
[null,null,null," ","-"]
[null,null,null," ","-"]
[null,null,null," ","-"]
[null,null,null," ","-"]
[null,null,null," ","-"]
[null,null,null," ","-"]
[null,null,null," ","-"]
[null,null,null," ","-"]
[null,null,null," ","-"]
[null,null,null," ","-"]
[null,null,null," ","-"]
[null,null,null," ","-"]
[null,null,null," ","-"]
[null,null,null," ","-"]
[null,null,null," ","-"]
[null,null,null," ","-"]
[null,null,null," ","-"]
[null,null,null," ","-"]
[null,null,null," ","-"]
[null,null,null," ","-"]
[null,null,null," ","-"]
[null,null,null," ","-"]
[null,null,null," ","-"]
[null,null,null," ","-"]
[null,null,null," ","-"]
[null,null,null," ","-"]
[null,null,null," ","-"]
[null,null,null," ","-"]
[null,null,null," ","-"]
[null,null,null," ","-"]
[null,null,null," ","-"]
[null,null,null," ","-"]
[null,null,null," ","-"]
[null,null,null," ","-"]
[null,null,null," ","-"]
[null,null,null," ","-"]
[null,null,null," ","-"]
[null,null,null," ","-"]
[null,null,null," ","-"]
[null,null,null," ","-"]
[null,null,null," ","-"]
[null,null,null," ","-"]
[null,null,null," ","-"]
[null,null,null," ","-"]
[null,null,null," ","-"]
[null,null,null," ","-"]
[null,null,null," ","-"]
[null,null,null," ","-"]
[null,null,null," ","-"]
[null,null,null," ","-"]
[null,null,null," ","-"]
[null,null,null," ","-"]
[null,null,null," ","-"]
[null,null,null," ","-"]
[null,null,null," ","-"]
[null,null,null," ","-"]
[null,null,null," ","-"]
[null,null,null," ","-"]
[null,null,null," ","-"]
[null,null,null," ","-"]
[null,null,null," ","-"]
[null,null,null," ","-"]
[null,null,null," ","-"]
[null,null,null," ","-"]
[null,null,null," ","-"]
[null,null,null," ","-"]
[null,null,null," ","-"]
[null,null,null," ","-"]
[null,null,null," ","-"]
[null,null,null," ","-"]
[null,null,null," ","-"]
[null,null,null," ","-"]
[null,null,null," ","-"]
[null,null,null," ","-"]
[null,null,null," ","-"]
[null,null,null," ","-"]
[null,null,null," ","-"]
[null,null,null," ","-"]
[null,null,null," ","-"]
[null,null,null," ","-"]
[null,null,null," ","-"]
[null,null,null," ","-"]
[null,null,null," ","-"]
[null,null,null," ","-"]
[null,null,null," ","-"]
[null,null,null," ","-"]
[null,null,null," ","-"]
[null,null,null," ","-"]
[null,null,null," ","-"]
[null,null,null," ","-"]
[null,null,null," ","-"]
[null,null,null," ","-"]
[null,null,null," ","-"]
[null,null,null," ","-"]
[null,null,null," ","-"]
[null,null,null," ","-"]
[null,null,null," ","-"]
[null,null,null," ","-"]
[null,null,null," ","-"]
[null,null,null," ","-"]
[null,null,null," ","-"]
[null,null,null," ","-"]
[null,null,null," ","-"]
[null,null,null," ","-"]
[null,null,null," ","-"]
[null,null,null," ","-"]
[null,null,null," ","-"]
[null,null,null," ","-"]
[null,null,null," ","-"]
[null,null,null," ","-"]
[null,null,null," ","-"]
[null,null,null," ","-"]
[null,null,null," ","-"]
[null,null,null," ","-"]
[null,null,null," ","-"]
[null,null,null," ","-"]
[null,null,null," ","-"]
[null,null,null," ","-"]
[null,null,null," ","-"]
[null,null,null," ","-"]
[null,null,null," ","-"]
[null,null,null," ","-"]
[null,null,null," ","-"]
[null,null,null," ","-"]
[null,null,null," ","-"]
[null,null,null," ","-"]
[null,null,null," ","-"]
[null,null,null," ","-"]
[null,null,null," ","-"]
[null,null,null," ","-"]
[null,null,null," ","-"]
[null,null,null," ","-"]
[null,null,null," ","-"]
[null,null,null," ","-"]
[null,null,null," ","-"]
[null,null,null," ","-"]
[null,null,null," ","-"]
[null,null,null," ","-"]
[null,null,null," ","-"]
[null,null,null," ","-"]
[null,null,null," ","-"]
[null,null,null," ","-"]
[null,null,null," ","-"]
[null,null,null," ","-"]
[null,null,null," ","-"]
[null,null,null," ","-"]
[null,null,null," ","-"]
[null,null,null," ","-"]
[null,null,null," ","-"]
[null,null,null," ","-"]
[null,null,null," ","-"]
[null,null,null," ","-"]
[null,null,null," ","-"]
[null,null,null," ","-"]
[null,null,null," ","-"]
[null,null,null," ","-"]
[null,null,null," ","-"]
[null,null,null," ","-"]
[null,null,null," ","-"]
[null,null,null," ","-"]
[null,null,null," ","-"]
[null,null,null," ","-"]
[null,null,null," ","-"]
[null,null,null," ","-"]
[null,null,null," ","-"]
[null,null,null," ","-"]
[null,null,null," ","-"]
[null,null,null," ","-"]
[null,null,null," ","-"]
[null,null,null," ","-"]
[null,null,null," ","-"]
[null,null,null," ","-"]
[null,null,null," ","-"]
[null,null,null," ","-"]
[null,null,null," ","-"]
[null,null,null," ","-"]
[null,null,null," ","-"]
[null,null,null," ","-"]
[null,null,null," ","-"]
[null,null,null," ","-"]
[null,null,null," ","-"]
[null,null,null," ","-"]
[null,null,null," ","-"]
[null,null,null," ","-"]
[null,null,null," ","-"]
[null,null,null," ","-"]
[null,null,null," ","-"]
[null,null,null," ","-"]
[null,null,null," ","-"]
[null,null,null," ","-"]
[null,null,null," ","-"]
[null,null,null," ","-"]
[null,null,null," ","-"]
[null,null,null," ","-"]
[null,null,null," ","-"]
[null,null,null," ","-"]
[null,null,null," ","-"]
[null,null,null," ","-"]
[null,null,null," ","-"]
[null,null,null," ","-"]
[null,null,null," ","-"]
[null,null,null," ","-"]
[null,null,null," ","-"]
[null,null,null," ","-"]
[null,null,null," ","-"]
[null,null,null," ","-"]
[null,null,null," ","-"]
[null,null,null," ","-"]
[null,null,null," ","-"]
[null,null,null," ","-"]
[null,null,null," ","-"]
[null,null,null," ","-"]
[null,null,null," ","-"]
[null,null,null," ","-"]
[null,null,null," ","-"]
[null,null,null," ","-"]
[null,null,null," ","-"]
[null,null,null," ","-"]
[null,null,null," ","-"]
[null,null,null," ","-"]
[null,null,null," ","-"]
[null,null,null," ","-"]
[null,null,null," ","-"]
[null,null,null," ","-"]
[null,null,null," ","-"]
[null,null,null," ","-"]
[null,null,null," ","-"]
[null,null,null," ","-"]
[null,null,null," ","-"]
[null,null,null," ","-"]
[null,null,null," ","-"]
[null,null,null," ","-"]
[null,null,null," ","-"]
[null,null,null," ","-"]
[null,null,null," ","-"]
[null,null,null," ","-"]
[null,null,null," ","-"]
[null,null,null," ","-"]
[null,null,null," ","-"]
[null,null,null," ","-"]
[null,null,null," ","-"]
[null,null,null," ","-"]
[null,null,null," ","-"]
[null,null,null," ","-"]
[null,null,null," ","-"]
[null,null,null," ","-"]
[null,null,null," ","-"]
[null,null,null," ","-"]
[null,null,null," ","-"]
[null,null,null," ","-"]
[null,null,null," ","-"]
[null,null,null," ","-"]
[null,null,null," ","-"]
[null,null,null," ","-"]
[null,null,null," ","-"]
[null,null,null," ","-"]
[null,null,null," ","-"]
[null,null,null," ","-"]
[null,null,null," ","-"]
[null,null,null," ","-"]
[null,null,null," ","-"]
[null,null,null," ","-"]
[null,null,null," ","-"]
[null,null,null," ","-"]
[null,null,null," ","-"]
[null,null,null," ","-"]
[null,null,null," ","-"]
[null,null,null," ","-"]
[null,null,null," ","-"]
[null,null,null," ","-"]
[null,null,null," ","-"]
[null,null,null," ","-"]
[null,null,null," ","-"]
[null,null,null," ","-"]
[null,null,null," ","-"]
[null,null,null," ","-"]
[null,null,null," ","-"]
[null,null,null," ","-"]
[null,null,null," ","-"]
[null,null,null," ","-"]
[null,null,null," ","-"]
[null,null,null," ","-"]
[null,null,null," ","-"]
[null,null,null," ","-"]
[null,null,null," ","-"]
[null,null,null," ","-"]
[null,null,null," ","-"]
[null,null,null," ","-"]
[null,null,null," ","-"]
[null,null,null," ","-"]
[null,null,null," ","-"]
[null,null,null," ","-"]
[null,null,null," ","-"]
[null,null,null," ","-"]
[null,null,null," ","-"]
[null,null,null," ","-"]
[null,null,null," ","-"]
[null,null,null," ","-"]
[null,null,null," ","-"]
[null,null,null," ","-"]
[null,null,null," ","-"]
[null,null,null," ","-"]
[null,null,null," ","-"]
[null,null,null," ","-"]
[null,null,null," ","-"]
[null,null,null," ","-"]
[null,null,null," ","-"]
[null,null,null," ","-"]
[null,null,null," ","-"]
[null,null,null," ","-"]
[null,null,null," ","-"]
[null,null,null," ","-"]
[null,null,null," ","-"]
[null,null,null," ","-"]
[null,null,null," ","-"]
[null,null,null," ","-"]
[null,null,null," ","-"]
[null,null,null," ","-"]
[null,null,null," ","-"]
[null,null,null," ","-"]
[null,null,null," ","-"]
[null,null,null," ","-"]
[null,null,null," ","-"]
[null,null,null," ","-"]
[null,null,null," ","-"]
[null,null,null," ","-"]
[null,null,null," ","-"]
[null,null,null," ","-"]
[null,null,null," ","-"]
[null,null,null," ","-"]
[null,null,null," ","-"]
[null,null,null," ","-"]
[null,null,null," ","-"]
[null,null,null," ","-"]
[null,null,null," ","-"]
[null,null,null," ","-"]
[null,null,null," ","-"]
[null,null,null," ","-"]
[null,null,null," ","-"]
[null,null,null," ","-"]
[null,null,null," ","-"]
[null,null,null," ","-"]
[null,null,null," ","-"]
[null,null,null," ","-"]
[null,null,null," ","-"]
[null,null,null," ","-"]
[null,null,null," ","-"]
[null,null,null," ","-"]
[null,null,null," ","-"]
[null,null,null," ","-"]
[null,null,null," ","-"]
[null,null,null," ","-"]
[null,null,null," ","-"]
[null,null,null," ","-"]
[null,null,null," ","-"]
[null,null,null," ","-"]
[null,null,null," ","-"]
[null,null,null," ","-"]
[null,null,null," ","-"]
[null,null,null," ","-"]
[null,null,null," ","-"]
[null,null,null," ","-"]
[null,null,null," ","-"]
[null,null,null," ","-"]
[null,null,null," ","-"]
[null,null,null," ","-"]
[null,null,null," ","-"]
[null,null,null," ","-"]
[null,null,null," ","-"]
[null,null,null," ","-"]
[null,null,null," ","-"]
[null,null,null," ","-"]
[null,null,null," ","-"]
[null,null,null," ","-"]
[null,null,null," ","-"]
[null,null,null," ","-"]
[null,null,null," ","-"]
[null,null,null," ","-"]
[null,null,null," ","-"]
[null,null,null," ","-"]
[null,null,null," ","-"]
[null,null,null," ","-"]
[null,null,null," ","-"]
[null,null,null," ","-"]
[null,null,null," ","-"]
[null,null,null," ","-"]
[null,null,null," ","-"]
[null,null,null," ","-"]
[null,null,null," ","-"]
[null,null,null," ","-"]
[null,null,null," ","-"]
[null,null,null," ","-"]
[null,null,null," ","-"]
[null,null,null," ","-"]
[null,null,null," ","-"]
[null,null,null," ","-"]
[null,null,null," ","-"]
[null,null,null," ","-"]
[null,null,null," ","-"]
[null,null,null," ","-"]
[null,null,null," ","-"]
[null,null,null," ","-"]
[null,null,null," ","-"]
[null,null,null," ","-"]
[null,null,null," ","-"]
[null,null,null," ","-"]
[null,null,null," ","-"]
[null,null,null," ","-"]
[null,null,null," ","-"]
[null,null,null," ","-"]
[null,null,null," ","-"]
[null,null,null," ","-"]
[null,null,null," ","-"]
[null,null,null," ","-"]
[null,null,null," ","-"]
[null,null,null," ","-"]
[null,null,null," ","-"]
[null,null,null," ","-"]
[null,null,null," ","-"]
[null,null,null," ","-"]
[null,null,null," ","-"]
[null,null,null," ","-"]
[null,null,null," ","-"]
[null,null,null," ","-"]
[null,null,null," ","-"]
[null,null,null," ","-"]
[null,null,null," ","-"]
[null,null,null," ","-"]
[null,null,null," ","-"]
[null,null,null," ","-"]
[null,null,null," ","-"]
[null,null,null," ","-"]
[null,null,null," ","-"]
[null,null,null," ","-"]
[null,null,null," ","-"]
[null,null,null," ","-"]
[null,null,null," ","-"]
[null,null,null," ","-"]
[null,null,null," ","-"]
[null,null,null," ","-"]
[null,null,null," ","-"]
[null,null,null," ","-"]
[null,null,null," ","-"]
[null,null,null," ","-"]
[null,null,null," ","-"]
[null,null,null," ","-"]
[null,null,null," ","-"]
[null,null,null," ","-"]
[null,null,null," ","-"]
[null,null,null," ","-"]
[null,null,null," ","-"]
[null,null,null," ","-"]
[null,null,null," ","-"]
[null,null,null," ","-"]
[null,null,null," ","-"]
[null,null,null," ","-"]
[null,null,null," ","-"]
[null,null,null," ","-"]
[null,null,null," ","-"]
[null,null,null," ","-"]
[null,null,null," ","-"]
[null,null,null," ","-"]
[null,null,null," ","-"]
[null,null,null," ","-"]
[null,null,null," ","-"]
[null,null,null," ","-"]
[null,null,null," ","-"]
[null,null,null," ","-"]
[null,null,null," ","-"]
[null,null,null," ","-"]
[null,null,null," ","-"]
[null,null,null," ","-"]
[null,null,null," ","-"]
[null,null,null," ","-"]
[null,null,null," ","-"]
[null,null,null," ","-"]
[null,null,null," ","-"]
[null,null,null," ","-"]
[null,null,null," ","-"]
[null,null,null," ","-"]
[null,null,null," ","-"]
[null,null,null," ","-"]
[null,null,null," ","-"]
[null,null,null," ","-"]
[null,null,null," ","-"]
[null,null,null," ","-"]
[null,null,null," ","-"]
[null,null,null," ","-"]
[null,null,null," ","-"]
[null,null,null," ","-"]
[null,null,null," ","-"]
[null,null,null," ","-"]
[null,null,null," ","-"]
[null,null,null," ","-"]
[null,null,null," ","-"]
[null,null,null," ","-"]
[null,null,null," ","-"]
[null,null,null," ","-"]
[null,null,null," ","-"]
[null,null,null," ","-"]
[null,null,null," ","-"]
[null,null,null," ","-"]
[null,null,null," ","-"]
[null,null,null," ","-"]
[null,null,null," ","-"]
[null,null,null," ","-"]
[null,null,null," ","-"]
[null,null,null," ","-"]
[null,null,null," ","-"]
[null,null,null," ","-"]
[null,null,null," ","-"]
[null,null,null," ","-"]
[null,null,null," ","-"]
[null,null,null," ","-"]
[null,null,null," ","-"]
[null,null,null," ","-"]
[null,null,null," ","-"]
[null,null,null," ","-"]
[null,null,null," ","-"]
[null,null,null," ","-"]
[null,null,null," ","-"]
[null,null,null," ","-"]
[null,null,null," ","-"]
[null,null,null," ","-"]
[null,null,null," ","-"]
[null,null,null," ","-"]
[null,null,null," ","-"]
[null,null,null," ","-"]
[null,null,null," ","-"]
[null,null,null," ","-"]
[null,null,null," ","-"]
[null,null,null," ","-"]
[null,null,null," ","-"]
[null,null,null," ","-"]
[null,null,null," ","-"]
[null,null,null," ","-"]
[null,null,null," ","-"]
[null,null,null," ","-"]
[null,null,null," ","-"]
[null,null,null," ","-"]
[null,null,null," ","-"]
[null,null,null," ","-"]
[null,null,null," ","-"]
[null,null,null," ","-"]
[null,null,null," ","-"]
[null,null,null," ","-"]
[null,null,null," ","-"]
[null,null,null," ","-"]
[null,null,null," ","-"]
[null,null,null," ","-"]
[null,null,null," ","-"]
[null,null,null," ","-"]
[null,null,null," ","-"]
[null,null,null," ","-"]
[null,null,null," ","-"]
[null,null,null," ","-"]
[null,null,null," ","-"]
[null,null,null," ","-"]
[null,null,null," ","-"]
[null,null,null," ","-"]
[null,null,null," ","-"]
[null,null,null," ","-"]
[null,null,null," ","-"]
[null,null,null," ","-"]
[null,null,null," ","-"]
[null,null,null," ","-"]
[null,null,null," ","-"]
[null,null,null," ","-"]
[null,null,null," ","-"]
[null,null,null," ","-"]
[null,null,null," ","-"]
[null,null,null," ","-"]
[null,null,null," ","-"]
[null,null,null," ","-"]
[null,null,null," ","-"]
[null,null,null," ","-"]
[null,null,null," ","-"]
[null,null,null," ","-"]
[null,null,null," ","-"]
[null,null,null," ","-"]
[null,null,null," ","-"]
[null,null,null," ","-"]
[null,null,null," ","-"]
[null,null,null," ","-"]
[null,null,null," ","-"]
[null,null,null," ","-"]
[null,null,null," ","-"]
[null,null,null," ","-"]
[null,null,null," ","-"]
[null,null,null," ","-"]
[null,null,null," ","-"]
[null,null,null," ","-"]
[null,null,null," ","-"]
[null,null,null," ","-"]
[null,null,null," ","-"]
[null,null,null," ","-"]
[null,null,null," ","-"]
[null,null,null," ","-"]
[null,null,null," ","-"]
[null,null,null," ","-"]
[null,null,null," ","-"]
[null,null,null," ","-"]
[null,null,null," ","-"]
[null,null,null," ","-"]
[null,null,null," ","-"]
[null,null,null," ","-"]
[null,null,null," ","-"]
[null,null,null," ","-"]
[null,null,null," ","-"]
[null,null,null," ","-"]
[null,null,null," ","-"]
[null,null,null," ","-"]
[null,null,null," ","-"]
[null,null,null," ","-"]
[null,null,null," ","-"]
[null,null,null," ","-"]
[null,null,null," ","-"]
[null,null,null," ","-"]
[null,null,null," ","-"]
[null,null,null," ","-"]
[null,null,null," ","-"]
[null,null,null," ","-"]
[null,null,null," ","-"]
[null,null,null," ","-"]
[null,null,null," ","-"]
[null,null,null," ","-"]
[null,null,null," ","-"]
[null,null,null," ","-"]
[null,null,null," ","-"]
[null,null,null," ","-"]
[null,null,null," ","-"]
[null,null,null," "]
[null,null,null," "]
[null,null,null," "]
[null,null,null," "]

{"sheet":"最初の入力","index":4,"n_rows":944,"n_cols":13,"rows_kept":944,"cut":false,"hidden":false,"merged":[]}
[]
[]
[]
["GP","性別","カテゴリー",null,"種別",null,"選手名","都道府県","団体名","結合後","LOT","競技種別","生年"]
[null,null,null,{"$f":"B5&\"-\"&C5","v":"-"},null,{"$f":"D5&E5","v":"-"},null,null,null,{"$f":"H5&\" \"&I5","v":" "}]
[null,null,null,"-",null,"-",null,null,null,{"$f":"H6&\" \"&I6","v":" "}]
[null,null,null,"-",null,"-",null,null,null," "]
[null,null,null,"-",null,"-",null,null,null," "]
[null,null,null,"-",null,"-",null,null,null," "]
[null,null,null,"-",null,"-",null,null,null," "]
[null,null,null,"-",null,"-",null,null,null," "]
[null,null,null,"-",null,"-",null,null,null," "]
[null,null,null,"-",null,"-",null,null,null," "]
[null,null,null,"-",null,"-",null,null,null," "]
[null,null,null,"-",null,"-",null,null,null," "]
[null,null,null,"-",null,"-",null,null,null," "]
[null,null,null,"-",null,"-",null,null,null," "]
[null,null,null,"-",null,"-",null,null,null," "]
[null,null,null,"-",null,"-",null,null,null," "]
[null,null,null,"-",null,"-",null,null,null," "]
[null,null,null,"-",null,"-",null,null,null," "]
[null,null,null,"-",null,"-",null,null,null," "]
[null,null,null,"-",null,"-",null,null,null," "]
[null,null,null,"-",null,"-",null,null,null," "]
[null,null,null,"-",null,"-",null,null,null," "]
[null,null,null,"-",null,"-",null,null,null," "]
[null,null,null,"-",null,"-",null,null,null," "]
[null,null,null,"-",null,"-",null,null,null," "]
[null,null,null,"-",null,"-",null,null,null," "]
[null,null,null,"-",null,"-",null,null,null," "]
[null,null,null,"-",null,"-",null,null,null," "]
[null,null,null,"-",null,"-",null,null,null," "]
[null,null,null,"-",null,"-",null,null,null," "]
[null,null,null,"-",null,"-",null,null,null," "]
[null,null,null,"-",null,"-",null,null,null," "]
[null,null,null,"-",null,"-",null,null,null," "]
[null,null,null,"-",null,"-",null,null,null," "]
[null,null,null,"-",null,"-",null,null,null," "]
[null,null,null,"-",null,"-",null,null,null," "]
[null,null,null,"-",null,"-",null,null,null," "]
[null,null,null,"-",null,"-",null,null,null,{"$f":"H41&\" \"&L41","v":" "}]
[null,null,null,"-",null,"-",null,null,null," "]
[null,null,null,"-",null,"-",null,null,null," "]
[null,null,null,"-",null,"-",null,null,null," "]
[null,null,null,"-",null,"-",null,null,null," "]
[null,null,null,{"$f":"B46&\"-\"&C46","v":"-"},null,{"$f":"D46&E46","v":"-"},null,null,null," "]
[null,null,null,"-",null,"-",null,null,null," "]
[null,null,null,"-",null,"-",null,null,null," "]
[null,null,null,"-",null,"-",null,null,null," "]
[null,null,null,"-",null,"-",null,null,null," "]
[null,null,null,"-",null,"-",null,null,null," "]
[null,null,null,"-",null,"-",null,null,null," "]
[null,null,null,"-",null,"-",null,null,null," "]
[null,null,null,"-",null,"-",null,null,null," "]
[null,null,null,"-",null,"-",null,null,null," "]
[null,null,null,"-",null,"-",null,null,null," "]
[null,null,null,"-",null,"-",null,null,null," "]
[null,null,null,"-",null,"-",null,null,null," "]
[null,null,null,"-",null,"-",null,null,null," "]
[null,null,null,"-",null,"-",null,null,null," "]
[null,null,null,"-",null,"-",null,null,null," "]
[null,null,null,"-",null,"-",null,null,null," "]
[null,null,null,"-",null,"-",null,null,null," "]
[null,null,null,"-",null,"-",null,null,null," "]
[null,null,null,"-",null,"-",null,null,null," "]
[null,null,null,"-",null,"-",null,null,null," "]
[null,null,null,"-",null,"-",null,null,null," "]
[null,null,null,"-",null,"-",null,null,null," "]
[null,null,null,"-",null,"-",null,null,null," "]
[null,null,null,"-",null,"-",null,null,null,{"$f":"H70&\" \"&L70","v":" "}]
[null,null,null,"-",null,"-",null,null,null," "]
[null,null,null,"-",null,"-",null,null,null," "]
[null,null,null,"-",null,"-",null,null,null," "]
[null,null,null,"-",null,"-",null,null,null," "]
[null,null,null,"-",null,"-",null,null,null," "]
[null,null,null,"-",null,"-",null,null,null," "]
[null,null,null,"-",null,"-",null,null,null," "]
[null,null,null,"-",null,"-",null,null,null," "]
[null,null,null,"-",null,"-",null,null,null," "]
[null,null,null,"-",null,"-",null,null,null," "]
[null,null,null,"-",null,"-",null,null,null," "]
[null,null,null,"-",null,"-",null,null,null," "]
[null,null,null,"-",null,"-",null,null,null," "]
[null,null,null,"-",null,"-",null,null,null," "]
[null,null,null,"-",null,"-",null,null,null," "]
[null,null,null,"-",null,"-",null,null,null," "]
[null,null,null,"-",null,"-",null,null,null," "]
[null,null,null,"-",null,"-",null,null,null," "]
[null,null,null,"-",null,"-",null,null,null," "]
[null,null,null,"-",null,"-",null,null,null," "]
[null,null,null,"-",null,"-",null,null,null," "]
[null,null,null,"-",null,"-",null,null,null," "]
[null,null,null,"-",null,"-",null,null,null," "]
[null,null,null,"-",null,"-",null,null,null," "]
[null,null,null,"-",null,"-",null,null,null," "]
[null,null,null,"-",null,"-",null,null,null," "]
[null,null,null,"-",null,"-",null,null,null," "]
[null,null,null,"-",null,"-",null,null,null," "]
[null,null,null,"-",null,"-",null,null,null," "]
[null,null,null,"-",null,"-",null,null,null," "]
[null,null,null,"-",null,"-",null,null,null," "]
[null,null,null,"-",null,"-",null,null,null," "]
[null,null,null,"-",null,"-",null,null,null," "]
[null,null,null,"-",null,"-",null,null,null," "]
[null,null,null,"-",null,"-",null,null,null," "]
[null,null,null,"-",null,"-",null,null,null," "]
[null,null,null,"-",null,"-",null,null,null," "]
[null,null,null,"-",null,"-",null,null,null," "]
[null,null,null,"-",null,"-",null,null,null," "]
[null,null,null,{"$f":"B110&\"-\"&C110","v":"-"},null,{"$f":"D110&E110","v":"-"},null,null,null," "]
[null,null,null,"-",null,"-",null,null,null," "]
[null,null,null,"-",null,"-",null,null,null," "]
[null,null,null,"-",null,"-",null,null,null," "]
[null,null,null,"-",null,"-",null,null,null," "]
[null,null,null,"-",null,"-",null,null,null," "]
[null,null,null,"-",null,"-",null,null,null," "]
[null,null,null,"-",null,"-",null,null,null," "]
[null,null,null,"-",null,"-",null,null,null," "]
[null,null,null,"-",null,"-",null,null,null," "]
[null,null,null,"-",null,"-",null,null,null," "]
[null,null,null,"-",null,"-",null,null,null," "]
[null,null,null,"-",null,"-",null,null,null," "]
[null,null,null,"-",null,"-",null,null,null," "]
[null,null,null,"-",null,"-",null,null,null," "]
[null,null,null,"-",null,"-",null,null,null," "]
[null,null,null,"-",null,"-",null,null,null," "]
[null,null,null,"-",null,"-",null,null,null," "]
[null,null,null,"-",null,"-",null,null,null," "]
[null,null,null,"-",null,"-",null,null,null," "]
[null,null,null,"-",null,"-",null,null,null," "]
[null,null,null,"-",null,"-",null,null,null," "]
[null,null,null,"-",null,"-",null,null,null," "]
[null,null,null,"-",null,"-",null,null,null," "]
[null,null,null,"-",null,"-",null,null,null,{"$f":"H134&\" \"&L134","v":" "}]
[null,null,null,"-",null,"-",null,null,null," "]
[null,null,null,"-",null,"-",null,null,null," "]
[null,null,null,"-",null,"-",null,null,null," "]
[null,null,null,"-",null,"-",null,null,null," "]
[null,null,null,"-",null,"-",null,null,null," "]
[null,null,null,"-",null,"-",null,null,null," "]
[null,null,null,"-",null,"-",null,null,null," "]
[null,null,null,"-",null,"-",null,null,null," "]
[null,null,null,"-",null,"-",null,null,null," "]
[null,null,null,"-",null,"-",null,null,null," "]
[null,null,null,"-",null,"-",null,null,null," "]
[null,null,null,"-",null,"-",null,null,null," "]
[null,null,null,"-",null,"-",null,null,null," "]
[null,null,null,"-",null,"-",null,null,null," "]
[null,null,null,"-",null,"-",null,null,null," "]
[null,null,null,"-",null,"-",null,null,null," "]
[null,null,null,"-",null,"-",null,null,null," "]
[null,null,null,"-",null,"-",null,null,null," "]
[null,null,null,"-",null,"-",null,null,null," "]
[null,null,null,"-",null,"-",null,null,null," "]
[null,null,null,"-",null,"-",null,null,null," "]
[null,null,null,"-",null,"-",null,null,null," "]
[null,null,null,"-",null,"-",null,null,null," "]
[null,null,null,"-",null,"-",null,null,null," "]
[null,null,null,"-",null,"-",null,null,null," "]
[null,null,null,"-",null,"-",null,null,null," "]
[null,null,null,"-",null,"-",null,null,null," "]
[null,null,null,"-",null,"-",null,null,null," "]
[null,null,null,"-",null,"-",null,null,null," "]
[null,null,null,"-",null,"-",null,null,null," "]
[null,null,null,"-",null,"-",null,null,null," "]
[null,null,null,"-",null,"-",null,null,null," "]
[null,null,null,"-",null,"-",null,null,null," "]
[null,null,null,"-",null,"-",null,null,null," "]
[null,null,null,"-",null,"-",null,null,null," "]
[null,null,null,"-",null,"-",null,null,null," "]
[null,null,null,"-",null,"-",null,null,null," "]
[null,null,null,"-",null,"-",null,null,null," "]
[null,null,null,"-",null,"-",null,null,null," "]
[null,null,null,{"$f":"B174&\"-\"&C174","v":"-"},null,{"$f":"D174&E174","v":"-"},null,null,null," "]
[null,null,null,"-",null,"-",null,null,null," "]
[null,null,null,"-",null,"-",null,null,null," "]
[null,null,null,"-",null,"-",null,null,null," "]
[null,null,null,"-",null,"-",null,null,null," "]
[null,null,null,"-",null,"-",null,null,null," "]
[null,null,null,"-",null,"-",null,null,null," "]
[null,null,null,"-",null,"-",null,null,null," "]
[null,null,null,"-",null,"-",null,null,null," "]
[null,null,null,"-",null,"-",null,null,null," "]
[null,null,null,"-",null,"-",null,null,null," "]
[null,null,null,"-",null,"-",null,null,null," "]
[null,null,null,"-",null,"-",null,null,null," "]
[null,null,null,"-",null,"-",null,null,null," "]
[null,null,null,"-",null,"-",null,null,null," "]
[null,null,null,"-",null,"-",null,null,null," "]
[null,null,null,"-",null,"-",null,null,null," "]
[null,null,null,"-",null,"-",null,null,null," "]
[null,null,null,"-",null,"-",null,null,null," "]
[null,null,null,"-",null,"-",null,null,null," "]
[null,null,null,"-",null,"-",null,null,null," "]
[null,null,null,"-",null,"-",null,null,null," "]
[null,null,null,"-",null,"-",null,null,null," "]
[null,null,null,"-",null,"-",null,null,null," "]
[null,null,null,"-",null,"-",null,null,null,{"$f":"H198&\" \"&L198","v":" "}]
[null,null,null,"-",null,"-",null,null,null," "]
[null,null,null,"-",null,"-",null,null,null," "]
[null,null,null,"-",null,"-",null,null,null," "]
[null,null,null,"-",null,"-",null,null,null," "]
[null,null,null,"-",null,"-",null,null,null," "]
[null,null,null,"-",null,"-",null,null,null," "]
[null,null,null,"-",null,"-",null,null,null," "]
[null,null,null,"-",null,"-",null,null,null," "]
[null,null,null,"-",null,"-",null,null,null," "]
[null,null,null,"-",null,"-",null,null,null," "]
[null,null,null,"-",null,"-",null,null,null," "]
[null,null,null,"-",null,"-",null,null,null," "]
[null,null,null,"-",null,"-",null,null,null," "]
[null,null,null,"-",null,"-",null,null,null," "]
[null,null,null,"-",null,"-",null,null,null," "]
[null,null,null,"-",null,"-",null,null,null," "]
[null,null,null,"-",null,"-",null,null,null," "]
[null,null,null,"-",null,"-",null,null,null," "]
[null,null,null,"-",null,"-",null,null,null," "]
[null,null,null,"-",null,"-",null,null,null," "]
[null,null,null,"-",null,"-",null,null,null," "]
[null,null,null,"-",null,"-",null,null,null," "]
[null,null,null,"-",null,"-",null,null,null," "]
[null,null,null,"-",null,"-",null,null,null," "]
[null,null,null,"-",null,"-",null,null,null," "]
[null,null,null,"-",null,"-",null,null,null," "]
[null,null,null,"-",null,"-",null,null,null," "]
[null,null,null,"-",null,"-",null,null,null," "]
[null,null,null,"-",null,"-",null,null,null," "]
[null,null,null,"-",null,"-",null,null,null," "]
[null,null,null,"-",null,"-",null,null,null," "]
[null,null,null,"-",null,"-",null,null,null," "]
[null,null,null,"-",null,"-",null,null,null," "]
[null,null,null,"-",null,"-",null,null,null," "]
[null,null,null,"-",null,"-",null,null,null," "]
[null,null,null,"-",null,"-",null,null,null," "]
[null,null,null,"-",null,"-",null,null,null," "]
[null,null,null,"-",null,"-",null,null,null," "]
[null,null,null,"-",null,"-",null,null,null," "]
[null,null,null,{"$f":"B238&\"-\"&C238","v":"-"},null,{"$f":"D238&E238","v":"-"},null,null,null," "]
[null,null,null,"-",null,"-",null,null,null," "]
[null,null,null,"-",null,"-",null,null,null," "]
[null,null,null,"-",null,"-",null,null,null," "]
[null,null,null,"-",null,"-",null,null,null," "]
[null,null,null,"-",null,"-",null,null,null," "]
[null,null,null,"-",null,"-",null,null,null," "]
[null,null,null,"-",null,"-",null,null,null," "]
[null,null,null,"-",null,"-",null,null,null," "]
[null,null,null,"-",null,"-",null,null,null," "]
[null,null,null,"-",null,"-",null,null,null," "]
[null,null,null,"-",null,"-",null,null,null," "]
[null,null,null,"-",null,"-",null,null,null," "]
[null,null,null,"-",null,"-",null,null,null," "]
[null,null,null,"-",null,"-",null,null,null," "]
[null,null,null,"-",null,"-",null,null,null," "]
[null,null,null,"-",null,"-",null,null,null," "]
[null,null,null,"-",null,"-",null,null,null," "]
[null,null,null,"-",null,"-",null,null,null," "]
[null,null,null,"-",null,"-",null,null,null," "]
[null,null,null,"-",null,"-",null,null,null," "]
[null,null,null,"-",null,"-",null,null,null," "]
[null,null,null,"-",null,"-",null,null,null," "]
[null,null,null,"-",null,"-",null,null,null," "]
[null,null,null,"-",null,"-",null,null,null,{"$f":"H262&\" \"&L262","v":" "}]
[null,null,null,"-",null,"-",null,null,null," "]
[null,null,null,"-",null,"-",null,null,null," "]
[null,null,null,"-",null,"-",null,null,null," "]
[null,null,null,"-",null,"-",null,null,null," "]
[null,null,null,"-",null,"-",null,null,null," "]
[null,null,null,"-",null,"-",null,null,null," "]
[null,null,null,"-",null,"-",null,null,null," "]
[null,null,null,"-",null,"-",null,null,null," "]
[null,null,null,"-",null,"-",null,null,null," "]
[null,null,null,"-",null,"-",null,null,null," "]
[null,null,null,"-",null,"-",null,null,null," "]
[null,null,null,"-",null,"-",null,null,null," "]
[null,null,null,"-",null,"-",null,null,null," "]
[null,null,null,"-",null,"-",null,null,null," "]
[null,null,null,"-",null,"-",null,null,null," "]
[null,null,null,"-",null,"-",null,null,null," "]
[null,null,null,"-",null,"-",null,null,null," "]
[null,null,null,"-",null,"-",null,null,null," "]
[null,null,null,"-",null,"-",null,null,null," "]
[null,null,null,"-",null,"-",null,null,null," "]
[null,null,null,"-",null,"-",null,null,null," "]
[null,null,null,"-",null,"-",null,null,null," "]
[null,null,null,"-",null,"-",null,null,null," "]
[null,null,null,"-",null,"-",null,null,null," "]
[null,null,null,"-",null,"-",null,null,null," "]
[null,null,null,"-",null,"-",null,null,null," "]
[null,null,null,"-",null,"-",null,null,null," "]
[null,null,null,"-",null,"-",null,null,null," "]
[null,null,null,"-",null,"-",null,null,null," "]
[null,null,null,"-",null,"-",null,null,null," "]
[null,null,null,"-",null,"-",null,null,null," "]
[null,null,null,"-",null,"-",null,null,null," "]
[null,null,null,"-",null,"-",null,null,null," "]
[null,null,null,"-",null,"-",null,null,null," "]
[null,null,null,"-",null,"-",null,null,null," "]
[null,null,null,"-",null,"-",null,null,null," "]
[null,null,null,"-",null,"-",null,null,null," "]
[null,null,null,"-",null,"-",null,null,null," "]
[null,null,null,"-",null,"-",null,null,null," "]
[null,null,null,{"$f":"B302&\"-\"&C302","v":"-"},null,{"$f":"D302&E302","v":"-"},null,null,null," "]
[null,null,null,"-",null,"-",null,null,null," "]
[null,null,null,"-",null,"-",null,null,null," "]
[null,null,null,"-",null,"-",null,null,null," "]
[null,null,null,"-",null,"-",null,null,null," "]
[null,null,null,"-",null,"-",null,null,null," "]
[null,null,null,"-",null,"-",null,null,null," "]
[null,null,null,"-",null,"-",null,null,null," "]
[null,null,null,"-",null,"-",null,null,null," "]
[null,null,null,"-",null,"-",null,null,null," "]
[null,null,null,"-",null,"-",null,null,null," "]
[null,null,null,"-",null,"-",null,null,null," "]
[null,null,null,"-",null,"-",null,null,null," "]
[null,null,null,"-",null,"-",null,null,null," "]
[null,null,null,"-",null,"-",null,null,null," "]
[null,null,null,"-",null,"-",null,null,null," "]
[null,null,null,"-",null,"-",null,null,null," "]
[null,null,null,"-",null,"-",null,null,null," "]
[null,null,null,"-",null,"-",null,null,null," "]
[null,null,null,"-",null,"-",null,null,null," "]
[null,null,null,"-",null,"-",null,null,null," "]
[null,null,null,"-",null,"-",null,null,null," "]
[null,null,null,"-",null,"-",null,null,null," "]
[null,null,null,"-",null,"-",null,null,null," "]
[null,null,null,"-",null,"-",null,null,null,{"$f":"H326&\" \"&L326","v":" "}]
[null,null,null,"-",null,"-",null,null,null," "]
[null,null,null,"-",null,"-",null,null,null," "]
[null,null,null,"-",null,"-",null,null,null," "]
[null,null,null,"-",null,"-",null,null,null," "]
[null,null,null,"-",null,"-",null,null,null," "]
[null,null,null,"-",null,"-",null,null,null," "]
[null,null,null,"-",null,"-",null,null,null," "]
[null,null,null,"-",null,"-",null,null,null," "]
[null,null,null,"-",null,"-",null,null,null," "]
[null,null,null,"-",null,"-",null,null,null," "]
[null,null,null,"-",null,"-",null,null,null," "]
[null,null,null,"-",null,"-",null,null,null," "]
[null,null,null,"-",null,"-",null,null,null," "]
[null,null,null,"-",null,"-",null,null,null," "]
[null,null,null,"-",null,"-",null,null,null," "]
[null,null,null,"-",null,"-",null,null,null," "]
[null,null,null,"-",null,"-",null,null,null," "]
[null,null,null,"-",null,"-",null,null,null," "]
[null,null,null,"-",null,"-",null,null,null," "]
[null,null,null,"-",null,"-",null,null,null," "]
[null,null,null,"-",null,"-",null,null,null," "]
[null,null,null,"-",null,"-",null,null,null," "]
[null,null,null,"-",null,"-",null,null,null," "]
[null,null,null,"-",null,"-",null,null,null," "]
[null,null,null,"-",null,"-",null,null,null," "]
[null,null,null,"-",null,"-",null,null,null," "]
[null,null,null,"-",null,"-",null,null,null," "]
[null,null,null,"-",null,"-",null,null,null," "]
[null,null,null,"-",null,"-",null,null,null," "]
[null,null,null,"-",null,"-",null,null,null," "]
[null,null,null,"-",null,"-",null,null,null," "]
[null,null,null,"-",null,"-",null,null,null," "]
[null,null,null,"-",null,"-",null,null,null," "]
[null,null,null,"-",null,"-",null,null,null," "]
[null,null,null,"-",null,"-",null,null,null," "]
[null,null,null,"-",null,"-",null,null,null," "]
[null,null,null,"-",null,"-",null,null,null," "]
[null,null,null,"-",null,"-",null,null,null," "]
[null,null,null,"-",null,"-",null,null,null," "]
[null,null,null,{"$f":"B366&\"-\"&C366","v":"-"},null,{"$f":"D366&E366","v":"-"},null,null,null," "]
[null,null,null,"-",null,"-",null,null,null," "]
[null,null,null,"-",null,"-",null,null,null," "]
[null,null,null,"-",null,"-",null,null,null," "]
[null,null,null,"-",null,"-",null,null,null," "]
[null,null,null,"-",null,"-",null,null,null," "]
[null,null,null,"-",null,"-",null,null,null," "]
[null,null,null,"-",null,"-",null,null,null," "]
[null,null,null,"-",null,"-",null,null,null," "]
[null,null,null,"-",null,"-",null,null,null," "]
[null,null,null,"-",null,"-",null,null,null," "]
[null,null,null,"-",null,"-",null,null,null," "]
[null,null,null,"-",null,"-",null,null,null," "]
[null,null,null,"-",null,"-",null,null,null," "]
[null,null,null,"-",null,"-",null,null,null," "]
[null,null,null,"-",null,"-",null,null,null," "]
[null,null,null,"-",null,"-",null,null,null," "]
[null,null,null,"-",null,"-",null,null,null," "]
[null,null,null,"-",null,"-",null,null,null," "]
[null,null,null,"-",null,"-",null,null,null," "]
[null,null,null,"-",null,"-",null,null,null," "]
[null,null,null,"-",null,"-",null,null,null," "]
[null,null,null,"-",null,"-",null,null,null," "]
[null,null,null,"-",null,"-",null,null,null," "]
[null,null,null,"-",null,"-",null,null,null,{"$f":"H390&\" \"&L390","v":" "}]
[null,null,null,"-",null,"-",null,null,null," "]
[null,null,null,"-",null,"-",null,null,null," "]
[null,null,null,"-",null,"-",null,null,null," "]
[null,null,null,"-",null,"-",null,null,null," "]
[null,null,null,"-",null,"-",null,null,null," "]
[null,null,null,"-",null,"-",null,null,null," "]
[null,null,null,"-",null,"-",null,null,null," "]
[null,null,null,"-",null,"-",null,null,null," "]
[null,null,null,"-",null,"-",null,null,null," "]
[null,null,null,"-",null,"-",null,null,null," "]
[null,null,null,"-",null,"-",null,null,null," "]
[null,null,null,"-",null,"-",null,null,null," "]
[null,null,null,"-",null,"-",null,null,null," "]
[null,null,null,"-",null,"-",null,null,null," "]
[null,null,null,"-",null,"-",null,null,null," "]
[null,null,null,"-",null,"-",null,null,null," "]
[null,null,null,"-",null,"-",null,null,null," "]
[null,null,null,"-",null,"-",null,null,null," "]
[null,null,null,"-",null,"-",null,null,null," "]
[null,null,null,"-",null,"-",null,null,null," "]
[null,null,null,"-",null,"-",null,null,null," "]
[null,null,null,"-",null,"-",null,null,null," "]
[null,null,null,"-",null,"-",null,null,null," "]
[null,null,null,"-",null,"-",null,null,null," "]
[null,null,null,"-",null,"-",null,null,null," "]
[null,null,null,"-",null,"-",null,null,null," "]
[null,null,null,"-",null,"-",null,null,null," "]
[null,null,null,"-",null,"-",null,null,null," "]
[null,null,null,"-",null,"-",null,null,null," "]
[null,null,null,"-",null,"-",null,null,null," "]
[null,null,null,"-",null,"-",null,null,null," "]
[null,null,null,"-",null,"-",null,null,null," "]
[null,null,null,"-",null,"-",null,null,null," "]
[null,null,null,"-",null,"-",null,null,null," "]
[null,null,null,"-",null,"-",null,null,null," "]
[null,null,null,"-",null,"-",null,null,null," "]
[null,null,null,"-",null,"-",null,null,null," "]
[null,null,null,"-",null,"-",null,null,null," "]
[null,null,null,"-",null,"-",null,null,null," "]
[null,null,null,{"$f":"B430&\"-\"&C430","v":"-"},null,{"$f":"D430&E430","v":"-"},null,null,null," "]
[null,null,null,"-",null,"-",null,null,null," "]
[null,null,null,"-",null,"-",null,null,null," "]
[null,null,null,"-",null,"-",null,null,null," "]
[null,null,null,"-",null,"-",null,null,null," "]
[null,null,null,"-",null,"-",null,null,null," "]
[null,null,null,"-",null,"-",null,null,null," "]
[null,null,null,"-",null,"-",null,null,null," "]
[null,null,null,"-",null,"-",null,null,null," "]
[null,null,null,"-",null,"-",null,null,null," "]
[null,null,null,"-",null,"-",null,null,null," "]
[null,null,null,"-",null,"-",null,null,null," "]
[null,null,null,"-",null,"-",null,null,null," "]
[null,null,null,"-",null,"-",null,null,null," "]
[null,null,null,"-",null,"-",null,null,null," "]
[null,null,null,"-",null,"-",null,null,null," "]
[null,null,null,"-",null,"-",null,null,null," "]
[null,null,null,"-",null,"-",null,null,null," "]
[null,null,null,"-",null,"-",null,null,null," "]
[null,null,null,"-",null,"-",null,null,null," "]
[null,null,null,"-",null,"-",null,null,null," "]
[null,null,null,"-",null,"-",null,null,null," "]
[null,null,null,"-",null,"-",null,null,null," "]
[null,null,null,"-",null,"-",null,null,null," "]
[null,null,null,"-",null,"-",null,null,null,{"$f":"H454&\" \"&L454","v":" "}]
[null,null,null,"-",null,"-",null,null,null," "]
[null,null,null,"-",null,"-",null,null,null," "]
[null,null,null,"-",null,"-",null,null,null," "]
[null,null,null,"-",null,"-",null,null,null," "]
[null,null,null,"-",null,"-",null,null,null," "]
[null,null,null,"-",null,"-",null,null,null," "]
[null,null,null,"-",null,"-",null,null,null," "]
[null,null,null,"-",null,"-",null,null,null," "]
[null,null,null,"-",null,"-",null,null,null," "]
[null,null,null,"-",null,"-",null,null,null," "]
[null,null,null,"-",null,"-",null,null,null," "]
[null,null,null,"-",null,"-",null,null,null," "]
[null,null,null,"-",null,"-",null,null,null," "]
[null,null,null,"-",null,"-",null,null,null," "]
[null,null,null,"-",null,"-",null,null,null," "]
[null,null,null,"-",null,"-",null,null,null," "]
[null,null,null,"-",null,"-",null,null,null," "]
[null,null,null,"-",null,"-",null,null,null," "]
[null,null,null,"-",null,"-",null,null,null," "]
[null,null,null,"-",null,"-",null,null,null," "]
[null,null,null,"-",null,"-",null,null,null," "]
[null,null,null,"-",null,"-",null,null,null," "]
[null,null,null,"-",null,"-",null,null,null," "]
[null,null,null,"-",null,"-",null,null,null," "]
[null,null,null,"-",null,"-",null,null,null," "]
[null,null,null,"-",null,"-",null,null,null," "]
[null,null,null,"-",null,"-",null,null,null," "]
[null,null,null,"-",null,"-",null,null,null," "]
[null,null,null,"-",null,"-",null,null,null," "]
[null,null,null,"-",null,"-",null,null,null," "]
[null,null,null,"-",null,"-",null,null,null," "]
[null,null,null,"-",null,"-",null,null,null," "]
[null,null,null,"-",null,"-",null,null,null," "]
[null,null,null,"-",null,"-",null,null,null," "]
[null,null,null,"-",null,"-",null,null,null," "]
[null,null,null,"-",null,"-",null,null,null," "]
[null,null,null,"-",null,"-",null,null,null," "]
[null,null,null,"-",null,"-",null,null,null," "]
[null,null,null,"-",null,"-",null,null,null," "]
[null,null,null,{"$f":"B494&\"-\"&C494","v":"-"},null,{"$f":"D494&E494","v":"-"},null,null,null," "]
[null,null,null,"-",null,"-",null,null,null," "]
[null,null,null,"-",null,"-",null,null,null," "]
[null,null,null,"-",null,"-",null,null,null," "]
[null,null,null,"-",null,"-",null,null,null," "]
[null,null,null,"-",null,"-",null,null,null," "]
[null,null,null,"-",null,"-",null,null,null," "]
[null,null,null,"-",null,"-",null,null,null," "]
[null,null,null,"-",null,"-",null,null,null," "]
[null,null,null,"-",null,"-",null,null,null," "]
[null,null,null,"-",null,"-",null,null,null," "]
[null,null,null,"-",null,"-",null,null,null," "]
[null,null,null,"-",null,"-",null,null,null," "]
[null,null,null,"-",null,"-",null,null,null," "]
[null,null,null,"-",null,"-",null,null,null," "]
[null,null,null,"-",null,"-",null,null,null," "]
[null,null,null,"-",null,"-",null,null,null," "]
[null,null,null,"-",null,"-",null,null,null," "]
[null,null,null,"-",null,"-",null,null,null," "]
[null,null,null,"-",null,"-",null,null,null," "]
[null,null,null,"-",null,"-",null,null,null," "]
[null,null,null,"-",null,"-",null,null,null," "]
[null,null,null,"-",null,"-",null,null,null," "]
[null,null,null,"-",null,"-",null,null,null," "]
[null,null,null,"-",null,"-",null,null,null,{"$f":"H518&\" \"&L518","v":" "}]
[null,null,null,"-",null,"-",null,null,null," "]
[null,null,null,"-",null,"-",null,null,null," "]
[null,null,null,"-",null,"-",null,null,null," "]
[null,null,null,"-",null,"-",null,null,null," "]
[null,null,null,"-",null,"-",null,null,null," "]
[null,null,null,"-",null,"-",null,null,null," "]
[null,null,null,"-",null,"-",null,null,null," "]
[null,null,null,"-",null,"-",null,null,null," "]
[null,null,null,"-",null,"-",null,null,null," "]
[null,null,null,"-",null,"-",null,null,null," "]
[null,null,null,"-",null,"-",null,null,null," "]
[null,null,null,"-",null,"-",null,null,null," "]
[null,null,null,"-",null,"-",null,null,null," "]
[null,null,null,"-",null,"-",null,null,null," "]
[null,null,null,"-",null,"-",null,null,null," "]
[null,null,null,"-",null,"-",null,null,null," "]
[null,null,null,"-",null,"-",null,null,null," "]
[null,null,null,"-",null,"-",null,null,null," "]
[null,null,null,"-",null,"-",null,null,null," "]
[null,null,null,"-",null,"-",null,null,null," "]
[null,null,null,"-",null,"-",null,null,null," "]
[null,null,null,"-",null,"-",null,null,null," "]
[null,null,null,"-",null,"-",null,null,null," "]
[null,null,null,"-",null,"-",null,null,null," "]
[null,null,null,"-",null,"-",null,null,null," "]
[null,null,null,"-",null,"-",null,null,null," "]
[null,null,null,"-",null,"-",null,null,null," "]
[null,null,null,"-",null,"-",null,null,null," "]
[null,null,null,"-",null,"-",null,null,null," "]
[null,null,null,"-",null,"-",null,null,null," "]
[null,null,null,"-",null,"-",null,null,null," "]
[null,null,null,"-",null,"-",null,null,null," "]
[null,null,null,"-",null,"-",null,null,null," "]
[null,null,null,"-",null,"-",null,null,null," "]
[null,null,null,"-",null,"-",null,null,null," "]
[null,null,null,"-",null,"-",null,null,null," "]
[null,null,null,"-",null,"-",null,null,null," "]
[null,null,null,"-",null,"-",null,null,null," "]
[null,null,null,"-",null,"-",null,null,null," "]
[null,null,null,{"$f":"B558&\"-\"&C558","v":"-"},null,{"$f":"D558&E558","v":"-"},null,null,null," "]
[null,null,null,"-",null,"-",null,null,null," "]
[null,null,null,"-",null,"-",null,null,null," "]
[null,null,null,"-",null,"-",null,null,null," "]
[null,null,null,"-",null,"-",null,null,null," "]
[null,null,null,"-",null,"-",null,null,null," "]
[null,null,null,"-",null,"-",null,null,null," "]
[null,null,null,"-",null,"-",null,null,null," "]
[null,null,null,"-",null,"-",null,null,null," "]
[null,null,null,"-",null,"-",null,null,null," "]
[null,null,null,"-",null,"-",null,null,null," "]
[null,null,null,"-",null,"-",null,null,null," "]
[null,null,null,"-",null,"-",null,null,null," "]
[null,null,null,"-",null,"-",null,null,null," "]
[null,null,null,"-",null,"-",null,null,null," "]
[null,null,null,"-",null,"-",null,null,null," "]
[null,null,null,"-",null,"-",null,null,null," "]
[null,null,null,"-",null,"-",null,null,null," "]
[null,null,null,"-",null,"-",null,null,null," "]
[null,null,null,"-",null,"-",null,null,null," "]
[null,null,null,"-",null,"-",null,null,null," "]
[null,null,null,"-",null,"-",null,null,null," "]
[null,null,null,"-",null,"-",null,null,null," "]
[null,null,null,"-",null,"-",null,null,null," "]
[null,null,null,"-",null,"-",null,null,null,{"$f":"H582&\" \"&L582","v":" "}]
[null,null,null,"-",null,"-",null,null,null," "]
[null,null,null,"-",null,"-",null,null,null," "]
[null,null,null,"-",null,"-",null,null,null," "]
[null,null,null,"-",null,"-",null,null,null," "]
[null,null,null,"-",null,"-",null,null,null," "]
[null,null,null,"-",null,"-",null,null,null," "]
[null,null,null,"-",null,"-",null,null,null," "]
[null,null,null,"-",null,"-",null,null,null," "]
[null,null,null,"-",null,"-",null,null,null," "]
[null,null,null,"-",null,"-",null,null,null," "]
[null,null,null,"-",null,"-",null,null,null," "]
[null,null,null,"-",null,"-",null,null,null," "]
[null,null,null,"-",null,"-",null,null,null," "]
[null,null,null,"-",null,"-",null,null,null," "]
[null,null,null,"-",null,"-",null,null,null," "]
[null,null,null,"-",null,"-",null,null,null," "]
[null,null,null,"-",null,"-",null,null,null," "]
[null,null,null,"-",null,"-",null,null,null," "]
[null,null,null,"-",null,"-",null,null,null," "]
[null,null,null,"-",null,"-",null,null,null," "]
[null,null,null,"-",null,"-",null,null,null," "]
[null,null,null,"-",null,"-",null,null,null," "]
[null,null,null,"-",null,"-",null,null,null," "]
[null,null,null,"-",null,"-",null,null,null," "]
[null,null,null,"-",null,"-",null,null,null," "]
[null,null,null,"-",null,"-",null,null,null," "]
[null,null,null,"-",null,"-",null,null,null," "]
[null,null,null,"-",null,"-",null,null,null," "]
[null,null,null,"-",null,"-",null,null,null," "]
[null,null,null,"-",null,"-",null,null,null," "]
[null,null,null,"-",null,"-",null,null,null," "]
[null,null,null,"-",null,"-",null,null,null," "]
[null,null,null,"-",null,"-",null,null,null," "]
[null,null,null,"-",null,"-",null,null,null," "]
[null,null,null,"-",null,"-",null,null,null," "]
[null,null,null,"-",null,"-",null,null,null," "]
[null,null,null,"-",null,"-",null,null,null," "]
[null,null,null,"-",null,"-",null,null,null," "]
[null,null,null,"-",null,"-",null,null,null," "]
[null,null,null,{"$f":"B622&\"-\"&C622","v":"-"},null,{"$f":"D622&E622","v":"-"},null,null,null," "]
[null,null,null,"-",null,"-",null,null,null," "]
[null,null,null,"-",null,"-",null,null,null," "]
[null,null,null,"-",null,"-",null,null,null," "]
[null,null,null,"-",null,"-",null,null,null," "]
[null,null,null,"-",null,"-",null,null,null," "]
[null,null,null,"-",null,"-",null,null,null," "]
[null,null,null,"-",null,"-",null,null,null," "]
[null,null,null,"-",null,"-",null,null,null," "]
[null,null,null,"-",null,"-",null,null,null," "]
[null,null,null,"-",null,"-",null,null,null," "]
[null,null,null,"-",null,"-",null,null,null," "]
[null,null,null,"-",null,"-",null,null,null," "]
[null,null,null,"-",null,"-",null,null,null," "]
[null,null,null,"-",null,"-",null,null,null," "]
[null,null,null,"-",null,"-",null,null,null," "]
[null,null,null,"-",null,"-",null,null,null," "]
[null,null,null,"-",null,"-",null,null,null," "]
[null,null,null,"-",null,"-",null,null,null," "]
[null,null,null,"-",null,"-",null,null,null," "]
[null,null,null,"-",null,"-",null,null,null," "]
[null,null,null,"-",null,"-",null,null,null," "]
[null,null,null,"-",null,"-",null,null,null," "]
[null,null,null,"-",null,"-",null,null,null," "]
[null,null,null,"-",null,"-",null,null,null,{"$f":"H646&\" \"&L646","v":" "}]
[null,null,null,"-",null,"-",null,null,null," "]
[null,null,null,"-",null,"-",null,null,null," "]
[null,null,null,"-",null,"-",null,null,null," "]
[null,null,null,"-",null,"-",null,null,null," "]
[null,null,null,"-",null,"-",null,null,null," "]
[null,null,null,"-",null,"-",null,null,null," "]
[null,null,null,"-",null,"-",null,null,null," "]
[null,null,null,"-",null,"-",null,null,null," "]
[null,null,null,"-",null,"-",null,null,null," "]
[null,null,null,"-",null,"-",null,null,null," "]
[null,null,null,"-",null,"-",null,null,null," "]
[null,null,null,"-",null,"-",null,null,null," "]
[null,null,null,"-",null,"-",null,null,null," "]
[null,null,null,"-",null,"-",null,null,null," "]
[null,null,null,"-",null,"-",null,null,null," "]
[null,null,null,"-",null,"-",null,null,null," "]
[null,null,null,"-",null,"-",null,null,null," "]
[null,null,null,"-",null,"-",null,null,null," "]
[null,null,null,"-",null,"-",null,null,null," "]
[null,null,null,"-",null,"-",null,null,null," "]
[null,null,null,"-",null,"-",null,null,null," "]
[null,null,null,"-",null,"-",null,null,null," "]
[null,null,null,"-",null,"-",null,null,null," "]
[null,null,null,"-",null,"-",null,null,null," "]
[null,null,null,"-",null,"-",null,null,null," "]
[null,null,null,"-",null,"-",null,null,null," "]
[null,null,null,"-",null,"-",null,null,null," "]
[null,null,null,"-",null,"-",null,null,null," "]
[null,null,null,"-",null,"-",null,null,null," "]
[null,null,null,"-",null,"-",null,null,null," "]
[null,null,null,"-",null,"-",null,null,null," "]
[null,null,null,"-",null,"-",null,null,null," "]
[null,null,null,"-",null,"-",null,null,null," "]
[null,null,null,"-",null,"-",null,null,null," "]
[null,null,null,"-",null,"-",null,null,null," "]
[null,null,null,"-",null,"-",null,null,null," "]
[null,null,null,"-",null,"-",null,null,null," "]
[null,null,null,"-",null,"-",null,null,null," "]
[null,null,null,"-",null,"-",null,null,null," "]
[null,null,null,{"$f":"B686&\"-\"&C686","v":"-"},null,{"$f":"D686&E686","v":"-"},null,null,null," "]
[null,null,null,"-",null,"-",null,null,null," "]
[null,null,null,"-",null,"-",null,null,null," "]
[null,null,null,"-",null,"-",null,null,null," "]
[null,null,null,"-",null,"-",null,null,null," "]
[null,null,null,"-",null,"-",null,null,null," "]
[null,null,null,"-",null,"-",null,null,null," "]
[null,null,null,"-",null,"-",null,null,null," "]
[null,null,null,"-",null,"-",null,null,null," "]
[null,null,null,"-",null,"-",null,null,null," "]
[null,null,null,"-",null,"-",null,null,null," "]
[null,null,null,"-",null,"-",null,null,null," "]
[null,null,null,"-",null,"-",null,null,null," "]
[null,null,null,"-",null,"-",null,null,null," "]
[null,null,null,"-",null,"-",null,null,null," "]
[null,null,null,"-",null,"-",null,null,null," "]
[null,null,null,"-",null,"-",null,null,null," "]
[null,null,null,"-",null,"-",null,null,null," "]
[null,null,null,"-",null,"-",null,null,null," "]
[null,null,null,"-",null,"-",null,null,null," "]
[null,null,null,"-",null,"-",null,null,null," "]
[null,null,null,"-",null,"-",null,null,null," "]
[null,null,null,"-",null,"-",null,null,null," "]
[null,null,null,"-",null,"-",null,null,null," "]
[null,null,null,"-",null,"-",null,null,null,{"$f":"H710&\" \"&L710","v":" "}]
[null,null,null,"-",null,"-",null,null,null," "]
[null,null,null,"-",null,"-",null,null,null," "]
[null,null,null,"-",null,"-",null,null,null," "]
[null,null,null,"-",null,"-",null,null,null," "]
[null,null,null,"-",null,"-",null,null,null," "]
[null,null,null,"-",null,"-",null,null,null," "]
[null,null,null,"-",null,"-",null,null,null," "]
[null,null,null,"-",null,"-",null,null,null," "]
[null,null,null,"-",null,"-",null,null,null," "]
[null,null,null,"-",null,"-",null,null,null," "]
[null,null,null,"-",null,"-",null,null,null," "]
[null,null,null,"-",null,"-",null,null,null," "]
[null,null,null,"-",null,"-",null,null,null," "]
[null,null,null,"-",null,"-",null,null,null," "]
[null,null,null,"-",null,"-",null,null,null," "]
[null,null,null,"-",null,"-",null,null,null," "]
[null,null,null,"-",null,"-",null,null,null," "]
[null,null,null,"-",null,"-",null,null,null," "]
[null,null,null,"-",null,"-",null,null,null," "]
[null,null,null,"-",null,"-",null,null,null," "]
[null,null,null,"-",null,"-",null,null,null," "]
[null,null,null,"-",null,"-",null,null,null," "]
[null,null,null,"-",null,"-",null,null,null," "]
[null,null,null,"-",null,"-",null,null,null," "]
[null,null,null,"-",null,"-",null,null,null," "]
[null,null,null,"-",null,"-",null,null,null," "]
[null,null,null,"-",null,"-",null,null,null," "]
[null,null,null,"-",null,"-",null,null,null," "]
[null,null,null,"-",null,"-",null,null,null," "]
[null,null,null,"-",null,"-",null,null,null," "]
[null,null,null,"-",null,"-",null,null,null," "]
[null,null,null,"-",null,"-",null,null,null," "]
[null,null,null,"-",null,"-",null,null,null," "]
[null,null,null,"-",null,"-",null,null,null," "]
[null,null,null,"-",null,"-",null,null,null," "]
[null,null,null,"-",null,"-",null,null,null," "]
[null,null,null,"-",null,"-",null,null,null," "]
[null,null,null,"-",null,"-",null,null,null," "]
[null,null,null,"-",null,"-",null,null,null," "]
[null,null,null,{"$f":"B750&\"-\"&C750","v":"-"},null,{"$f":"D750&E750","v":"-"},null,null,null," "]
[null,null,null,"-",null,"-",null,null,null," "]
[null,null,null,"-",null,"-",null,null,null," "]
[null,null,null,"-",null,"-",null,null,null," "]
[null,null,null,"-",null,"-",null,null,null," "]
[null,null,null,"-",null,"-",null,null,null," "]
[null,null,null,"-",null,"-",null,null,null," "]
[null,null,null,"-",null,"-",null,null,null," "]
[null,null,null,"-",null,"-",null,null,null," "]
[null,null,null,"-",null,"-",null,null,null," "]
[null,null,null,"-",null,"-",null,null,null," "]
[null,null,null,"-",null,"-",null,null,null," "]
[null,null,null,"-",null,"-",null,null,null," "]
[null,null,null,"-",null,"-",null,null,null," "]
[null,null,null,"-",null,"-",null,null,null," "]
[null,null,null,"-",null,"-",null,null,null," "]
[null,null,null,"-",null,"-",null,null,null," "]
[null,null,null,"-",null,"-",null,null,null," "]
[null,null,null,"-",null,"-",null,null,null," "]
[null,null,null,"-",null,"-",null,null,null," "]
[null,null,null,"-",null,"-",null,null,null," "]
[null,null,null,"-",null,"-",null,null,null," "]
[null,null,null,"-",null,"-",null,null,null," "]
[null,null,null,"-",null,"-",null,null,null," "]
[null,null,null,"-",null,"-",null,null,null,{"$f":"H774&\" \"&L774","v":" "}]
[null,null,null,"-",null,"-",null,null,null," "]
[null,null,null,"-",null,"-",null,null,null," "]
[null,null,null,"-",null,"-",null,null,null," "]
[null,null,null,"-",null,"-",null,null,null," "]
[null,null,null,"-",null,"-",null,null,null," "]
[null,null,null,"-",null,"-",null,null,null," "]
[null,null,null,"-",null,"-",null,null,null," "]
[null,null,null,"-",null,"-",null,null,null," "]
[null,null,null,"-",null,"-",null,null,null," "]
[null,null,null,"-",null,"-",null,null,null," "]
[null,null,null,"-",null,"-",null,null,null," "]
[null,null,null,"-",null,"-",null,null,null," "]
[null,null,null,"-",null,"-",null,null,null," "]
[null,null,null,"-",null,"-",null,null,null," "]
[null,null,null,"-",null,"-",null,null,null," "]
[null,null,null,"-",null,"-",null,null,null," "]
[null,null,null,"-",null,"-",null,null,null," "]
[null,null,null,"-",null,"-",null,null,null," "]
[null,null,null,"-",null,"-",null,null,null," "]
[null,null,null,"-",null,"-",null,null,null," "]
[null,null,null,"-",null,"-",null,null,null," "]
[null,null,null,"-",null,"-",null,null,null," "]
[null,null,null,"-",null,"-",null,null,null," "]
[null,null,null,"-",null,"-",null,null,null," "]
[null,null,null,"-",null,"-",null,null,null," "]
[null,null,null,"-",null,"-",null,null,null," "]
[null,null,null,"-",null,"-",null,null,null," "]
[null,null,null,"-",null,"-",null,null,null," "]
[null,null,null,"-",null,"-",null,null,null," "]
[null,null,null,"-",null,"-",null,null,null," "]
[null,null,null,"-",null,"-",null,null,null," "]
[null,null,null,"-",null,"-",null,null,null," "]
[null,null,null,"-",null,"-",null,null,null," "]
[null,null,null,"-",null,"-",null,null,null," "]
[null,null,null,"-",null,"-",null,null,null," "]
[null,null,null,"-",null,"-",null,null,null," "]
[null,null,null,"-",null,"-",null,null,null," "]
[null,null,null,"-",null,"-",null,null,null," "]
[null,null,null,"-",null,"-",null,null,null," "]
[null,null,null,{"$f":"B814&\"-\"&C814","v":"-"},null,{"$f":"D814&E814","v":"-"},null,null,null," "]
[null,null,null,"-",null,"-",null,null,null," "]
[null,null,null,"-",null,"-",null,null,null," "]
[null,null,null,"-",null,"-",null,null,null," "]
[null,null,null,"-",null,"-",null,null,null," "]
[null,null,null,"-",null,"-",null,null,null," "]
[null,null,null,"-",null,"-",null,null,null," "]
[null,null,null,"-",null,"-",null,null,null," "]
[null,null,null,"-",null,"-",null,null,null," "]
[null,null,null,"-",null,"-",null,null,null," "]
[null,null,null,"-",null,"-",null,null,null," "]
[null,null,null,"-",null,"-",null,null,null," "]
[null,null,null,"-",null,"-",null,null,null," "]
[null,null,null,"-",null,"-",null,null,null," "]
[null,null,null,"-",null,"-",null,null,null," "]
[null,null,null,"-",null,"-",null,null,null," "]
[null,null,null,"-",null,"-",null,null,null," "]
[null,null,null,"-",null,"-",null,null,null," "]
[null,null,null,"-",null,"-",null,null,null," "]
[null,null,null,"-",null,"-",null,null,null," "]
[null,null,null,"-",null,"-",null,null,null," "]
[null,null,null,"-",null,"-",null,null,null," "]
[null,null,null,"-",null,"-",null,null,null," "]
[null,null,null,"-",null,"-",null,null,null," "]
[null,null,null,"-",null,"-",null,null,null,{"$f":"H838&\" \"&L838","v":" "}]
[null,null,null,"-",null,"-",null,null,null," "]
[null,null,null,"-",null,"-",null,null,null," "]
[null,null,null,"-",null,"-",null,null,null," "]
[null,null,null,"-",null,"-",null,null,null," "]
[null,null,null,"-",null,"-",null,null,null," "]
[null,null,null,"-",null,"-",null,null,null," "]
[null,null,null,"-",null,"-",null,null,null," "]
[null,null,null,"-",null,"-",null,null,null," "]
[null,null,null,"-",null,"-",null,null,null," "]
[null,null,null,"-",null,"-",null,null,null," "]
[null,null,null,"-",null,"-",null,null,null," "]
[null,null,null,"-",null,"-",null,null,null," "]
[null,null,null,"-",null,"-",null,null,null," "]
[null,null,null,"-",null,"-",null,null,null," "]
[null,null,null,"-",null,"-",null,null,null," "]
[null,null,null,"-",null,"-",null,null,null," "]
[null,null,null,"-",null,"-",null,null,null," "]
[null,null,null,"-",null,"-",null,null,null," "]
[null,null,null,"-",null,"-",null,null,null," "]
[null,null,null,"-",null,"-",null,null,null," "]
[null,null,null,"-",null,"-",null,null,null," "]
[null,null,null,"-",null,"-",null,null,null," "]
[null,null,null,"-",null,"-",null,null,null," "]
[null,null,null,"-",null,"-",null,null,null," "]
[null,null,null,"-",null,"-",null,null,null," "]
[null,null,null,"-",null,"-",null,null,null," "]
[null,null,null,"-",null,"-",null,null,null," "]
[null,null,null,"-",null,"-",null,null,null," "]
[null,null,null,"-",null,"-",null,null,null," "]
[null,null,null,"-",null,"-",null,null,null," "]
[null,null,null,"-",null,"-",null,null,null," "]
[null,null,null,"-",null,"-",null,null,null," "]
[null,null,null,"-",null,"-",null,null,null," "]
[null,null,null,"-",null,"-",null,null,null," "]
[null,null,null,"-",null,"-",null,null,null," "]
[null,null,null,"-",null,"-",null,null,null," "]
[null,null,null,"-",null,"-",null,null,null," "]
[null,null,null,"-",null,"-",null,null,null," "]
[null,null,null,"-",null,"-",null,null,null," "]
[null,null,null,{"$f":"B878&\"-\"&C878","v":"-"},null,{"$f":"D878&E878","v":"-"},null,null,null," "]
[null,null,null,"-",null,"-",null,null,null," "]
[null,null,null,"-",null,"-",null,null,null," "]
[null,null,null,"-",null,"-",null,null,null," "]
[null,null,null,"-",null,"-",null,null,null," "]
[null,null,null,"-",null,"-",null,null,null," "]
[null,null,null,"-",null,"-",null,null,null," "]
[null,null,null,"-",null,"-",null,null,null," "]
[null,null,null,"-",null,"-",null,null,null," "]
[null,null,null,"-",null,"-",null,null,null," "]
[null,null,null,"-",null,"-",null,null,null," "]
[null,null,null,"-",null,"-",null,null,null," "]
[null,null,null,"-",null,"-",null,null,null," "]
[null,null,null,"-",null,"-",null,null,null," "]
[null,null,null,"-",null,"-",null,null,null," "]
[null,null,null,"-",null,"-",null,null,null," "]
[null,null,null,"-",null,"-",null,null,null," "]
[null,null,null,"-",null,"-",null,null,null," "]
[null,null,null,"-",null,"-",null,null,null," "]
[null,null,null,"-",null,"-",null,null,null," "]
[null,null,null,"-",null,"-",null,null,null," "]
[null,null,null,"-",null,"-",null,null,null," "]
[null,null,null,"-",null,"-",null,null,null," "]
[null,null,null,"-",null,"-",null,null,null," "]
[null,null,null,"-",null,"-",null,null,null,{"$f":"H902&\" \"&L902","v":" "}]
[null,null,null,"-",null,"-",null,null,null," "]
[null,null,null,"-",null,"-",null,null,null," "]
[null,null,null,"-",null,"-",null,null,null," "]
[null,null,null,"-",null,"-",null,null,null," "]
[null,null,null,"-",null,"-",null,null,null," "]
[null,null,null,"-",null,"-",null,null,null," "]
[null,null,null,"-",null,"-",null,null,null," "]
[null,null,null,"-",null,"-",null,null,null," "]
[null,null,null,"-",null,"-",null,null,null," "]
[null,null,null,"-",null,"-",null,null,null," "]
[null,null,null,"-",null,"-",null,null,null," "]
[null,null,null,"-",null,"-",null,null,null," "]
[null,null,null,"-",null,"-",null,null,null," "]
[null,null,null,"-",null,"-",null,null,null," "]
[null,null,null,"-",null,"-",null,null,null," "]
[null,null,null,"-",null,"-",null,null,null," "]
[null,null,null,"-",null,"-",null,null,null," "]
[null,null,null,"-",null,"-",null,null,null," "]
[null,null,null,"-",null,"-",null,null,null," "]
[null,null,null,"-",null,"-",null,null,null," "]
[null,null,null,"-",null,"-",null,null,null," "]
[null,null,null,"-",null,"-",null,null,null," "]
[null,null,null,"-",null,"-",null,null,null," "]
[null,null,null,"-",null,"-",null,null,null," "]
[null,null,null,"-",null,"-",null,null,null," "]
[null,null,null,"-",null,"-",null,null,null," "]
[null,null,null,"-",null,"-",null,null,null," "]
[null,null,null,"-",null,"-",null,null,null," "]
[null,null,null,{"$f":"B931&\"-\"&C931","v":"-"},null,null,null,null,null," "]
[null,null,null,"-",null,null,null,null,null," "]
[null,null,null,"-",null,null,null,null,null," "]
[null,null,null,"-",null,null,null,null,null," "]
[null,null,null,"-",null,null,null,null,null,{"$f":"CONCATENATE(H935,\" \",I935)","v":" "}]
[null,null,null,"-",null,null,null,null,null," "]
[null,null,null,{"$f":"CONCATENATE(B937,\"-\",C937)","v":"-"}]
[null,null,null,{"$f":"CONCATENATE(B938,\"-\",C938)","v":"-"}]
[]
[]
[null,null,null,null,null,{"$f":"CONCATENATE(B941,\"-\",C941,\"-\",E941)","v":"--"}]
[null,null,null,null,null,{"$f":"CONCATENATE(B942,\"-\",C942,\"-\",E942)","v":"--"}]
[null,null,null,null,null,{"$f":"CONCATENATE(B943,\"-\",C943,\"-\",E943)","v":"--"}]
[null,null,null,null,null,{"$f":"CONCATENATE(B944,\"-\",C944,\"-\",E944)","v":"--"}]

{"sheet":"Lifting","index":5,"n_rows":12,"n_cols":83,"rows_kept":12,"cut":false,"hidden":false,"merged":[[4,4,4,5],[5,2,5,3],[5,4,5,5],[0,7,2,7],[9,35,9,37],[9,47,9,49],[2,2,2,3],[0,0,0,5],[1,3,1,4],[2,0,2,1],[1,0,1,2],[3,0,3,1],[4,0,4,1],[5,0,5,1],[3,2,3,3],[3,4,3,5],[4,2,4,3]]}
["大澤　充",null,null,null,null,null,null,null,null,null,null,null,null,null,null,null,null,null,null,null,null,null,null,null,null,null,null,null,null,null,null,null,null,null,null,"F-","WE",null,"Best BP","BP","B"]
[{"$f":"IFERROR(VLOOKUP(INDIRECT(ADDRESS(MATCH(A1,INDIRECT(CONCATENATE(\"B12:B50\")),0)+11,4)),Setup!I1:J199,2,FALSE),\"-\")","v":"-"},null,null,{"$f":"INDIRECT(CONCATENATE(\"F\",MATCH(A1,B:B,0)))","v":{"$error":"#N/A"}},null,{"$f":"CONCATENATE(RIGHT(E11,2),\" Cls\")","v":"kg Cls"},null,null,null,null,null,null,null,null,null,null,null,null,null,null,null,null,null,null,null,null,null,null,null,null,null,null,null,null,null,"FR","WC",null,"Best DL","DL","D"]
["Deadlift 1",null,{"$f":"Lists!B36","v":{"$error":"#N/A"}},null,{"$f":"Setup!G15","v":"Kg"},{"$f":"IF(E3=\"Kg\",C3*2.2046,C3/2.2046)","v":{"$error":"#N/A"}},{"$f":"IF(E3=\"Kg\",\"Lb\",\"Kg\")","v":"Lb"},null,null,null,null,null,null,null,null,null,null,null,null,null,null,null,null,null,null,null,null,null,null,null,null,null,null,null,null,"M-","ME",null,"Best SQ","SQ","S"]
[{"$f":"VLOOKUP(INDIRECT(ADDRESS(MATCH(A1,INDIRECT(CONCATENATE(\"B12:B50\")),0)+11,4)),Setup!I5:J92,2,FALSE)","v":{"$error":"#N/A"}},null,"Event",null,{"$f":"IF(Setup!B9=\"Powerlifting (3 lift meet)\",\"PL Total\",\"\")","v":"PL Total"},null,null,null,null,null,null,null,null,null,null,null,null,null,null,null,null,null,null,null,null,null,null,null,null,null,null,null,null,null,null,"MR","MC",null,"PL Total","PL","P"]
["Open",null,{"$f":"IFERROR(Lists!F51,10000)","v":""},null,{"$f":"IF(OR(E4=\"\",LEFT(A3,1)=\"S\",LEFT(A3,1)=\"B\"),10000,IFERROR(Lists!F53,10000))","v":""},null,null,null,null,null,null,null,null,null,null,null,null,null,null,null,null,null,null,null,null,null,null,null,null,null,null,null,null,null,null,null,null,null,"PP Total","PP"]
[{"$f":"IFERROR(IF(INDIRECT(ADDRESS(MATCH(A1,INDIRECT(CONCATENATE(\"B12:B40\")),0)+11,9))=\"\",\"O\",VLOOKUP(INDIRECT(ADDRESS(MATCH(A1,INDIRECT(CONCATENATE(\"B12:B40\")),0)+11,45)),DATA!E35:F53,2)),\"\")","v":""},null,{"$f":"IFERROR(IF(A6=\"O\",10000,Lists!E51),10000)","v":""},null,{"$f":"IF(OR(E4=\"\",LEFT(A3,1)=\"S\",LEFT(A3,1)=\"B\"),10000,IFERROR(IF(A6=\"O\",10000,Lists!E53),10000))","v":""},null,null,null,null,null,null,null,null,null,null,null,null,null,null,null,null,null,null,null,null,null,null,null,null,null,null,null,null,null,null,null,null,null,"DQ","DQ"]
[null,"Current Status","Good","NoLift","Next","Auto",1,null,null,null,null,null,null,null,null,null,null,null,null,null,null,null,null,null,null,null,null,null,null,null,null,null,null,null,null,null,null,null,"Drug Test","DT",null,null,null,"2019-07-22",null,null,null,null,null,null,null,null,null,null,null,null,null,null,null,null,null,null,null,null,null,null,"div","cls"]
[null,null,{"$f":"CONCATENATE(\"Setup!Q5:Q\",COUNTA(Setup!Q:Q)+4)","v":"Setup!Q5:Q14"},null,null,"Min Increment",{"$f":"IF(Setup!G15=\"Kg\",0.5,1)","v":0.5},"01:00:00"]
[null,null,{"$f":"CONCATENATE(\"Lists!E2:E\",COUNTIF(Lists!E1:E12,\"<>\"\"\"))","v":"Lists!E2:E12"},null,null,"Forecast total",{"$f":"INDIRECT(ADDRESS(Lists!B25,51,,,\"Lifting\"))","v":{"$error":"#N/A"}},null,null,null,null,null,null,null,null,null,null,null,null,null,null,null,null,null,null,null,null,null,null,null,null,null,null,null,"sort",null,null,null,null,null,null,null,null,null,null,null,null,null,null,null,null,null,null,null,null,null,null,null,null,{"$f":"NOW()-TODAY()","v":"02:45:17.510"}]
[{"$f":"CONCATENATE(\"Setup!P5:P\",COUNTA(Setup!Q:Q)+3)","v":"Setup!P5:P13"},{"$f":"CONCATENATE(\"B13:B\",12+COUNTIF(A:A,RIGHT(A11,LEN(A11)-FIND(\" \",A11))))","v":"B13:B12"},{"$f":"CONCATENATE(\"Setup!M6:M\",COUNTA(Setup!M:M)+3)","v":"Setup!M6:M5"},{"$f":"CONCATENATE(\"Setup!I6:I\",COUNTA(Setup!I:I)+3)","v":"Setup!I6:I37"},null,null,{"$f":"INDIRECT(ADDRESS(Lists!B25,26,,,\"Lifting\"))","v":{"$error":"#N/A"}},null,null,null,null,null,null,null,null,null,null,null,null,null,null,null,null,null,null,null,null,null,null,null,null,null,null,null,"on","Assigned Macro values",null,null,null,null,null,null,null,null,null,null,null,"Forecasts"]
["Grp A","Name","Team","Div",{"$f":"'Weigh-In'!F2","v":"Bwt - kg"},"IPF Wt Cls","lot#","Birth Year","IPF Pts Code","SQ rack","SQ-1","SQ-2","SQ-3","Best SQ","BP rack","BP-1","BP-2","BP-3","Best BP","Sub Total","DL-1","DL-2","DL-3","Best DL","PL Total","Pl/Div/Cls/Event","Forecast\nScore","F'cast Place","IPF Points","Age & Points","Events Entered","MemberID","State","Flight Sorting",{"$f":"Lists!B31","v":"U"},"SQ time rank","BP time rank","DL/TL rank",{"$f":"VLOOKUP(Y11,AM1:AN7,2,FALSE)","v":"PL"},"Pl Code","tl or coef score",null,"Div Order","DB Div",null,"Wt Cls order",null,"SQ","BP","DL","tl or event","wilks score","wilks & age","score value",null,null,null,null,null,null,null,"Active Lifter Row",{"$f":"Lists!B25","v":{"$error":"#N/A"}},"Active Lifter Col",{"$f":"Lists!B24","v":21},{"$f":"Lists!B23","v":"DL-1"},{"$f":"Lists!B40","v":{"$error":"#N/A"}},{"$f":"Lists!B39","v":{"$error":"#N/A"}},null,null,null,null,null,null,null,null,null,"Drug tested",null,"Div-Cls","event time","Place","Forecast Place"]
[null,null,null,null,null,{"$f":"IFERROR(VLOOKUP(E12,DATA!$E$2:$G$22,IF(LEFT(D12,1)=\"M\",2,3)),\"\")","v":""},null,null,{"$f":"CONCATENATE(LEFT(D12,1),IF(RIGHT(D12,1)=\"U\",\"C\",\"E\"),VLOOKUP($Y$11,$AM$1:$AO$4,3,FALSE))","v":"EP"},null,null,null,null,{"$f":"IF(MAX(K12:M12)<=0,0,MAX(CELL(\"color\",K12)*K12,CELL(\"color\",L12)*L12,CELL(\"color\",M12)*M12))","v":0},null,null,null,null,{"$f":"IF(MAX(P12:R12)<=0,0,MAX(CELL(\"color\",P12)*P12,CELL(\"color\",Q12)*Q12,CELL(\"color\",R12)*R12))","v":0},{"$f":"IF(OR(N12=0,S12=0),0,N12+S12)","v":0},null,null,null,{"$f":"IF(MAX(U12:W12)<=0,0,MAX(CELL(\"color\",U12)*U12,CELL(\"color\",V12)*V12,CELL(\"color\",W12)*W12))","v":0},{"$f":"AM12*IF($AM$11=\"SQ\",N12,IF($AM$11=\"BP\",S12,IF($AM$11=\"DL\",X12,IF($AM$11=\"PP\",IF(OR(S12=0,X12=0),0,S12+X12),IF(OR(T12=0,X12=0),0,T12+X12)))))","v":0},{"$f":"IF(Y12=0,\"\",CONCATENATE(CD12,\"/\",IF(AN12=4,\"Wilks\",D12),\"/\",IF(AN12>1,\"\",F12),\"/\",$AM$11))","v":""},{"$f":"BB12","v":0},{"$f":"IF(AA12=0,\"\",CE12)","v":""},{"$f":"IFERROR(IPF_Formula(E12,I12,Y12),0)","v":0},{"$f":"IFERROR(VLOOKUP(AS12,DATA!$A$2:$B$63,2,TRUE),0)*AC12","v":0},null,null,null,{"$f":"IFERROR(VLOOKUP(A12,Setup!$Q$5:$R$20,2,FALSE),\"\")","v":""},{"$f":"IF(VALUE(INDIRECT(CONCATENATE($AI$11,ROW())))=0,\"\",ABS(INDIRECT(CONCATENATE($AI$11,ROW())))+0.000001*G12)","v":""},0,0,0,{"$f":"IF(ISERROR(SEARCH($AM$11,AE12)),0,1)","v":0},{"$f":"VLOOKUP(D12,Setup!$I$6:$K$92,3,FALSE)","v":{"$error":"#N/A"}},{"$f":"ROUND(IFERROR(IF(AN12=1,Y12,IF(AN12=2,AC12,IF(AN12=3,AD12,AC12))),0),5)","v":0},null,{"$f":"IFERROR(MATCH(D12,Setup!$I$6:$I$92,0),\"\")","v":""},{"$f":"IFERROR(CONCATENATE(LEFT(D12,FIND(\"-\",D12)),IF(AS12=\"\",\"O\",VLOOKUP(AS12,DATA!$E$35:$F$53,2,TRUE))),\"\")","v":""},{"$f":"YEAR(TODAY())-H12","v":2019},{"$f":"IF(AN12=1,MATCH(F12,DATA!$AB$2:$AB$34,0),0)","v":{"$error":"#N/A"}},null,{"$f":"IF(MAX(K12:M12)>0,MAX(K12:M12),0)","v":0},{"$f":"IF(MAX(P12:R12)>0,MAX(P12:R12),0)","v":0},{"$f":"IF(MAX(U12:W12)>0,MAX(U12:W12),0)","v":0},{"$f":"AM12*IF($AM$11=\"PL\",IF(MIN(AV12:AX12)=0,0,AV12+AW12+AX12),IF($AM$11=\"PP\",IF(MIN(AW12:AX12)=0,0,AW12+AX12),IF($AM$11=\"BP\",AW12,IF($AM$11=\"DL\",AX12,AV12))))","v":0},{"$f":"IFERROR(IPF_Formula(E12,I12,AY12),0)","v":0},{"$f":"ROUND(IFERROR(VLOOKUP(AS12,DATA!$A$2:$B$63,2,FALSE),1)*AZ12,5)","v":0},{"$f":"IFERROR(IF(AN12=1,AY12,IF(AN12=2,AZ12,IF(AN12=3,BA12,AZ12))),0)","v":0},null,null,null,null,null,null,null,null,null,null,null,null,null,null,null,null,null,null,null,null,null,null,null,{"$f":"IFERROR(IF(FIND(\"DT\",AE12),\"Y\",\"\"),\"\")","v":""},null,{"$f":"CONCATENATE(IF(AN12=4,\"\",D12),IF(AN12=1,F12,\"\"))","v":{"$error":"#N/A"}},{"$f":"IF($AM$11=\"SQ\",AJ12,IF($AM$11=\"BP\",AK12,AL12))","v":0},{"$f":"1+COUNTIFS(INDIRECT(\"AN12:AN500\"),AN12,INDIRECT(\"CB12:CB500\"),CB12,INDIRECT(\"AO12:AO500\"),\">\"&AO12)\n+COUNTIFS(INDIRECT(\"AO12:AO500\"),AO12,INDIRECT(\"AN12:AN500\"),1,INDIRECT(\"CB12:CB500\"),CB12,INDIRECT(\"E12:E500\"),\"<\"&E12)\n+COUNTIFS(INDIRECT(\"AO12:AO500\"),AO12,INDIRECT(\"AN12:AN500\"),1,INDIRECT(\"CB12:CB500\"),CB12,INDIRECT(\"E12:E500\"),E12,INDIRECT(\"CC12:CC500\"),\"<\"&CC12)","v":1},{"$f":"1+COUNTIFS(INDIRECT(\"AN12:AN500\"),AN12,INDIRECT(\"CB12:CB500\"),CB12,INDIRECT(\"BB12:BB500\"),\">\"&BB12)\n+COUNTIFS(INDIRECT(\"BB12:BB500\"),BB12,INDIRECT(\"AN12:AN500\"),1,INDIRECT(\"CB12:CB500\"),CB12,INDIRECT(\"E12:E500\"),\"<\"&E12)","v":1}]

{"sheet":"QuickPrint","index":6,"n_rows":0,"n_cols":0,"rows_kept":0,"cut":false,"hidden":false,"merged":[]}

{"sheet":"集計用","index":7,"n_rows":0,"n_cols":0,"rows_kept":0,"cut":false,"hidden":false,"merged":[]}

{"sheet":"集計１","index":8,"n_rows":0,"n_cols":0,"rows_kept":0,"cut":false,"hidden":false,"merged":[]}

{"sheet":"表彰状","index":9,"n_rows":22,"n_cols":14,"rows_kept":22,"cut":false,"hidden":false,"merged":[[16,5,17,5],[18,1,19,2],[18,5,19,6],[20,5,20,6],[21,1,21,5]]}
[1]
[]
[]
[]
[]
[]
[]
[null,null,null,null,null,null,null,null,null,null,null,null,"start行番号",3]
[null,null,null,null,null,null,null,null,null,null,null,null,"end行番号",7]
[]
[null,null,null,null,null,null,null,null,null,null,null,null,"行番号",7]
[]
[]
[]
[]
[]
[null,null,null,null,null,"記　　録"]
[]
[null,{"$f":"INDEX(集計用!#REF!,$N$11)","v":{"$error":"#REF!"}},null,null,null,"記　録"]
[]
[null,{"$f":"INDEX(集計１!$AA:$AA,$N$11)","v":0},{"$f":"INDEX(集計１!$AB:$AB,$N$11)","v":0},{"$f":"INDEX(集計１!$AC:$AC,$N$11)","v":0},{"$f":"INDEX(集計１!$Z:$Z,$N$11)","v":0},{"$f":"INDEX(集計１!$Y:$Y,$N$11)","v":0}]
[null,{"$f":"INDEX(集計１!$B:$B,$N$11)","v":0},{"$f":"INDEX(集計１!$AC:$AC,$N$11)","v":0},{"$f":"INDEX(集計１!$AC:$AC,$N$11)","v":0},{"$f":"INDEX(集計１!$AC:$AC,$N$11)","v":0},{"$f":"INDEX(集計１!$AC:$AC,$N$11)","v":0},"殿"]

{"sheet":"団体用","index":10,"n_rows":1025,"n_cols":16,"rows_kept":1025,"cut":false,"hidden":false,"merged":[]}
["性別","階級","年代","選手名","都道府県","団体名","順位","IPFポイント","点数","合計点"]
[null,null,null,null,null,null,null,null,{"$f":"VLOOKUP(G2,$O$3:$P$32,2,1)","v":{"$error":"#N/A"}},null,null,{"$f":"COUNTIF($E$2:$E$1025,E2)","v":0},{"$f":"COUNTIF($F$2:$F$1025,F2)","v":0},null,"順位","点数"]
[null,null,null,null,null,null,null,null,{"$error":"#N/A"},null,null,0,0,null,1,12]
[null,null,null,null,null,null,null,null,{"$error":"#N/A"},null,null,0,0,null,2,9]
[null,null,null,null,null,null,null,null,{"$error":"#N/A"},null,null,0,0,null,3,8]
[null,null,null,null,null,null,null,null,{"$error":"#N/A"},null,null,0,0,null,4,7]
[null,null,null,null,null,null,null,null,{"$error":"#N/A"},null,null,0,0,null,5,6]
[null,null,null,null,null,null,null,null,{"$error":"#N/A"},null,null,0,0,null,6,5]
[null,null,null,null,null,null,null,null,{"$error":"#N/A"},null,null,0,0,null,7,4]
[null,null,null,null,null,null,null,null,{"$error":"#N/A"},null,null,0,0,null,8,3]
[null,null,null,null,null,null,null,null,{"$error":"#N/A"},null,null,0,0,null,9,2]
[null,null,null,null,null,null,null,null,{"$error":"#N/A"},null,null,0,0,null,10,1]
[null,null,null,null,null,null,null,null,{"$error":"#N/A"},null,null,0,0,null,11,1]
[null,null,null,null,null,null,null,null,{"$error":"#N/A"},null,null,0,0,null,12,1]
[null,null,null,null,null,null,null,null,{"$error":"#N/A"},null,null,0,0,null,13,1]
[null,null,null,null,null,null,null,null,{"$error":"#N/A"},null,null,0,0,null,14,1]
[null,null,null,null,null,null,null,null,{"$error":"#N/A"},null,null,0,0,null,15,1]
[null,null,null,null,null,null,null,null,{"$error":"#N/A"},null,null,0,0,null,16,1]
[null,null,null,null,null,null,null,null,{"$error":"#N/A"},null,null,0,0,null,17,1]
[null,null,null,null,null,null,null,null,{"$error":"#N/A"},null,null,0,0,null,18,1]
[null,null,null,null,null,null,null,null,{"$error":"#N/A"},null,null,0,0,null,19,1]
[null,null,null,null,null,null,null,null,{"$error":"#N/A"},null,null,0,0,null,20,1]
[null,null,null,null,null,null,null,null,{"$error":"#N/A"},null,null,0,0,null,21,1]
[null,null,null,null,null,null,null,null,{"$error":"#N/A"},null,null,0,0,null,22,1]
[null,null,null,null,null,null,null,null,{"$error":"#N/A"},null,null,0,0,null,23,1]
[null,null,null,null,null,null,null,null,{"$error":"#N/A"},null,null,0,0,null,24,1]
[null,null,null,null,null,null,null,null,{"$error":"#N/A"},null,null,0,0,null,25,1]
[null,null,null,null,null,null,null,null,{"$error":"#N/A"},null,null,0,0,null,26,1]
[null,null,null,null,null,null,null,null,{"$error":"#N/A"},null,null,0,0,null,27,1]
[null,null,null,null,null,null,null,null,{"$error":"#N/A"},null,null,0,0,null,28,1]
[null,null,null,null,null,null,null,null,{"$error":"#N/A"},null,null,0,0,null,29,1]
[null,null,null,null,null,null,null,null,{"$error":"#N/A"},null,null,0,0,null,30,1]
[null,null,null,null,null,null,null,null,{"$error":"#N/A"},null,null,0,0]
[null,null,null,null,null,null,null,null,{"$error":"#N/A"},null,null,0,0]
[null,null,null,null,null,null,null,null,{"$error":"#N/A"},null,null,0,0]
[null,null,null,null,null,null,null,null,{"$error":"#N/A"},null,null,0,0]
[null,null,null,null,null,null,null,null,{"$error":"#N/A"},null,null,0,0]
[null,null,null,null,null,null,null,null,{"$error":"#N/A"},null,null,0,0]
[null,null,null,null,null,null,null,null,{"$error":"#N/A"},null,null,0,0]
[null,null,null,null,null,null,null,null,{"$error":"#N/A"},null,null,0,0]
[null,null,null,null,null,null,null,null,{"$error":"#N/A"},null,null,0,0]
[null,null,null,null,null,null,null,null,{"$error":"#N/A"},null,null,0,0]
[null,null,null,null,null,null,null,null,{"$error":"#N/A"},null,null,0,0]
[null,null,null,null,null,null,null,null,{"$error":"#N/A"},null,null,0,0]
[null,null,null,null,null,null,null,null,{"$error":"#N/A"},null,null,0,0]
[null,null,null,null,null,null,null,null,{"$error":"#N/A"},null,null,0,0]
[null,null,null,null,null,null,null,null,{"$error":"#N/A"},null,null,0,0]
[null,null,null,null,null,null,null,null,{"$error":"#N/A"},null,null,0,0]
[null,null,null,null,null,null,null,null,{"$error":"#N/A"},null,null,0,0]
[null,null,null,null,null,null,null,null,{"$error":"#N/A"},null,null,0,0]
[null,null,null,null,null,null,null,null,{"$error":"#N/A"},null,null,0,0]
[null,null,null,null,null,null,null,null,{"$error":"#N/A"},null,null,0,0]
[null,null,null,null,null,null,null,null,{"$error":"#N/A"},null,null,0,0]
[null,null,null,null,null,null,null,null,{"$error":"#N/A"},null,null,0,0]
[null,null,null,null,null,null,null,null,{"$error":"#N/A"},null,null,0,0]
[null,null,null,null,null,null,null,null,{"$error":"#N/A"},null,null,0,0]
[null,null,null,null,null,null,null,null,{"$error":"#N/A"},null,null,0,0]
[null,null,null,null,null,null,null,null,{"$error":"#N/A"},null,null,0,0]
[null,null,null,null,null,null,null,null,{"$error":"#N/A"},null,null,0,0]
[null,null,null,null,null,null,null,null,{"$error":"#N/A"},null,null,0,0]
[null,null,null,null,null,null,null,null,{"$error":"#N/A"},null,null,0,0]
[null,null,null,null,null,null,null,null,{"$error":"#N/A"},null,null,0,0]
[null,null,null,null,null,null,null,null,{"$error":"#N/A"},null,null,0,0]
[null,null,null,null,null,null,null,null,{"$error":"#N/A"},null,null,0,0]
[null,null,null,null,null,null,null,null,{"$error":"#N/A"},null,null,0,0]
[null,null,null,null,null,null,null,null,{"$f":"VLOOKUP(G66,$O$3:$P$32,2,1)","v":{"$error":"#N/A"}},null,null,{"$f":"COUNTIF($E$2:$E$1025,E66)","v":0},{"$f":"COUNTIF($F$2:$F$1025,F66)","v":0}]
[null,null,null,null,null,null,null,null,{"$error":"#N/A"},null,null,0,0]
[null,null,null,null,null,null,null,null,{"$error":"#N/A"},null,null,0,0]
[null,null,null,null,null,null,null,null,{"$error":"#N/A"},null,null,0,0]
[null,null,null,null,null,null,null,null,{"$error":"#N/A"},null,null,0,0]
[null,null,null,null,null,null,null,null,{"$error":"#N/A"},null,null,0,0]
[null,null,null,null,null,null,null,null,{"$error":"#N/A"},null,null,0,0]
[null,null,null,null,null,null,null,null,{"$error":"#N/A"},null,null,0,0]
[null,null,null,null,null,null,null,null,{"$error":"#N/A"},null,null,0,0]
[null,null,null,null,null,null,null,null,{"$error":"#N/A"},null,null,0,0]
[null,null,null,null,null,null,null,null,{"$error":"#N/A"},null,null,0,0]
[null,null,null,null,null,null,null,null,{"$error":"#N/A"},null,null,0,0]
[null,null,null,null,null,null,null,null,{"$error":"#N/A"},null,null,0,0]
[null,null,null,null,null,null,null,null,{"$error":"#N/A"},null,null,0,0]
[null,null,null,null,null,null,null,null,{"$error":"#N/A"},null,null,0,0]
[null,null,null,null,null,null,null,null,{"$error":"#N/A"},null,null,0,0]
[null,null,null,null,null,null,null,null,{"$error":"#N/A"},null,null,0,0]
[null,null,null,null,null,null,null,null,{"$error":"#N/A"},null,null,0,0]
[null,null,null,null,null,null,null,null,{"$error":"#N/A"},null,null,0,0]
[null,null,null,null,null,null,null,null,{"$error":"#N/A"},null,null,0,0]
[null,null,null,null,null,null,null,null,{"$error":"#N/A"},null,null,0,0]
[null,null,null,null,null,null,null,null,{"$error":"#N/A"},null,null,0,0]
[null,null,null,null,null,null,null,null,{"$error":"#N/A"},null,null,0,0]
[null,null,null,null,null,null,null,null,{"$error":"#N/A"},null,null,0,0]
[null,null,null,null,null,null,null,null,{"$error":"#N/A"},null,null,0,0]
[null,null,null,null,null,null,null,null,{"$error":"#N/A"},null,null,0,0]
[null,null,null,null,null,null,null,null,{"$error":"#N/A"},null,null,0,0]
[null,null,null,null,null,null,null,null,{"$error":"#N/A"},null,null,0,0]
[null,null,null,null,null,null,null,null,{"$error":"#N/A"},null,null,0,0]
[null,null,null,null,null,null,null,null,{"$error":"#N/A"},null,null,0,0]
[null,null,null,null,null,null,null,null,{"$error":"#N/A"},null,null,0,0]
[null,null,null,null,null,null,null,null,{"$error":"#N/A"},null,null,0,0]
[null,null,null,null,null,null,null,null,{"$error":"#N/A"},null,null,0,0]
[null,null,null,null,null,null,null,null,{"$error":"#N/A"},null,null,0,0]
[null,null,null,null,null,null,null,null,{"$error":"#N/A"},null,null,0,0]
[null,null,null,null,null,null,null,null,{"$error":"#N/A"},null,null,0,0]
[null,null,null,null,null,null,null,null,{"$error":"#N/A"},null,null,0,0]
[null,null,null,null,null,null,null,null,{"$error":"#N/A"},null,null,0,0]
[null,null,null,null,null,null,null,null,{"$error":"#N/A"},null,null,0,0]
[null,null,null,null,null,null,null,null,{"$error":"#N/A"},null,null,0,0]
[null,null,null,null,null,null,null,null,{"$error":"#N/A"},null,null,0,0]
[null,null,null,null,null,null,null,null,{"$error":"#N/A"},null,null,0,0]
[null,null,null,null,null,null,null,null,{"$error":"#N/A"},null,null,0,0]
[null,null,null,null,null,null,null,null,{"$error":"#N/A"},null,null,0,0]
[null,null,null,null,null,null,null,null,{"$error":"#N/A"},null,null,0,0]
[null,null,null,null,null,null,null,null,{"$error":"#N/A"},null,null,0,0]
[null,null,null,null,null,null,null,null,{"$error":"#N/A"},null,null,0,0]
[null,null,null,null,null,null,null,null,{"$error":"#N/A"},null,null,0,0]
[null,null,null,null,null,null,null,null,{"$error":"#N/A"},null,null,0,0]
[null,null,null,null,null,null,null,null,{"$error":"#N/A"},null,null,0,0]
[null,null,null,null,null,null,null,null,{"$error":"#N/A"},null,null,0,0]
[null,null,null,null,null,null,null,null,{"$error":"#N/A"},null,null,0,0]
[null,null,null,null,null,null,null,null,{"$error":"#N/A"},null,null,0,0]
[null,null,null,null,null,null,null,null,{"$error":"#N/A"},null,null,0,0]
[null,null,null,null,null,null,null,null,{"$error":"#N/A"},null,null,0,0]
[null,null,null,null,null,null,null,null,{"$error":"#N/A"},null,null,0,0]
[null,null,null,null,null,null,null,null,{"$error":"#N/A"},null,null,0,0]
[null,null,null,null,null,null,null,null,{"$error":"#N/A"},null,null,0,0]
[null,null,null,null,null,null,null,null,{"$error":"#N/A"},null,null,0,0]
[null,null,null,null,null,null,null,null,{"$error":"#N/A"},null,null,0,0]
[null,null,null,null,null,null,null,null,{"$error":"#N/A"},null,null,0,0]
[null,null,null,null,null,null,null,null,{"$error":"#N/A"},null,null,0,0]
[null,null,null,null,null,null,null,null,{"$error":"#N/A"},null,null,0,0]
[null,null,null,null,null,null,null,null,{"$error":"#N/A"},null,null,0,0]
[null,null,null,null,null,null,null,null,{"$f":"VLOOKUP(G130,$O$3:$P$32,2,1)","v":{"$error":"#N/A"}},null,null,{"$f":"COUNTIF($E$2:$E$1025,E130)","v":0},{"$f":"COUNTIF($F$2:$F$1025,F130)","v":0}]
[null,null,null,null,null,null,null,null,{"$error":"#N/A"},null,null,0,0]
[null,null,null,null,null,null,null,null,{"$error":"#N/A"},null,null,0,0]
[null,null,null,null,null,null,null,null,{"$error":"#N/A"},null,null,0,0]
[null,null,null,null,null,null,null,null,{"$error":"#N/A"},null,null,0,0]
[null,null,null,null,null,null,null,null,{"$error":"#N/A"},null,null,0,0]
[null,null,null,null,null,null,null,null,{"$error":"#N/A"},null,null,0,0]
[null,null,null,null,null,null,null,null,{"$error":"#N/A"},null,null,0,0]
[null,null,null,null,null,null,null,null,{"$error":"#N/A"},null,null,0,0]
[null,null,null,null,null,null,null,null,{"$error":"#N/A"},null,null,0,0]
[null,null,null,null,null,null,null,null,{"$error":"#N/A"},null,null,0,0]
[null,null,null,null,null,null,null,null,{"$error":"#N/A"},null,null,0,0]
[null,null,null,null,null,null,null,null,{"$error":"#N/A"},null,null,0,0]
[null,null,null,null,null,null,null,null,{"$error":"#N/A"},null,null,0,0]
[null,null,null,null,null,null,null,null,{"$error":"#N/A"},null,null,0,0]
[null,null,null,null,null,null,null,null,{"$error":"#N/A"},null,null,0,0]
[null,null,null,null,null,null,null,null,{"$error":"#N/A"},null,null,0,0]
[null,null,null,null,null,null,null,null,{"$error":"#N/A"},null,null,0,0]
[null,null,null,null,null,null,null,null,{"$error":"#N/A"},null,null,0,0]
[null,null,null,null,null,null,null,null,{"$error":"#N/A"},null,null,0,0]
[null,null,null,null,null,null,null,null,{"$error":"#N/A"},null,null,0,0]
[null,null,null,null,null,null,null,null,{"$error":"#N/A"},null,null,0,0]
[null,null,null,null,null,null,null,null,{"$error":"#N/A"},null,null,0,0]
[null,null,null,null,null,null,null,null,{"$error":"#N/A"},null,null,0,0]
[null,null,null,null,null,null,null,null,{"$error":"#N/A"},null,null,0,0]
[null,null,null,null,null,null,null,null,{"$error":"#N/A"},null,null,0,0]
[null,null,null,null,null,null,null,null,{"$error":"#N/A"},null,null,0,0]
[null,null,null,null,null,null,null,null,{"$error":"#N/A"},null,null,0,0]
[null,null,null,null,null,null,null,null,{"$error":"#N/A"},null,null,0,0]
[null,null,null,null,null,null,null,null,{"$error":"#N/A"},null,null,0,0]
[null,null,null,null,null,null,null,null,{"$error":"#N/A"},null,null,0,0]
[null,null,null,null,null,null,null,null,{"$error":"#N/A"},null,null,0,0]
[null,null,null,null,null,null,null,null,{"$error":"#N/A"},null,null,0,0]
[null,null,null,null,null,null,null,null,{"$error":"#N/A"},null,null,0,0]
[null,null,null,null,null,null,null,null,{"$error":"#N/A"},null,null,0,0]
[null,null,null,null,null,null,null,null,{"$error":"#N/A"},null,null,0,0]
[null,null,null,null,null,null,null,null,{"$error":"#N/A"},null,null,0,0]
[null,null,null,null,null,null,null,null,{"$error":"#N/A"},null,null,0,0]
[null,null,null,null,null,null,null,null,{"$error":"#N/A"},null,null,0,0]
[null,null,null,null,null,null,null,null,{"$error":"#N/A"},null,null,0,0]
[null,null,null,null,null,null,null,null,{"$error":"#N/A"},null,null,0,0]
[null,null,null,null,null,null,null,null,{"$error":"#N/A"},null,null,0,0]
[null,null,null,null,null,null,null,null,{"$error":"#N/A"},null,null,0,0]
[null,null,null,null,null,null,null,null,{"$error":"#N/A"},null,null,0,0]
[null,null,null,null,null,null,null,null,{"$error":"#N/A"},null,null,0,0]
[null,null,null,null,null,null,null,null,{"$error":"#N/A"},null,null,0,0]
[null,null,null,null,null,null,null,null,{"$error":"#N/A"},null,null,0,0]
[null,null,null,null,null,null,null,null,{"$error":"#N/A"},null,null,0,0]
[null,null,null,null,null,null,null,null,{"$error":"#N/A"},null,null,0,0]
[null,null,null,null,null,null,null,null,{"$error":"#N/A"},null,null,0,0]
[null,null,null,null,null,null,null,null,{"$error":"#N/A"},null,null,0,0]
[null,null,null,null,null,null,null,null,{"$error":"#N/A"},null,null,0,0]
[null,null,null,null,null,null,null,null,{"$error":"#N/A"},null,null,0,0]
[null,null,null,null,null,null,null,null,{"$error":"#N/A"},null,null,0,0]
[null,null,null,null,null,null,null,null,{"$error":"#N/A"},null,null,0,0]
[null,null,null,null,null,null,null,null,{"$error":"#N/A"},null,null,0,0]
[null,null,null,null,null,null,null,null,{"$error":"#N/A"},null,null,0,0]
[null,null,null,null,null,null,null,null,{"$error":"#N/A"},null,null,0,0]
[null,null,null,null,null,null,null,null,{"$error":"#N/A"},null,null,0,0]
[null,null,null,null,null,null,null,null,{"$error":"#N/A"},null,null,0,0]
[null,null,null,null,null,null,null,null,{"$error":"#N/A"},null,null,0,0]
[null,null,null,null,null,null,null,null,{"$error":"#N/A"},null,null,0,0]
[null,null,null,null,null,null,null,null,{"$error":"#N/A"},null,null,0,0]
[null,null,null,null,null,null,null,null,{"$error":"#N/A"},null,null,0,0]
[null,null,null,null,null,null,null,null,{"$f":"VLOOKUP(G194,$O$3:$P$32,2,1)","v":{"$error":"#N/A"}},null,null,{"$f":"COUNTIF($E$2:$E$1025,E194)","v":0},{"$f":"COUNTIF($F$2:$F$1025,F194)","v":0}]
[null,null,null,null,null,null,null,null,{"$error":"#N/A"},null,null,0,0]
[null,null,null,null,null,null,null,null,{"$error":"#N/A"},null,null,0,0]
[null,null,null,null,null,null,null,null,{"$error":"#N/A"},null,null,0,0]
[null,null,null,null,null,null,null,null,{"$error":"#N/A"},null,null,0,0]
[null,null,null,null,null,null,null,null,{"$error":"#N/A"},null,null,0,0]
[null,null,null,null,null,null,null,null,{"$error":"#N/A"},null,null,0,0]
[null,null,null,null,null,null,null,null,{"$error":"#N/A"},null,null,0,0]
[null,null,null,null,null,null,null,null,{"$error":"#N/A"},null,null,0,0]
[null,null,null,null,null,null,null,null,{"$error":"#N/A"},null,null,0,0]
[null,null,null,null,null,null,null,null,{"$error":"#N/A"},null,null,0,0]
[null,null,null,null,null,null,null,null,{"$error":"#N/A"},null,null,0,0]
[null,null,null,null,null,null,null,null,{"$error":"#N/A"},null,null,0,0]
[null,null,null,null,null,null,null,null,{"$error":"#N/A"},null,null,0,0]
[null,null,null,null,null,null,null,null,{"$error":"#N/A"},null,null,0,0]
[null,null,null,null,null,null,null,null,{"$error":"#N/A"},null,null,0,0]
[null,null,null,null,null,null,null,null,{"$error":"#N/A"},null,null,0,0]
[null,null,null,null,null,null,null,null,{"$error":"#N/A"},null,null,0,0]
[null,null,null,null,null,null,null,null,{"$error":"#N/A"},null,null,0,0]
[null,null,null,null,null,null,null,null,{"$error":"#N/A"},null,null,0,0]
[null,null,null,null,null,null,null,null,{"$error":"#N/A"},null,null,0,0]
[null,null,null,null,null,null,null,null,{"$error":"#N/A"},null,null,0,0]
[null,null,null,null,null,null,null,null,{"$error":"#N/A"},null,null,0,0]
[null,null,null,null,null,null,null,null,{"$error":"#N/A"},null,null,0,0]
[null,null,null,null,null,null,null,null,{"$error":"#N/A"},null,null,0,0]
[null,null,null,null,null,null,null,null,{"$error":"#N/A"},null,null,0,0]
[null,null,null,null,null,null,null,null,{"$error":"#N/A"},null,null,0,0]
[null,null,null,null,null,null,null,null,{"$error":"#N/A"},null,null,0,0]
[null,null,null,null,null,null,null,null,{"$error":"#N/A"},null,null,0,0]
[null,null,null,null,null,null,null,null,{"$error":"#N/A"},null,null,0,0]
[null,null,null,null,null,null,null,null,{"$error":"#N/A"},null,null,0,0]
[null,null,null,null,null,null,null,null,{"$error":"#N/A"},null,null,0,0]
[null,null,null,null,null,null,null,null,{"$error":"#N/A"},null,null,0,0]
[null,null,null,null,null,null,null,null,{"$error":"#N/A"},null,null,0,0]
[null,null,null,null,null,null,null,null,{"$error":"#N/A"},null,null,0,0]
[null,null,null,null,null,null,null,null,{"$error":"#N/A"},null,null,0,0]
[null,null,null,null,null,null,null,null,{"$error":"#N/A"},null,null,0,0]
[null,null,null,null,null,null,null,null,{"$error":"#N/A"},null,null,0,0]
[null,null,null,null,null,null,null,null,{"$error":"#N/A"},null,null,0,0]
[null,null,null,null,null,null,null,null,{"$error":"#N/A"},null,null,0,0]
[null,null,null,null,null,null,null,null,{"$error":"#N/A"},null,null,0,0]
[null,null,null,null,null,null,null,null,{"$error":"#N/A"},null,null,0,0]
[null,null,null,null,null,null,null,null,{"$error":"#N/A"},null,null,0,0]
[null,null,null,null,null,null,null,null,{"$error":"#N/A"},null,null,0,0]
[null,null,null,null,null,null,null,null,{"$error":"#N/A"},null,null,0,0]
[null,null,null,null,null,null,null,null,{"$error":"#N/A"},null,null,0,0]
[null,null,null,null,null,null,null,null,{"$error":"#N/A"},null,null,0,0]
[null,null,null,null,null,null,null,null,{"$error":"#N/A"},null,null,0,0]
[null,null,null,null,null,null,null,null,{"$error":"#N/A"},null,null,0,0]
[null,null,null,null,null,null,null,null,{"$error":"#N/A"},null,null,0,0]
[null,null,null,null,null,null,null,null,{"$error":"#N/A"},null,null,0,0]
[null,null,null,null,null,null,null,null,{"$error":"#N/A"},null,null,0,0]
[null,null,null,null,null,null,null,null,{"$error":"#N/A"},null,null,0,0]
[null,null,null,null,null,null,null,null,{"$error":"#N/A"},null,null,0,0]
[null,null,null,null,null,null,null,null,{"$error":"#N/A"},null,null,0,0]
[null,null,null,null,null,null,null,null,{"$error":"#N/A"},null,null,0,0]
[null,null,null,null,null,null,null,null,{"$error":"#N/A"},null,null,0,0]
[null,null,null,null,null,null,null,null,{"$error":"#N/A"},null,null,0,0]
[null,null,null,null,null,null,null,null,{"$error":"#N/A"},null,null,0,0]
[null,null,null,null,null,null,null,null,{"$error":"#N/A"},null,null,0,0]
[null,null,null,null,null,null,null,null,{"$error":"#N/A"},null,null,0,0]
[null,null,null,null,null,null,null,null,{"$error":"#N/A"},null,null,0,0]
[null,null,null,null,null,null,null,null,{"$error":"#N/A"},null,null,0,0]
[null,null,null,null,null,null,null,null,{"$error":"#N/A"},null,null,0,0]
[null,null,null,null,null,null,null,null,{"$f":"VLOOKUP(G258,$O$3:$P$32,2,1)","v":{"$error":"#N/A"}},null,null,{"$f":"COUNTIF($E$2:$E$1025,E258)","v":0},{"$f":"COUNTIF($F$2:$F$1025,F258)","v":0}]
[null,null,null,null,null,null,null,null,{"$error":"#N/A"},null,null,0,0]
[null,null,null,null,null,null,null,null,{"$error":"#N/A"},null,null,0,0]
[null,null,null,null,null,null,null,null,{"$error":"#N/A"},null,null,0,0]
[null,null,null,null,null,null,null,null,{"$error":"#N/A"},null,null,0,0]
[null,null,null,null,null,null,null,null,{"$error":"#N/A"},null,null,0,0]
[null,null,null,null,null,null,null,null,{"$error":"#N/A"},null,null,0,0]
[null,null,null,null,null,null,null,null,{"$error":"#N/A"},null,null,0,0]
[null,null,null,null,null,null,null,null,{"$error":"#N/A"},null,null,0,0]
[null,null,null,null,null,null,null,null,{"$error":"#N/A"},null,null,0,0]
[null,null,null,null,null,null,null,null,{"$error":"#N/A"},null,null,0,0]
[null,null,null,null,null,null,null,null,{"$error":"#N/A"},null,null,0,0]
[null,null,null,null,null,null,null,null,{"$error":"#N/A"},null,null,0,0]
[null,null,null,null,null,null,null,null,{"$error":"#N/A"},null,null,0,0]
[null,null,null,null,null,null,null,null,{"$error":"#N/A"},null,null,0,0]
[null,null,null,null,null,null,null,null,{"$error":"#N/A"},null,null,0,0]
[null,null,null,null,null,null,null,null,{"$error":"#N/A"},null,null,0,0]
[null,null,null,null,null,null,null,null,{"$error":"#N/A"},null,null,0,0]
[null,null,null,null,null,null,null,null,{"$error":"#N/A"},null,null,0,0]
[null,null,null,null,null,null,null,null,{"$error":"#N/A"},null,null,0,0]
[null,null,null,null,null,null,null,null,{"$error":"#N/A"},null,null,0,0]
[null,null,null,null,null,null,null,null,{"$error":"#N/A"},null,null,0,0]
[null,null,null,null,null,null,null,null,{"$error":"#N/A"},null,null,0,0]
[null,null,null,null,null,null,null,null,{"$error":"#N/A"},null,null,0,0]
[null,null,null,null,null,null,null,null,{"$error":"#N/A"},null,null,0,0]
[null,null,null,null,null,null,null,null,{"$error":"#N/A"},null,null,0,0]
[null,null,null,null,null,null,null,null,{"$error":"#N/A"},null,null,0,0]
[null,null,null,null,null,null,null,null,{"$error":"#N/A"},null,null,0,0]
[null,null,null,null,null,null,null,null,{"$error":"#N/A"},null,null,0,0]
[null,null,null,null,null,null,null,null,{"$error":"#N/A"},null,null,0,0]
[null,null,null,null,null,null,null,null,{"$error":"#N/A"},null,null,0,0]
[null,null,null,null,null,null,null,null,{"$error":"#N/A"},null,null,0,0]
[null,null,null,null,null,null,null,null,{"$error":"#N/A"},null,null,0,0]
[null,null,null,null,null,null,null,null,{"$error":"#N/A"},null,null,0,0]
[null,null,null,null,null,null,null,null,{"$error":"#N/A"},null,null,0,0]
[null,null,null,null,null,null,null,null,{"$error":"#N/A"},null,null,0,0]
[null,null,null,null,null,null,null,null,{"$error":"#N/A"},null,null,0,0]
[null,null,null,null,null,null,null,null,{"$error":"#N/A"},null,null,0,0]
[null,null,null,null,null,null,null,null,{"$error":"#N/A"},null,null,0,0]
[null,null,null,null,null,null,null,null,{"$error":"#N/A"},null,null,0,0]
[null,null,null,null,null,null,null,null,{"$error":"#N/A"},null,null,0,0]
[null,null,null,null,null,null,null,null,{"$error":"#N/A"},null,null,0,0]
[null,null,null,null,null,null,null,null,{"$error":"#N/A"},null,null,0,0]
[null,null,null,null,null,null,null,null,{"$error":"#N/A"},null,null,0,0]
[null,null,null,null,null,null,null,null,{"$error":"#N/A"},null,null,0,0]
[null,null,null,null,null,null,null,null,{"$error":"#N/A"},null,null,0,0]
[null,null,null,null,null,null,null,null,{"$error":"#N/A"},null,null,0,0]
[null,null,null,null,null,null,null,null,{"$error":"#N/A"},null,null,0,0]
[null,null,null,null,null,null,null,null,{"$error":"#N/A"},null,null,0,0]
[null,null,null,null,null,null,null,null,{"$error":"#N/A"},null,null,0,0]
[null,null,null,null,null,null,null,null,{"$error":"#N/A"},null,null,0,0]
[null,null,null,null,null,null,null,null,{"$error":"#N/A"},null,null,0,0]
[null,null,null,null,null,null,null,null,{"$error":"#N/A"},null,null,0,0]
[null,null,null,null,null,null,null,null,{"$error":"#N/A"},null,null,0,0]
[null,null,null,null,null,null,null,null,{"$error":"#N/A"},null,null,0,0]
[null,null,null,null,null,null,null,null,{"$error":"#N/A"},null,null,0,0]
[null,null,null,null,null,null,null,null,{"$error":"#N/A"},null,null,0,0]
[null,null,null,null,null,null,null,null,{"$error":"#N/A"},null,null,0,0]
[null,null,null,null,null,null,null,null,{"$error":"#N/A"},null,null,0,0]
[null,null,null,null,null,null,null,null,{"$error":"#N/A"},null,null,0,0]
[null,null,null,null,null,null,null,null,{"$error":"#N/A"},null,null,0,0]
[null,null,null,null,null,null,null,null,{"$error":"#N/A"},null,null,0,0]
[null,null,null,null,null,null,null,null,{"$error":"#N/A"},null,null,0,0]
[null,null,null,null,null,null,null,null,{"$error":"#N/A"},null,null,0,0]
[null,null,null,null,null,null,null,null,{"$f":"VLOOKUP(G322,$O$3:$P$32,2,1)","v":{"$error":"#N/A"}},null,null,{"$f":"COUNTIF($E$2:$E$1025,E322)","v":0},{"$f":"COUNTIF($F$2:$F$1025,F322)","v":0}]
[null,null,null,null,null,null,null,null,{"$error":"#N/A"},null,null,0,0]
[null,null,null,null,null,null,null,null,{"$error":"#N/A"},null,null,0,0]
[null,null,null,null,null,null,null,null,{"$error":"#N/A"},null,null,0,0]
[null,null,null,null,null,null,null,null,{"$error":"#N/A"},null,null,0,0]
[null,null,null,null,null,null,null,null,{"$error":"#N/A"},null,null,0,0]
[null,null,null,null,null,null,null,null,{"$error":"#N/A"},null,null,0,0]
[null,null,null,null,null,null,null,null,{"$error":"#N/A"},null,null,0,0]
[null,null,null,null,null,null,null,null,{"$error":"#N/A"},null,null,0,0]
[null,null,null,null,null,null,null,null,{"$error":"#N/A"},null,null,0,0]
[null,null,null,null,null,null,null,null,{"$error":"#N/A"},null,null,0,0]
[null,null,null,null,null,null,null,null,{"$error":"#N/A"},null,null,0,0]
[null,null,null,null,null,null,null,null,{"$error":"#N/A"},null,null,0,0]
[null,null,null,null,null,null,null,null,{"$error":"#N/A"},null,null,0,0]
[null,null,null,null,null,null,null,null,{"$error":"#N/A"},null,null,0,0]
[null,null,null,null,null,null,null,null,{"$error":"#N/A"},null,null,0,0]
[null,null,null,null,null,null,null,null,{"$error":"#N/A"},null,null,0,0]
[null,null,null,null,null,null,null,null,{"$error":"#N/A"},null,null,0,0]
[null,null,null,null,null,null,null,null,{"$error":"#N/A"},null,null,0,0]
[null,null,null,null,null,null,null,null,{"$error":"#N/A"},null,null,0,0]
[null,null,null,null,null,null,null,null,{"$error":"#N/A"},null,null,0,0]
[null,null,null,null,null,null,null,null,{"$error":"#N/A"},null,null,0,0]
[null,null,null,null,null,null,null,null,{"$error":"#N/A"},null,null,0,0]
[null,null,null,null,null,null,null,null,{"$error":"#N/A"},null,null,0,0]
[null,null,null,null,null,null,null,null,{"$error":"#N/A"},null,null,0,0]
[null,null,null,null,null,null,null,null,{"$error":"#N/A"},null,null,0,0]
[null,null,null,null,null,null,null,null,{"$error":"#N/A"},null,null,0,0]
[null,null,null,null,null,null,null,null,{"$error":"#N/A"},null,null,0,0]
[null,null,null,null,null,null,null,null,{"$error":"#N/A"},null,null,0,0]
[null,null,null,null,null,null,null,null,{"$error":"#N/A"},null,null,0,0]
[null,null,null,null,null,null,null,null,{"$error":"#N/A"},null,null,0,0]
[null,null,null,null,null,null,null,null,{"$error":"#N/A"},null,null,0,0]
[null,null,null,null,null,null,null,null,{"$error":"#N/A"},null,null,0,0]
[null,null,null,null,null,null,null,null,{"$error":"#N/A"},null,null,0,0]
[null,null,null,null,null,null,null,null,{"$error":"#N/A"},null,null,0,0]
[null,null,null,null,null,null,null,null,{"$error":"#N/A"},null,null,0,0]
[null,null,null,null,null,null,null,null,{"$error":"#N/A"},null,null,0,0]
[null,null,null,null,null,null,null,null,{"$error":"#N/A"},null,null,0,0]
[null,null,null,null,null,null,null,null,{"$error":"#N/A"},null,null,0,0]
[null,null,null,null,null,null,null,null,{"$error":"#N/A"},null,null,0,0]
[null,null,null,null,null,null,null,null,{"$error":"#N/A"},null,null,0,0]
[null,null,null,null,null,null,null,null,{"$error":"#N/A"},null,null,0,0]
[null,null,null,null,null,null,null,null,{"$error":"#N/A"},null,null,0,0]
[null,null,null,null,null,null,null,null,{"$error":"#N/A"},null,null,0,0]
[null,null,null,null,null,null,null,null,{"$error":"#N/A"},null,null,0,0]
[null,null,null,null,null,null,null,null,{"$error":"#N/A"},null,null,0,0]
[null,null,null,null,null,null,null,null,{"$error":"#N/A"},null,null,0,0]
[null,null,null,null,null,null,null,null,{"$error":"#N/A"},null,null,0,0]
[null,null,null,null,null,null,null,null,{"$error":"#N/A"},null,null,0,0]
[null,null,null,null,null,null,null,null,{"$error":"#N/A"},null,null,0,0]
[null,null,null,null,null,null,null,null,{"$error":"#N/A"},null,null,0,0]
[null,null,null,null,null,null,null,null,{"$error":"#N/A"},null,null,0,0]
[null,null,null,null,null,null,null,null,{"$error":"#N/A"},null,null,0,0]
[null,null,null,null,null,null,null,null,{"$error":"#N/A"},null,null,0,0]
[null,null,null,null,null,null,null,null,{"$error":"#N/A"},null,null,0,0]
[null,null,null,null,null,null,null,null,{"$error":"#N/A"},null,null,0,0]
[null,null,null,null,null,null,null,null,{"$error":"#N/A"},null,null,0,0]
[null,null,null,null,null,null,null,null,{"$error":"#N/A"},null,null,0,0]
[null,null,null,null,null,null,null,null,{"$error":"#N/A"},null,null,0,0]
[null,null,null,null,null,null,null,null,{"$error":"#N/A"},null,null,0,0]
[null,null,null,null,null,null,null,null,{"$error":"#N/A"},null,null,0,0]
[null,null,null,null,null,null,null,null,{"$error":"#N/A"},null,null,0,0]
[null,null,null,null,null,null,null,null,{"$error":"#N/A"},null,null,0,0]
[null,null,null,null,null,null,null,null,{"$error":"#N/A"},null,null,0,0]
[null,null,null,null,null,null,null,null,{"$f":"VLOOKUP(G386,$O$3:$P$32,2,1)","v":{"$error":"#N/A"}},null,null,{"$f":"COUNTIF($E$2:$E$1025,E386)","v":0},{"$f":"COUNTIF($F$2:$F$1025,F386)","v":0}]
[null,null,null,null,null,null,null,null,{"$error":"#N/A"},null,null,0,0]
[null,null,null,null,null,null,null,null,{"$error":"#N/A"},null,null,0,0]
[null,null,null,null,null,null,null,null,{"$error":"#N/A"},null,null,0,0]
[null,null,null,null,null,null,null,null,{"$error":"#N/A"},null,null,0,0]
[null,null,null,null,null,null,null,null,{"$error":"#N/A"},null,null,0,0]
[null,null,null,null,null,null,null,null,{"$error":"#N/A"},null,null,0,0]
[null,null,null,null,null,null,null,null,{"$error":"#N/A"},null,null,0,0]
[null,null,null,null,null,null,null,null,{"$error":"#N/A"},null,null,0,0]
[null,null,null,null,null,null,null,null,{"$error":"#N/A"},null,null,0,0]
[null,null,null,null,null,null,null,null,{"$error":"#N/A"},null,null,0,0]
[null,null,null,null,null,null,null,null,{"$error":"#N/A"},null,null,0,0]
[null,null,null,null,null,null,null,null,{"$error":"#N/A"},null,null,0,0]
[null,null,null,null,null,null,null,null,{"$error":"#N/A"},null,null,0,0]
[null,null,null,null,null,null,null,null,{"$error":"#N/A"},null,null,0,0]
[null,null,null,null,null,null,null,null,{"$error":"#N/A"},null,null,0,0]
[null,null,null,null,null,null,null,null,{"$error":"#N/A"},null,null,0,0]
[null,null,null,null,null,null,null,null,{"$error":"#N/A"},null,null,0,0]
[null,null,null,null,null,null,null,null,{"$error":"#N/A"},null,null,0,0]
[null,null,null,null,null,null,null,null,{"$error":"#N/A"},null,null,0,0]
[null,null,null,null,null,null,null,null,{"$error":"#N/A"},null,null,0,0]
[null,null,null,null,null,null,null,null,{"$error":"#N/A"},null,null,0,0]
[null,null,null,null,null,null,null,null,{"$error":"#N/A"},null,null,0,0]
[null,null,null,null,null,null,null,null,{"$error":"#N/A"},null,null,0,0]
[null,null,null,null,null,null,null,null,{"$error":"#N/A"},null,null,0,0]
[null,null,null,null,null,null,null,null,{"$error":"#N/A"},null,null,0,0]
[null,null,null,null,null,null,null,null,{"$error":"#N/A"},null,null,0,0]
[null,null,null,null,null,null,null,null,{"$error":"#N/A"},null,null,0,0]
[null,null,null,null,null,null,null,null,{"$error":"#N/A"},null,null,0,0]
[null,null,null,null,null,null,null,null,{"$error":"#N/A"},null,null,0,0]
[null,null,null,null,null,null,null,null,{"$error":"#N/A"},null,null,0,0]
[null,null,null,null,null,null,null,null,{"$error":"#N/A"},null,null,0,0]
[null,null,null,null,null,null,null,null,{"$error":"#N/A"},null,null,0,0]
[null,null,null,null,null,null,null,null,{"$error":"#N/A"},null,null,0,0]
[null,null,null,null,null,null,null,null,{"$error":"#N/A"},null,null,0,0]
[null,null,null,null,null,null,null,null,{"$error":"#N/A"},null,null,0,0]
[null,null,null,null,null,null,null,null,{"$error":"#N/A"},null,null,0,0]
[null,null,null,null,null,null,null,null,{"$error":"#N/A"},null,null,0,0]
[null,null,null,null,null,null,null,null,{"$error":"#N/A"},null,null,0,0]
[null,null,null,null,null,null,null,null,{"$error":"#N/A"},null,null,0,0]
[null,null,null,null,null,null,null,null,{"$error":"#N/A"},null,null,0,0]
[null,null,null,null,null,null,null,null,{"$error":"#N/A"},null,null,0,0]
[null,null,null,null,null,null,null,null,{"$error":"#N/A"},null,null,0,0]
[null,null,null,null,null,null,null,null,{"$error":"#N/A"},null,null,0,0]
[null,null,null,null,null,null,null,null,{"$error":"#N/A"},null,null,0,0]
[null,null,null,null,null,null,null,null,{"$error":"#N/A"},null,null,0,0]
[null,null,null,null,null,null,null,null,{"$error":"#N/A"},null,null,0,0]
[null,null,null,null,null,null,null,null,{"$error":"#N/A"},null,null,0,0]
[null,null,null,null,null,null,null,null,{"$error":"#N/A"},null,null,0,0]
[null,null,null,null,null,null,null,null,{"$error":"#N/A"},null,null,0,0]
[null,null,null,null,null,null,null,null,{"$error":"#N/A"},null,null,0,0]
[null,null,null,null,null,null,null,null,{"$error":"#N/A"},null,null,0,0]
[null,null,null,null,null,null,null,null,{"$error":"#N/A"},null,null,0,0]
[null,null,null,null,null,null,null,null,{"$error":"#N/A"},null,null,0,0]
[null,null,null,null,null,null,null,null,{"$error":"#N/A"},null,null,0,0]
[null,null,null,null,null,null,null,null,{"$error":"#N/A"},null,null,0,0]
[null,null,null,null,null,null,null,null,{"$error":"#N/A"},null,null,0,0]
[null,null,null,null,null,null,null,null,{"$error":"#N/A"},null,null,0,0]
[null,null,null,null,null,null,null,null,{"$error":"#N/A"},null,null,0,0]
[null,null,null,null,null,null,null,null,{"$error":"#N/A"},null,null,0,0]
[null,null,null,null,null,null,null,null,{"$error":"#N/A"},null,null,0,0]
[null,null,null,null,null,null,null,null,{"$error":"#N/A"},null,null,0,0]
[null,null,null,null,null,null,null,null,{"$error":"#N/A"},null,null,0,0]
[null,null,null,null,null,null,null,null,{"$error":"#N/A"},null,null,0,0]
[null,null,null,null,null,null,null,null,{"$f":"VLOOKUP(G450,$O$3:$P$32,2,1)","v":{"$error":"#N/A"}},null,null,{"$f":"COUNTIF($E$2:$E$1025,E450)","v":0},{"$f":"COUNTIF($F$2:$F$1025,F450)","v":0}]
[null,null,null,null,null,null,null,null,{"$error":"#N/A"},null,null,0,0]
[null,null,null,null,null,null,null,null,{"$error":"#N/A"},null,null,0,0]
[null,null,null,null,null,null,null,null,{"$error":"#N/A"},null,null,0,0]
[null,null,null,null,null,null,null,null,{"$error":"#N/A"},null,null,0,0]
[null,null,null,null,null,null,null,null,{"$error":"#N/A"},null,null,0,0]
[null,null,null,null,null,null,null,null,{"$error":"#N/A"},null,null,0,0]
[null,null,null,null,null,null,null,null,{"$error":"#N/A"},null,null,0,0]
[null,null,null,null,null,null,null,null,{"$error":"#N/A"},null,null,0,0]
[null,null,null,null,null,null,null,null,{"$error":"#N/A"},null,null,0,0]
[null,null,null,null,null,null,null,null,{"$error":"#N/A"},null,null,0,0]
[null,null,null,null,null,null,null,null,{"$error":"#N/A"},null,null,0,0]
[null,null,null,null,null,null,null,null,{"$error":"#N/A"},null,null,0,0]
[null,null,null,null,null,null,null,null,{"$error":"#N/A"},null,null,0,0]
[null,null,null,null,null,null,null,null,{"$error":"#N/A"},null,null,0,0]
[null,null,null,null,null,null,null,null,{"$error":"#N/A"},null,null,0,0]
[null,null,null,null,null,null,null,null,{"$error":"#N/A"},null,null,0,0]
[null,null,null,null,null,null,null,null,{"$error":"#N/A"},null,null,0,0]
[null,null,null,null,null,null,null,null,{"$error":"#N/A"},null,null,0,0]
[null,null,null,null,null,null,null,null,{"$error":"#N/A"},null,null,0,0]
[null,null,null,null,null,null,null,null,{"$error":"#N/A"},null,null,0,0]
[null,null,null,null,null,null,null,null,{"$error":"#N/A"},null,null,0,0]
[null,null,null,null,null,null,null,null,{"$error":"#N/A"},null,null,0,0]
[null,null,null,null,null,null,null,null,{"$error":"#N/A"},null,null,0,0]
[null,null,null,null,null,null,null,null,{"$error":"#N/A"},null,null,0,0]
[null,null,null,null,null,null,null,null,{"$error":"#N/A"},null,null,0,0]
[null,null,null,null,null,null,null,null,{"$error":"#N/A"},null,null,0,0]
[null,null,null,null,null,null,null,null,{"$error":"#N/A"},null,null,0,0]
[null,null,null,null,null,null,null,null,{"$error":"#N/A"},null,null,0,0]
[null,null,null,null,null,null,null,null,{"$error":"#N/A"},null,null,0,0]
[null,null,null,null,null,null,null,null,{"$error":"#N/A"},null,null,0,0]
[null,null,null,null,null,null,null,null,{"$error":"#N/A"},null,null,0,0]
[null,null,null,null,null,null,null,null,{"$error":"#N/A"},null,null,0,0]
[null,null,null,null,null,null,null,null,{"$error":"#N/A"},null,null,0,0]
[null,null,null,null,null,null,null,null,{"$error":"#N/A"},null,null,0,0]
[null,null,null,null,null,null,null,null,{"$error":"#N/A"},null,null,0,0]
[null,null,null,null,null,null,null,null,{"$error":"#N/A"},null,null,0,0]
[null,null,null,null,null,null,null,null,{"$error":"#N/A"},null,null,0,0]
[null,null,null,null,null,null,null,null,{"$error":"#N/A"},null,null,0,0]
[null,null,null,null,null,null,null,null,{"$error":"#N/A"},null,null,0,0]
[null,null,null,null,null,null,null,null,{"$error":"#N/A"},null,null,0,0]
[null,null,null,null,null,null,null,null,{"$error":"#N/A"},null,null,0,0]
[null,null,null,null,null,null,null,null,{"$error":"#N/A"},null,null,0,0]
[null,null,null,null,null,null,null,null,{"$error":"#N/A"},null,null,0,0]
[null,null,null,null,null,null,null,null,{"$error":"#N/A"},null,null,0,0]
[null,null,null,null,null,null,null,null,{"$error":"#N/A"},null,null,0,0]
[null,null,null,null,null,null,null,null,{"$error":"#N/A"},null,null,0,0]
[null,null,null,null,null,null,null,null,{"$error":"#N/A"},null,null,0,0]
[null,null,null,null,null,null,null,null,{"$error":"#N/A"},null,null,0,0]
[null,null,null,null,null,null,null,null,{"$error":"#N/A"},null,null,0,0]
[null,null,null,null,null,null,null,null,{"$error":"#N/A"},null,null,0,0]
[null,null,null,null,null,null,null,null,{"$error":"#N/A"},null,null,0,0]
[null,null,null,null,null,null,null,null,{"$error":"#N/A"},null,null,0,0]
[null,null,null,null,null,null,null,null,{"$error":"#N/A"},null,null,0,0]
[null,null,null,null,null,null,null,null,{"$error":"#N/A"},null,null,0,0]
[null,null,null,null,null,null,null,null,{"$error":"#N/A"},null,null,0,0]
[null,null,null,null,null,null,null,null,{"$error":"#N/A"},null,null,0,0]
[null,null,null,null,null,null,null,null,{"$error":"#N/A"},null,null,0,0]
[null,null,null,null,null,null,null,null,{"$error":"#N/A"},null,null,0,0]
[null,null,null,null,null,null,null,null,{"$error":"#N/A"},null,null,0,0]
[null,null,null,null,null,null,null,null,{"$error":"#N/A"},null,null,0,0]
[null,null,null,null,null,null,null,null,{"$error":"#N/A"},null,null,0,0]
[null,null,null,null,null,null,null,null,{"$error":"#N/A"},null,null,0,0]
[null,null,null,null,null,null,null,null,{"$error":"#N/A"},null,null,0,0]
[null,null,null,null,null,null,null,null,{"$f":"VLOOKUP(G514,$O$3:$P$32,2,1)","v":{"$error":"#N/A"}},null,null,{"$f":"COUNTIF($E$2:$E$1025,E514)","v":0},{"$f":"COUNTIF($F$2:$F$1025,F514)","v":0}]
[null,null,null,null,null,null,null,null,{"$error":"#N/A"},null,null,0,0]
[null,null,null,null,null,null,null,null,{"$error":"#N/A"},null,null,0,0]
[null,null,null,null,null,null,null,null,{"$error":"#N/A"},null,null,0,0]
[null,null,null,null,null,null,null,null,{"$error":"#N/A"},null,null,0,0]
[null,null,null,null,null,null,null,null,{"$error":"#N/A"},null,null,0,0]
[null,null,null,null,null,null,null,null,{"$error":"#N/A"},null,null,0,0]
[null,null,null,null,null,null,null,null,{"$error":"#N/A"},null,null,0,0]
[null,null,null,null,null,null,null,null,{"$error":"#N/A"},null,null,0,0]
[null,null,null,null,null,null,null,null,{"$error":"#N/A"},null,null,0,0]
[null,null,null,null,null,null,null,null,{"$error":"#N/A"},null,null,0,0]
[null,null,null,null,null,null,null,null,{"$error":"#N/A"},null,null,0,0]
[null,null,null,null,null,null,null,null,{"$error":"#N/A"},null,null,0,0]
[null,null,null,null,null,null,null,null,{"$error":"#N/A"},null,null,0,0]
[null,null,null,null,null,null,null,null,{"$error":"#N/A"},null,null,0,0]
[null,null,null,null,null,null,null,null,{"$error":"#N/A"},null,null,0,0]
[null,null,null,null,null,null,null,null,{"$error":"#N/A"},null,null,0,0]
[null,null,null,null,null,null,null,null,{"$error":"#N/A"},null,null,0,0]
[null,null,null,null,null,null,null,null,{"$error":"#N/A"},null,null,0,0]
[null,null,null,null,null,null,null,null,{"$error":"#N/A"},null,null,0,0]
[null,null,null,null,null,null,null,null,{"$error":"#N/A"},null,null,0,0]
[null,null,null,null,null,null,null,null,{"$error":"#N/A"},null,null,0,0]
[null,null,null,null,null,null,null,null,{"$error":"#N/A"},null,null,0,0]
[null,null,null,null,null,null,null,null,{"$error":"#N/A"},null,null,0,0]
[null,null,null,null,null,null,null,null,{"$error":"#N/A"},null,null,0,0]
[null,null,null,null,null,null,null,null,{"$error":"#N/A"},null,null,0,0]
[null,null,null,null,null,null,null,null,{"$error":"#N/A"},null,null,0,0]
[null,null,null,null,null,null,null,null,{"$error":"#N/A"},null,null,0,0]
[null,null,null,null,null,null,null,null,{"$error":"#N/A"},null,null,0,0]
[null,null,null,null,null,null,null,null,{"$error":"#N/A"},null,null,0,0]
[null,null,null,null,null,null,null,null,{"$error":"#N/A"},null,null,0,0]
[null,null,null,null,null,null,null,null,{"$error":"#N/A"},null,null,0,0]
[null,null,null,null,null,null,null,null,{"$error":"#N/A"},null,null,0,0]
[null,null,null,null,null,null,null,null,{"$error":"#N/A"},null,null,0,0]
[null,null,null,null,null,null,null,null,{"$error":"#N/A"},null,null,0,0]
[null,null,null,null,null,null,null,null,{"$error":"#N/A"},null,null,0,0]
[null,null,null,null,null,null,null,null,{"$error":"#N/A"},null,null,0,0]
[null,null,null,null,null,null,null,null,{"$error":"#N/A"},null,null,0,0]
[null,null,null,null,null,null,null,null,{"$error":"#N/A"},null,null,0,0]
[null,null,null,null,null,null,null,null,{"$error":"#N/A"},null,null,0,0]
[null,null,null,null,null,null,null,null,{"$error":"#N/A"},null,null,0,0]
[null,null,null,null,null,null,null,null,{"$error":"#N/A"},null,null,0,0]
[null,null,null,null,null,null,null,null,{"$error":"#N/A"},null,null,0,0]
[null,null,null,null,null,null,null,null,{"$error":"#N/A"},null,null,0,0]
[null,null,null,null,null,null,null,null,{"$error":"#N/A"},null,null,0,0]
[null,null,null,null,null,null,null,null,{"$error":"#N/A"},null,null,0,0]
[null,null,null,null,null,null,null,null,{"$error":"#N/A"},null,null,0,0]
[null,null,null,null,null,null,null,null,{"$error":"#N/A"},null,null,0,0]
[null,null,null,null,null,null,null,null,{"$error":"#N/A"},null,null,0,0]
[null,null,null,null,null,null,null,null,{"$error":"#N/A"},null,null,0,0]
[null,null,null,null,null,null,null,null,{"$error":"#N/A"},null,null,0,0]
[null,null,null,null,null,null,null,null,{"$error":"#N/A"},null,null,0,0]
[null,null,null,null,null,null,null,null,{"$error":"#N/A"},null,null,0,0]
[null,null,null,null,null,null,null,null,{"$error":"#N/A"},null,null,0,0]
[null,null,null,null,null,null,null,null,{"$error":"#N/A"},null,null,0,0]
[null,null,null,null,null,null,null,null,{"$error":"#N/A"},null,null,0,0]
[null,null,null,null,null,null,null,null,{"$error":"#N/A"},null,null,0,0]
[null,null,null,null,null,null,null,null,{"$error":"#N/A"},null,null,0,0]
[null,null,null,null,null,null,null,null,{"$error":"#N/A"},null,null,0,0]
[null,null,null,null,null,null,null,null,{"$error":"#N/A"},null,null,0,0]
[null,null,null,null,null,null,null,null,{"$error":"#N/A"},null,null,0,0]
[null,null,null,null,null,null,null,null,{"$error":"#N/A"},null,null,0,0]
[null,null,null,null,null,null,null,null,{"$error":"#N/A"},null,null,0,0]
[null,null,null,null,null,null,null,null,{"$error":"#N/A"},null,null,0,0]
[null,null,null,null,null,null,null,null,{"$f":"VLOOKUP(G578,$O$3:$P$32,2,1)","v":{"$error":"#N/A"}},null,null,{"$f":"COUNTIF($E$2:$E$1025,E578)","v":0},{"$f":"COUNTIF($F$2:$F$1025,F578)","v":0}]
[null,null,null,null,null,null,null,null,{"$error":"#N/A"},null,null,0,0]
[null,null,null,null,null,null,null,null,{"$error":"#N/A"},null,null,0,0]
[null,null,null,null,null,null,null,null,{"$error":"#N/A"},null,null,0,0]
[null,null,null,null,null,null,null,null,{"$error":"#N/A"},null,null,0,0]
[null,null,null,null,null,null,null,null,{"$error":"#N/A"},null,null,0,0]
[null,null,null,null,null,null,null,null,{"$error":"#N/A"},null,null,0,0]
[null,null,null,null,null,null,null,null,{"$error":"#N/A"},null,null,0,0]
[null,null,null,null,null,null,null,null,{"$error":"#N/A"},null,null,0,0]
[null,null,null,null,null,null,null,null,{"$error":"#N/A"},null,null,0,0]
[null,null,null,null,null,null,null,null,{"$error":"#N/A"},null,null,0,0]
[null,null,null,null,null,null,null,null,{"$error":"#N/A"},null,null,0,0]
[null,null,null,null,null,null,null,null,{"$error":"#N/A"},null,null,0,0]
[null,null,null,null,null,null,null,null,{"$error":"#N/A"},null,null,0,0]
[null,null,null,null,null,null,null,null,{"$error":"#N/A"},null,null,0,0]
[null,null,null,null,null,null,null,null,{"$error":"#N/A"},null,null,0,0]
[null,null,null,null,null,null,null,null,{"$error":"#N/A"},null,null,0,0]
[null,null,null,null,null,null,null,null,{"$error":"#N/A"},null,null,0,0]
[null,null,null,null,null,null,null,null,{"$error":"#N/A"},null,null,0,0]
[null,null,null,null,null,null,null,null,{"$error":"#N/A"},null,null,0,0]
[null,null,null,null,null,null,null,null,{"$error":"#N/A"},null,null,0,0]
[null,null,null,null,null,null,null,null,{"$error":"#N/A"},null,null,0,0]
[null,null,null,null,null,null,null,null,{"$error":"#N/A"},null,null,0,0]
[null,null,null,null,null,null,null,null,{"$error":"#N/A"},null,null,0,0]
[null,null,null,null,null,null,null,null,{"$error":"#N/A"},null,null,0,0]
[null,null,null,null,null,null,null,null,{"$error":"#N/A"},null,null,0,0]
[null,null,null,null,null,null,null,null,{"$error":"#N/A"},null,null,0,0]
[null,null,null,null,null,null,null,null,{"$error":"#N/A"},null,null,0,0]
[null,null,null,null,null,null,null,null,{"$error":"#N/A"},null,null,0,0]
[null,null,null,null,null,null,null,null,{"$error":"#N/A"},null,null,0,0]
[null,null,null,null,null,null,null,null,{"$error":"#N/A"},null,null,0,0]
[null,null,null,null,null,null,null,null,{"$error":"#N/A"},null,null,0,0]
[null,null,null,null,null,null,null,null,{"$error":"#N/A"},null,null,0,0]
[null,null,null,null,null,null,null,null,{"$error":"#N/A"},null,null,0,0]
[null,null,null,null,null,null,null,null,{"$error":"#N/A"},null,null,0,0]
[null,null,null,null,null,null,null,null,{"$error":"#N/A"},null,null,0,0]
[null,null,null,null,null,null,null,null,{"$error":"#N/A"},null,null,0,0]
[null,null,null,null,null,null,null,null,{"$error":"#N/A"},null,null,0,0]
[null,null,null,null,null,null,null,null,{"$error":"#N/A"},null,null,0,0]
[null,null,null,null,null,null,null,null,{"$error":"#N/A"},null,null,0,0]
[null,null,null,null,null,null,null,null,{"$error":"#N/A"},null,null,0,0]
[null,null,null,null,null,null,null,null,{"$error":"#N/A"},null,null,0,0]
[null,null,null,null,null,null,null,null,{"$error":"#N/A"},null,null,0,0]
[null,null,null,null,null,null,null,null,{"$error":"#N/A"},null,null,0,0]
[null,null,null,null,null,null,null,null,{"$error":"#N/A"},null,null,0,0]
[null,null,null,null,null,null,null,null,{"$error":"#N/A"},null,null,0,0]
[null,null,null,null,null,null,null,null,{"$error":"#N/A"},null,null,0,0]
[null,null,null,null,null,null,null,null,{"$error":"#N/A"},null,null,0,0]
[null,null,null,null,null,null,null,null,{"$error":"#N/A"},null,null,0,0]
[null,null,null,null,null,null,null,null,{"$error":"#N/A"},null,null,0,0]
[null,null,null,null,null,null,null,null,{"$error":"#N/A"},null,null,0,0]
[null,null,null,null,null,null,null,null,{"$error":"#N/A"},null,null,0,0]
[null,null,null,null,null,null,null,null,{"$error":"#N/A"},null,null,0,0]
[null,null,null,null,null,null,null,null,{"$error":"#N/A"},null,null,0,0]
[null,null,null,null,null,null,null,null,{"$error":"#N/A"},null,null,0,0]
[null,null,null,null,null,null,null,null,{"$error":"#N/A"},null,null,0,0]
[null,null,null,null,null,null,null,null,{"$error":"#N/A"},null,null,0,0]
[null,null,null,null,null,null,null,null,{"$error":"#N/A"},null,null,0,0]
[null,null,null,null,null,null,null,null,{"$error":"#N/A"},null,null,0,0]
[null,null,null,null,null,null,null,null,{"$error":"#N/A"},null,null,0,0]
[null,null,null,null,null,null,null,null,{"$error":"#N/A"},null,null,0,0]
[null,null,null,null,null,null,null,null,{"$error":"#N/A"},null,null,0,0]
[null,null,null,null,null,null,null,null,{"$error":"#N/A"},null,null,0,0]
[null,null,null,null,null,null,null,null,{"$error":"#N/A"},null,null,0,0]
[null,null,null,null,null,null,null,null,{"$f":"VLOOKUP(G642,$O$3:$P$32,2,1)","v":{"$error":"#N/A"}},null,null,{"$f":"COUNTIF($E$2:$E$1025,E642)","v":0},{"$f":"COUNTIF($F$2:$F$1025,F642)","v":0}]
[null,null,null,null,null,null,null,null,{"$error":"#N/A"},null,null,0,0]
[null,null,null,null,null,null,null,null,{"$error":"#N/A"},null,null,0,0]
[null,null,null,null,null,null,null,null,{"$error":"#N/A"},null,null,0,0]
[null,null,null,null,null,null,null,null,{"$error":"#N/A"},null,null,0,0]
[null,null,null,null,null,null,null,null,{"$error":"#N/A"},null,null,0,0]
[null,null,null,null,null,null,null,null,{"$error":"#N/A"},null,null,0,0]
[null,null,null,null,null,null,null,null,{"$error":"#N/A"},null,null,0,0]
[null,null,null,null,null,null,null,null,{"$error":"#N/A"},null,null,0,0]
[null,null,null,null,null,null,null,null,{"$error":"#N/A"},null,null,0,0]
[null,null,null,null,null,null,null,null,{"$error":"#N/A"},null,null,0,0]
[null,null,null,null,null,null,null,null,{"$error":"#N/A"},null,null,0,0]
[null,null,null,null,null,null,null,null,{"$error":"#N/A"},null,null,0,0]
[null,null,null,null,null,null,null,null,{"$error":"#N/A"},null,null,0,0]
[null,null,null,null,null,null,null,null,{"$error":"#N/A"},null,null,0,0]
[null,null,null,null,null,null,null,null,{"$error":"#N/A"},null,null,0,0]
[null,null,null,null,null,null,null,null,{"$error":"#N/A"},null,null,0,0]
[null,null,null,null,null,null,null,null,{"$error":"#N/A"},null,null,0,0]
[null,null,null,null,null,null,null,null,{"$error":"#N/A"},null,null,0,0]
[null,null,null,null,null,null,null,null,{"$error":"#N/A"},null,null,0,0]
[null,null,null,null,null,null,null,null,{"$error":"#N/A"},null,null,0,0]
[null,null,null,null,null,null,null,null,{"$error":"#N/A"},null,null,0,0]
[null,null,null,null,null,null,null,null,{"$error":"#N/A"},null,null,0,0]
[null,null,null,null,null,null,null,null,{"$error":"#N/A"},null,null,0,0]
[null,null,null,null,null,null,null,null,{"$error":"#N/A"},null,null,0,0]
[null,null,null,null,null,null,null,null,{"$error":"#N/A"},null,null,0,0]
[null,null,null,null,null,null,null,null,{"$error":"#N/A"},null,null,0,0]
[null,null,null,null,null,null,null,null,{"$error":"#N/A"},null,null,0,0]
[null,null,null,null,null,null,null,null,{"$error":"#N/A"},null,null,0,0]
[null,null,null,null,null,null,null,null,{"$error":"#N/A"},null,null,0,0]
[null,null,null,null,null,null,null,null,{"$error":"#N/A"},null,null,0,0]
[null,null,null,null,null,null,null,null,{"$error":"#N/A"},null,null,0,0]
[null,null,null,null,null,null,null,null,{"$error":"#N/A"},null,null,0,0]
[null,null,null,null,null,null,null,null,{"$error":"#N/A"},null,null,0,0]
[null,null,null,null,null,null,null,null,{"$error":"#N/A"},null,null,0,0]
[null,null,null,null,null,null,null,null,{"$error":"#N/A"},null,null,0,0]
[null,null,null,null,null,null,null,null,{"$error":"#N/A"},null,null,0,0]
[null,null,null,null,null,null,null,null,{"$error":"#N/A"},null,null,0,0]
[null,null,null,null,null,null,null,null,{"$error":"#N/A"},null,null,0,0]
[null,null,null,null,null,null,null,null,{"$error":"#N/A"},null,null,0,0]
[null,null,null,null,null,null,null,null,{"$error":"#N/A"},null,null,0,0]
[null,null,null,null,null,null,null,null,{"$error":"#N/A"},null,null,0,0]
[null,null,null,null,null,null,null,null,{"$error":"#N/A"},null,null,0,0]
[null,null,null,null,null,null,null,null,{"$error":"#N/A"},null,null,0,0]
[null,null,null,null,null,null,null,null,{"$error":"#N/A"},null,null,0,0]
[null,null,null,null,null,null,null,null,{"$error":"#N/A"},null,null,0,0]
[null,null,null,null,null,null,null,null,{"$error":"#N/A"},null,null,0,0]
[null,null,null,null,null,null,null,null,{"$error":"#N/A"},null,null,0,0]
[null,null,null,null,null,null,null,null,{"$error":"#N/A"},null,null,0,0]
[null,null,null,null,null,null,null,null,{"$error":"#N/A"},null,null,0,0]
[null,null,null,null,null,null,null,null,{"$error":"#N/A"},null,null,0,0]
[null,null,null,null,null,null,null,null,{"$error":"#N/A"},null,null,0,0]
[null,null,null,null,null,null,null,null,{"$error":"#N/A"},null,null,0,0]
[null,null,null,null,null,null,null,null,{"$error":"#N/A"},null,null,0,0]
[null,null,null,null,null,null,null,null,{"$error":"#N/A"},null,null,0,0]
[null,null,null,null,null,null,null,null,{"$error":"#N/A"},null,null,0,0]
[null,null,null,null,null,null,null,null,{"$error":"#N/A"},null,null,0,0]
[null,null,null,null,null,null,null,null,{"$error":"#N/A"},null,null,0,0]
[null,null,null,null,null,null,null,null,{"$error":"#N/A"},null,null,0,0]
[null,null,null,null,null,null,null,null,{"$error":"#N/A"},null,null,0,0]
[null,null,null,null,null,null,null,null,{"$error":"#N/A"},null,null,0,0]
[null,null,null,null,null,null,null,null,{"$error":"#N/A"},null,null,0,0]
[null,null,null,null,null,null,null,null,{"$error":"#N/A"},null,null,0,0]
[null,null,null,null,null,null,null,null,{"$error":"#N/A"},null,null,0,0]
[null,null,null,null,null,null,null,null,{"$f":"VLOOKUP(G706,$O$3:$P$32,2,1)","v":{"$error":"#N/A"}},null,null,{"$f":"COUNTIF($E$2:$E$1025,E706)","v":0},{"$f":"COUNTIF($F$2:$F$1025,F706)","v":0}]
[null,null,null,null,null,null,null,null,{"$error":"#N/A"},null,null,0,0]
[null,null,null,null,null,null,null,null,{"$error":"#N/A"},null,null,0,0]
[null,null,null,null,null,null,null,null,{"$error":"#N/A"},null,null,0,0]
[null,null,null,null,null,null,null,null,{"$error":"#N/A"},null,null,0,0]
[null,null,null,null,null,null,null,null,{"$error":"#N/A"},null,null,0,0]
[null,null,null,null,null,null,null,null,{"$error":"#N/A"},null,null,0,0]
[null,null,null,null,null,null,null,null,{"$error":"#N/A"},null,null,0,0]
[null,null,null,null,null,null,null,null,{"$error":"#N/A"},null,null,0,0]
[null,null,null,null,null,null,null,null,{"$error":"#N/A"},null,null,0,0]
[null,null,null,null,null,null,null,null,{"$error":"#N/A"},null,null,0,0]
[null,null,null,null,null,null,null,null,{"$error":"#N/A"},null,null,0,0]
[null,null,null,null,null,null,null,null,{"$error":"#N/A"},null,null,0,0]
[null,null,null,null,null,null,null,null,{"$error":"#N/A"},null,null,0,0]
[null,null,null,null,null,null,null,null,{"$error":"#N/A"},null,null,0,0]
[null,null,null,null,null,null,null,null,{"$error":"#N/A"},null,null,0,0]
[null,null,null,null,null,null,null,null,{"$error":"#N/A"},null,null,0,0]
[null,null,null,null,null,null,null,null,{"$error":"#N/A"},null,null,0,0]
[null,null,null,null,null,null,null,null,{"$error":"#N/A"},null,null,0,0]
[null,null,null,null,null,null,null,null,{"$error":"#N/A"},null,null,0,0]
[null,null,null,null,null,null,null,null,{"$error":"#N/A"},null,null,0,0]
[null,null,null,null,null,null,null,null,{"$error":"#N/A"},null,null,0,0]
[null,null,null,null,null,null,null,null,{"$error":"#N/A"},null,null,0,0]
[null,null,null,null,null,null,null,null,{"$error":"#N/A"},null,null,0,0]
[null,null,null,null,null,null,null,null,{"$error":"#N/A"},null,null,0,0]
[null,null,null,null,null,null,null,null,{"$error":"#N/A"},null,null,0,0]
[null,null,null,null,null,null,null,null,{"$error":"#N/A"},null,null,0,0]
[null,null,null,null,null,null,null,null,{"$error":"#N/A"},null,null,0,0]
[null,null,null,null,null,null,null,null,{"$error":"#N/A"},null,null,0,0]
[null,null,null,null,null,null,null,null,{"$error":"#N/A"},null,null,0,0]
[null,null,null,null,null,null,null,null,{"$error":"#N/A"},null,null,0,0]
[null,null,null,null,null,null,null,null,{"$error":"#N/A"},null,null,0,0]
[null,null,null,null,null,null,null,null,{"$error":"#N/A"},null,null,0,0]
[null,null,null,null,null,null,null,null,{"$error":"#N/A"},null,null,0,0]
[null,null,null,null,null,null,null,null,{"$error":"#N/A"},null,null,0,0]
[null,null,null,null,null,null,null,null,{"$error":"#N/A"},null,null,0,0]
[null,null,null,null,null,null,null,null,{"$error":"#N/A"},null,null,0,0]
[null,null,null,null,null,null,null,null,{"$error":"#N/A"},null,null,0,0]
[null,null,null,null,null,null,null,null,{"$error":"#N/A"},null,null,0,0]
[null,null,null,null,null,null,null,null,{"$error":"#N/A"},null,null,0,0]
[null,null,null,null,null,null,null,null,{"$error":"#N/A"},null,null,0,0]
[null,null,null,null,null,null,null,null,{"$error":"#N/A"},null,null,0,0]
[null,null,null,null,null,null,null,null,{"$error":"#N/A"},null,null,0,0]
[null,null,null,null,null,null,null,null,{"$error":"#N/A"},null,null,0,0]
[null,null,null,null,null,null,null,null,{"$error":"#N/A"},null,null,0,0]
[null,null,null,null,null,null,null,null,{"$error":"#N/A"},null,null,0,0]
[null,null,null,null,null,null,null,null,{"$error":"#N/A"},null,null,0,0]
[null,null,null,null,null,null,null,null,{"$error":"#N/A"},null,null,0,0]
[null,null,null,null,null,null,null,null,{"$error":"#N/A"},null,null,0,0]
[null,null,null,null,null,null,null,null,{"$error":"#N/A"},null,null,0,0]
[null,null,null,null,null,null,null,null,{"$error":"#N/A"},null,null,0,0]
[null,null,null,null,null,null,null,null,{"$error":"#N/A"},null,null,0,0]
[null,null,null,null,null,null,null,null,{"$error":"#N/A"},null,null,0,0]
[null,null,null,null,null,null,null,null,{"$error":"#N/A"},null,null,0,0]
[null,null,null,null,null,null,null,null,{"$error":"#N/A"},null,null,0,0]
[null,null,null,null,null,null,null,null,{"$error":"#N/A"},null,null,0,0]
[null,null,null,null,null,null,null,null,{"$error":"#N/A"},null,null,0,0]
[null,null,null,null,null,null,null,null,{"$error":"#N/A"},null,null,0,0]
[null,null,null,null,null,null,null,null,{"$error":"#N/A"},null,null,0,0]
[null,null,null,null,null,null,null,null,{"$error":"#N/A"},null,null,0,0]
[null,null,null,null,null,null,null,null,{"$error":"#N/A"},null,null,0,0]
[null,null,null,null,null,null,null,null,{"$error":"#N/A"},null,null,0,0]
[null,null,null,null,null,null,null,null,{"$error":"#N/A"},null,null,0,0]
[null,null,null,null,null,null,null,null,{"$error":"#N/A"},null,null,0,0]
[null,null,null,null,null,null,null,null,{"$f":"VLOOKUP(G770,$O$3:$P$32,2,1)","v":{"$error":"#N/A"}},null,null,{"$f":"COUNTIF($E$2:$E$1025,E770)","v":0},{"$f":"COUNTIF($F$2:$F$1025,F770)","v":0}]
[null,null,null,null,null,null,null,null,{"$error":"#N/A"},null,null,0,0]
[null,null,null,null,null,null,null,null,{"$error":"#N/A"},null,null,0,0]
[null,null,null,null,null,null,null,null,{"$error":"#N/A"},null,null,0,0]
[null,null,null,null,null,null,null,null,{"$error":"#N/A"},null,null,0,0]
[null,null,null,null,null,null,null,null,{"$error":"#N/A"},null,null,0,0]
[null,null,null,null,null,null,null,null,{"$error":"#N/A"},null,null,0,0]
[null,null,null,null,null,null,null,null,{"$error":"#N/A"},null,null,0,0]
[null,null,null,null,null,null,null,null,{"$error":"#N/A"},null,null,0,0]
[null,null,null,null,null,null,null,null,{"$error":"#N/A"},null,null,0,0]
[null,null,null,null,null,null,null,null,{"$error":"#N/A"},null,null,0,0]
[null,null,null,null,null,null,null,null,{"$error":"#N/A"},null,null,0,0]
[null,null,null,null,null,null,null,null,{"$error":"#N/A"},null,null,0,0]
[null,null,null,null,null,null,null,null,{"$error":"#N/A"},null,null,0,0]
[null,null,null,null,null,null,null,null,{"$error":"#N/A"},null,null,0,0]
[null,null,null,null,null,null,null,null,{"$error":"#N/A"},null,null,0,0]
[null,null,null,null,null,null,null,null,{"$error":"#N/A"},null,null,0,0]
[null,null,null,null,null,null,null,null,{"$error":"#N/A"},null,null,0,0]
[null,null,null,null,null,null,null,null,{"$error":"#N/A"},null,null,0,0]
[null,null,null,null,null,null,null,null,{"$error":"#N/A"},null,null,0,0]
[null,null,null,null,null,null,null,null,{"$error":"#N/A"},null,null,0,0]
[null,null,null,null,null,null,null,null,{"$error":"#N/A"},null,null,0,0]
[null,null,null,null,null,null,null,null,{"$error":"#N/A"},null,null,0,0]
[null,null,null,null,null,null,null,null,{"$error":"#N/A"},null,null,0,0]
[null,null,null,null,null,null,null,null,{"$error":"#N/A"},null,null,0,0]
[null,null,null,null,null,null,null,null,{"$error":"#N/A"},null,null,0,0]
[null,null,null,null,null,null,null,null,{"$error":"#N/A"},null,null,0,0]
[null,null,null,null,null,null,null,null,{"$error":"#N/A"},null,null,0,0]
[null,null,null,null,null,null,null,null,{"$error":"#N/A"},null,null,0,0]
[null,null,null,null,null,null,null,null,{"$error":"#N/A"},null,null,0,0]
[null,null,null,null,null,null,null,null,{"$error":"#N/A"},null,null,0,0]
[null,null,null,null,null,null,null,null,{"$error":"#N/A"},null,null,0,0]
[null,null,null,null,null,null,null,null,{"$error":"#N/A"},null,null,0,0]
[null,null,null,null,null,null,null,null,{"$error":"#N/A"},null,null,0,0]
[null,null,null,null,null,null,null,null,{"$error":"#N/A"},null,null,0,0]
[null,null,null,null,null,null,null,null,{"$error":"#N/A"},null,null,0,0]
[null,null,null,null,null,null,null,null,{"$error":"#N/A"},null,null,0,0]
[null,null,null,null,null,null,null,null,{"$error":"#N/A"},null,null,0,0]
[null,null,null,null,null,null,null,null,{"$error":"#N/A"},null,null,0,0]
[null,null,null,null,null,null,null,null,{"$error":"#N/A"},null,null,0,0]
[null,null,null,null,null,null,null,null,{"$error":"#N/A"},null,null,0,0]
[null,null,null,null,null,null,null,null,{"$error":"#N/A"},null,null,0,0]
[null,null,null,null,null,null,null,null,{"$error":"#N/A"},null,null,0,0]
[null,null,null,null,null,null,null,null,{"$error":"#N/A"},null,null,0,0]
[null,null,null,null,null,null,null,null,{"$error":"#N/A"},null,null,0,0]
[null,null,null,null,null,null,null,null,{"$error":"#N/A"},null,null,0,0]
[null,null,null,null,null,null,null,null,{"$error":"#N/A"},null,null,0,0]
[null,null,null,null,null,null,null,null,{"$error":"#N/A"},null,null,0,0]
[null,null,null,null,null,null,null,null,{"$error":"#N/A"},null,null,0,0]
[null,null,null,null,null,null,null,null,{"$error":"#N/A"},null,null,0,0]
[null,null,null,null,null,null,null,null,{"$error":"#N/A"},null,null,0,0]
[null,null,null,null,null,null,null,null,{"$error":"#N/A"},null,null,0,0]
[null,null,null,null,null,null,null,null,{"$error":"#N/A"},null,null,0,0]
[null,null,null,null,null,null,null,null,{"$error":"#N/A"},null,null,0,0]
[null,null,null,null,null,null,null,null,{"$error":"#N/A"},null,null,0,0]
[null,null,null,null,null,null,null,null,{"$error":"#N/A"},null,null,0,0]
[null,null,null,null,null,null,null,null,{"$error":"#N/A"},null,null,0,0]
[null,null,null,null,null,null,null,null,{"$error":"#N/A"},null,null,0,0]
[null,null,null,null,null,null,null,null,{"$error":"#N/A"},null,null,0,0]
[null,null,null,null,null,null,null,null,{"$f":"VLOOKUP(G829,O830:P859,2,1)","v":{"$error":"#N/A"}},null,null,0,0]
[null,null,null,null,null,null,null,null,{"$error":"#N/A"},null,null,0,0]
[null,null,null,null,null,null,null,null,{"$error":"#N/A"},null,null,0,0]
[null,null,null,null,null,null,null,null,{"$error":"#N/A"},null,null,0,0]
[null,null,null,null,null,null,null,null,{"$error":"#N/A"},null,null,0,0]
[null,null,null,null,null,null,null,null,{"$error":"#N/A"},null,null,{"$f":"COUNTIF($E$2:$E$1025,E834)","v":0},{"$f":"COUNTIF($F$2:$F$1025,F834)","v":0}]
[null,null,null,null,null,null,null,null,{"$error":"#N/A"},null,null,0,0]
[null,null,null,null,null,null,null,null,{"$error":"#N/A"},null,null,0,0]
[null,null,null,null,null,null,null,null,{"$error":"#N/A"},null,null,0,0]
[null,null,null,null,null,null,null,null,{"$error":"#N/A"},null,null,0,0]
[null,null,null,null,null,null,null,null,{"$error":"#N/A"},null,null,0,0]
[null,null,null,null,null,null,null,null,{"$error":"#N/A"},null,null,0,0]
[null,null,null,null,null,null,null,null,{"$error":"#N/A"},null,null,0,0]
[null,null,null,null,null,null,null,null,{"$error":"#N/A"},null,null,0,0]
[null,null,null,null,null,null,null,null,{"$error":"#N/A"},null,null,0,0]
[null,null,null,null,null,null,null,null,{"$error":"#N/A"},null,null,0,0]
[null,null,null,null,null,null,null,null,{"$error":"#N/A"},null,null,0,0]
[null,null,null,null,null,null,null,null,{"$error":"#N/A"},null,null,0,0]
[null,null,null,null,null,null,null,null,{"$error":"#N/A"},null,null,0,0]
[null,null,null,null,null,null,null,null,{"$error":"#N/A"},null,null,0,0]
[null,null,null,null,null,null,null,null,{"$error":"#N/A"},null,null,0,0]
[null,null,null,null,null,null,null,null,{"$error":"#N/A"},null,null,0,0]
[null,null,null,null,null,null,null,null,{"$error":"#N/A"},null,null,0,0]
[null,null,null,null,null,null,null,null,{"$error":"#N/A"},null,null,0,0]
[null,null,null,null,null,null,null,null,{"$error":"#N/A"},null,null,0,0]
[null,null,null,null,null,null,null,null,{"$error":"#N/A"},null,null,0,0]
[null,null,null,null,null,null,null,null,{"$error":"#N/A"},null,null,0,0]
[null,null,null,null,null,null,null,null,{"$error":"#N/A"},null,null,0,0]
[null,null,null,null,null,null,null,null,{"$error":"#N/A"},null,null,0,0]
[null,null,null,null,null,null,null,null,{"$error":"#N/A"},null,null,0,0]
[null,null,null,null,null,null,null,null,{"$error":"#N/A"},null,null,0,0]
[null,null,null,null,null,null,null,null,{"$error":"#N/A"},null,null,0,0]
[null,null,null,null,null,null,null,null,{"$f":"VLOOKUP(G861,O862:P891,2,1)","v":{"$error":"#N/A"}},null,null,0,0]
[null,null,null,null,null,null,null,null,{"$error":"#N/A"},null,null,0,0]
[null,null,null,null,null,null,null,null,{"$error":"#N/A"},null,null,0,0]
[null,null,null,null,null,null,null,null,{"$error":"#N/A"},null,null,0,0]
[null,null,null,null,null,null,null,null,{"$error":"#N/A"},null,null,0,0]
[null,null,null,null,null,null,null,null,{"$error":"#N/A"},null,null,0,0]
[null,null,null,null,null,null,null,null,{"$error":"#N/A"},null,null,0,0]
[null,null,null,null,null,null,null,null,{"$error":"#N/A"},null,null,0,0]
[null,null,null,null,null,null,null,null,{"$error":"#N/A"},null,null,0,0]
[null,null,null,null,null,null,null,null,{"$error":"#N/A"},null,null,0,0]
[null,null,null,null,null,null,null,null,{"$error":"#N/A"},null,null,0,0]
[null,null,null,null,null,null,null,null,{"$error":"#N/A"},null,null,0,0]
[null,null,null,null,null,null,null,null,{"$error":"#N/A"},null,null,0,0]
[null,null,null,null,null,null,null,null,{"$error":"#N/A"},null,null,0,0]
[null,null,null,null,null,null,null,null,{"$error":"#N/A"},null,null,0,0]
[null,null,null,null,null,null,null,null,{"$error":"#N/A"},null,null,0,0]
[null,null,null,null,null,null,null,null,{"$error":"#N/A"},null,null,0,0]
[null,null,null,null,null,null,null,null,{"$error":"#N/A"},null,null,0,0]
[null,null,null,null,null,null,null,null,{"$error":"#N/A"},null,null,0,0]
[null,null,null,null,null,null,null,null,{"$error":"#N/A"},null,null,0,0]
[null,null,null,null,null,null,null,null,{"$error":"#N/A"},null,null,0,0]
[null,null,null,null,null,null,null,null,{"$error":"#N/A"},null,null,0,0]
[null,null,null,null,null,null,null,null,{"$error":"#N/A"},null,null,0,0]
[null,null,null,null,null,null,null,null,{"$error":"#N/A"},null,null,0,0]
[null,null,null,null,null,null,null,null,{"$error":"#N/A"},null,null,0,0]
[null,null,null,null,null,null,null,null,{"$error":"#N/A"},null,null,0,0]
[null,null,null,null,null,null,null,null,{"$error":"#N/A"},null,null,0,0]
[null,null,null,null,null,null,null,null,{"$error":"#N/A"},null,null,0,0]
[null,null,null,null,null,null,null,null,{"$error":"#N/A"},null,null,0,0]
[null,null,null,null,null,null,null,null,{"$error":"#N/A"},null,null,0,0]
[null,null,null,null,null,null,null,null,{"$error":"#N/A"},null,null,0,0]
[null,null,null,null,null,null,null,null,{"$error":"#N/A"},null,null,0,0]
[null,null,null,null,null,null,null,null,{"$f":"VLOOKUP(G893,O894:P923,2,1)","v":{"$error":"#N/A"}},null,null,0,0]
[null,null,null,null,null,null,null,null,{"$error":"#N/A"},null,null,0,0]
[null,null,null,null,null,null,null,null,{"$error":"#N/A"},null,null,0,0]
[null,null,null,null,null,null,null,null,{"$error":"#N/A"},null,null,0,0]
[null,null,null,null,null,null,null,null,{"$error":"#N/A"},null,null,0,0]
[null,null,null,null,null,null,null,null,{"$error":"#N/A"},null,null,{"$f":"COUNTIF($E$2:$E$1025,E898)","v":0},{"$f":"COUNTIF($F$2:$F$1025,F898)","v":0}]
[null,null,null,null,null,null,null,null,{"$error":"#N/A"},null,null,0,0]
[null,null,null,null,null,null,null,null,{"$error":"#N/A"},null,null,0,0]
[null,null,null,null,null,null,null,null,{"$error":"#N/A"},null,null,0,0]
[null,null,null,null,null,null,null,null,{"$error":"#N/A"},null,null,0,0]
[null,null,null,null,null,null,null,null,{"$error":"#N/A"},null,null,0,0]
[null,null,null,null,null,null,null,null,{"$error":"#N/A"},null,null,0,0]
[null,null,null,null,null,null,null,null,{"$error":"#N/A"},null,null,0,0]
[null,null,null,null,null,null,null,null,{"$error":"#N/A"},null,null,0,0]
[null,null,null,null,null,null,null,null,{"$error":"#N/A"},null,null,0,0]
[null,null,null,null,null,null,null,null,{"$error":"#N/A"},null,null,0,0]
[null,null,null,null,null,null,null,null,{"$error":"#N/A"},null,null,0,0]
[null,null,null,null,null,null,null,null,{"$error":"#N/A"},null,null,0,0]
[null,null,null,null,null,null,null,null,{"$error":"#N/A"},null,null,0,0]
[null,null,null,null,null,null,null,null,{"$error":"#N/A"},null,null,0,0]
[null,null,null,null,null,null,null,null,{"$error":"#N/A"},null,null,0,0]
[null,null,null,null,null,null,null,null,{"$error":"#N/A"},null,null,0,0]
[null,null,null,null,null,null,null,null,{"$error":"#N/A"},null,null,0,0]
[null,null,null,null,null,null,null,null,{"$error":"#N/A"},null,null,0,0]
[null,null,null,null,null,null,null,null,{"$error":"#N/A"},null,null,0,0]
[null,null,null,null,null,null,null,null,{"$error":"#N/A"},null,null,0,0]
[null,null,null,null,null,null,null,null,{"$error":"#N/A"},null,null,0,0]
[null,null,null,null,null,null,null,null,{"$error":"#N/A"},null,null,0,0]
[null,null,null,null,null,null,null,null,{"$error":"#N/A"},null,null,0,0]
[null,null,null,null,null,null,null,null,{"$error":"#N/A"},null,null,0,0]
[null,null,null,null,null,null,null,null,{"$error":"#N/A"},null,null,0,0]
[null,null,null,null,null,null,null,null,{"$error":"#N/A"},null,null,0,0]
[null,null,null,null,null,null,null,null,{"$f":"VLOOKUP(G925,O926:P955,2,1)","v":{"$error":"#N/A"}},null,null,0,0]
[null,null,null,null,null,null,null,null,{"$error":"#N/A"},null,null,0,0]
[null,null,null,null,null,null,null,null,{"$error":"#N/A"},null,null,0,0]
[null,null,null,null,null,null,null,null,{"$error":"#N/A"},null,null,0,0]
[null,null,null,null,null,null,null,null,{"$error":"#N/A"},null,null,0,0]
[null,null,null,null,null,null,null,null,{"$error":"#N/A"},null,null,0,0]
[null,null,null,null,null,null,null,null,{"$error":"#N/A"},null,null,0,0]
[null,null,null,null,null,null,null,null,{"$error":"#N/A"},null,null,0,0]
[null,null,null,null,null,null,null,null,{"$error":"#N/A"},null,null,0,0]
[null,null,null,null,null,null,null,null,{"$error":"#N/A"},null,null,0,0]
[null,null,null,null,null,null,null,null,{"$error":"#N/A"},null,null,0,0]
[null,null,null,null,null,null,null,null,{"$error":"#N/A"},null,null,0,0]
[null,null,null,null,null,null,null,null,{"$error":"#N/A"},null,null,0,0]
[null,null,null,null,null,null,null,null,{"$error":"#N/A"},null,null,0,0]
[null,null,null,null,null,null,null,null,{"$error":"#N/A"},null,null,0,0]
[null,null,null,null,null,null,null,null,{"$error":"#N/A"},null,null,0,0]
[null,null,null,null,null,null,null,null,{"$error":"#N/A"},null,null,0,0]
[null,null,null,null,null,null,null,null,{"$error":"#N/A"},null,null,0,0]
[null,null,null,null,null,null,null,null,{"$error":"#N/A"},null,null,0,0]
[null,null,null,null,null,null,null,null,{"$error":"#N/A"},null,null,0,0]
[null,null,null,null,null,null,null,null,{"$error":"#N/A"},null,null,0,0]
[null,null,null,null,null,null,null,null,{"$error":"#N/A"},null,null,0,0]
[null,null,null,null,null,null,null,null,{"$error":"#N/A"},null,null,0,0]
[null,null,null,null,null,null,null,null,{"$error":"#N/A"},null,null,0,0]
[null,null,null,null,null,null,null,null,{"$error":"#N/A"},null,null,0,0]
[null,null,null,null,null,null,null,null,{"$error":"#N/A"},null,null,0,0]
[null,null,null,null,null,null,null,null,{"$error":"#N/A"},null,null,0,0]
[null,null,null,null,null,null,null,null,{"$error":"#N/A"},null,null,0,0]
[null,null,null,null,null,null,null,null,{"$error":"#N/A"},null,null,0,0]
[null,null,null,null,null,null,null,null,{"$error":"#N/A"},null,null,0,0]
[null,null,null,null,null,null,null,null,{"$error":"#N/A"},null,null,0,0]
[null,null,null,null,null,null,null,null,{"$error":"#N/A"},null,null,0,0]
[null,null,null,null,null,null,null,null,{"$f":"VLOOKUP(G957,O958:P987,2,1)","v":{"$error":"#N/A"}},null,null,0,0]
[null,null,null,null,null,null,null,null,{"$error":"#N/A"},null,null,0,0]
[null,null,null,null,null,null,null,null,{"$error":"#N/A"},null,null,0,0]
[null,null,null,null,null,null,null,null,{"$error":"#N/A"},null,null,0,0]
[null,null,null,null,null,null,null,null,{"$error":"#N/A"},null,null,0,0]
[null,null,null,null,null,null,null,null,{"$error":"#N/A"},null,null,{"$f":"COUNTIF($E$2:$E$1025,E962)","v":0},{"$f":"COUNTIF($F$2:$F$1025,F962)","v":0}]
[null,null,null,null,null,null,null,null,{"$error":"#N/A"},null,null,0,0]
[null,null,null,null,null,null,null,null,{"$error":"#N/A"},null,null,0,0]
[null,null,null,null,null,null,null,null,{"$error":"#N/A"},null,null,0,0]
[null,null,null,null,null,null,null,null,{"$error":"#N/A"},null,null,0,0]
[null,null,null,null,null,null,null,null,{"$error":"#N/A"},null,null,0,0]
[null,null,null,null,null,null,null,null,{"$error":"#N/A"},null,null,0,0]
[null,null,null,null,null,null,null,null,{"$error":"#N/A"},null,null,0,0]
[null,null,null,null,null,null,null,null,{"$error":"#N/A"},null,null,0,0]
[null,null,null,null,null,null,null,null,{"$error":"#N/A"},null,null,0,0]
[null,null,null,null,null,null,null,null,{"$error":"#N/A"},null,null,0,0]
[null,null,null,null,null,null,null,null,{"$error":"#N/A"},null,null,0,0]
[null,null,null,null,null,null,null,null,{"$error":"#N/A"},null,null,0,0]
[null,null,null,null,null,null,null,null,{"$error":"#N/A"},null,null,0,0]
[null,null,null,null,null,null,null,null,{"$error":"#N/A"},null,null,0,0]
[null,null,null,null,null,null,null,null,{"$error":"#N/A"},null,null,0,0]
[null,null,null,null,null,null,null,null,{"$error":"#N/A"},null,null,0,0]
[null,null,null,null,null,null,null,null,{"$error":"#N/A"},null,null,0,0]
[null,null,null,null,null,null,null,null,{"$error":"#N/A"},null,null,0,0]
[null,null,null,null,null,null,null,null,{"$error":"#N/A"},null,null,0,0]
[null,null,null,null,null,null,null,null,{"$error":"#N/A"},null,null,0,0]
[null,null,null,null,null,null,null,null,{"$error":"#N/A"},null,null,0,0]
[null,null,null,null,null,null,null,null,{"$error":"#N/A"},null,null,0,0]
[null,null,null,null,null,null,null,null,{"$error":"#N/A"},null,null,0,0]
[null,null,null,null,null,null,null,null,{"$error":"#N/A"},null,null,0,0]
[null,null,null,null,null,null,null,null,{"$error":"#N/A"},null,null,0,0]
[null,null,null,null,null,null,null,null,{"$error":"#N/A"},null,null,0,0]
[null,null,null,null,null,null,null,null,{"$f":"VLOOKUP(G989,O990:P1019,2,1)","v":{"$error":"#N/A"}},null,null,0,0]
[null,null,null,null,null,null,null,null,{"$error":"#N/A"},null,null,0,0]
[null,null,null,null,null,null,null,null,{"$error":"#N/A"},null,null,0,0]
[null,null,null,null,null,null,null,null,{"$error":"#N/A"},null,null,0,0]
[null,null,null,null,null,null,null,null,{"$error":"#N/A"},null,null,0,0]
[null,null,null,null,null,null,null,null,{"$error":"#N/A"},null,null,0,0]
[null,null,null,null,null,null,null,null,{"$error":"#N/A"},null,null,0,0]
[null,null,null,null,null,null,null,null,{"$error":"#N/A"},null,null,0,0]
[null,null,null,null,null,null,null,null,{"$error":"#N/A"},null,null,0,0]
[null,null,null,null,null,null,null,null,{"$error":"#N/A"},null,null,0,0]
[null,null,null,null,null,null,null,null,{"$error":"#N/A"},null,null,0,0]
[null,null,null,null,null,null,null,null,{"$error":"#N/A"},null,null,0,0]
[null,null,null,null,null,null,null,null,{"$error":"#N/A"},null,null,0,0]
[null,null,null,null,null,null,null,null,{"$error":"#N/A"},null,null,0,0]
[null,null,null,null,null,null,null,null,{"$error":"#N/A"},null,null,0,0]
[null,null,null,null,null,null,null,null,{"$error":"#N/A"},null,null,0,0]
[null,null,null,null,null,null,null,null,{"$error":"#N/A"},null,null,0,0]
[null,null,null,null,null,null,null,null,{"$error":"#N/A"},null,null,0,0]
[null,null,null,null,null,null,null,null,{"$error":"#N/A"},null,null,0,0]
[null,null,null,null,null,null,null,null,{"$error":"#N/A"},null,null,0,0]
[null,null,null,null,null,null,null,null,{"$error":"#N/A"},null,null,0,0]
[null,null,null,null,null,null,null,null,{"$error":"#N/A"},null,null,0,0]
[null,null,null,null,null,null,null,null,{"$error":"#N/A"},null,null,0,0]
[null,null,null,null,null,null,null,null,{"$error":"#N/A"},null,null,0,0]
[null,null,null,null,null,null,null,null,{"$error":"#N/A"},null,null,0,0]
[null,null,null,null,null,null,null,null,{"$error":"#N/A"},null,null,0,0]
[null,null,null,null,null,null,null,null,{"$error":"#N/A"},null,null,0,0]
[null,null,null,null,null,null,null,null,{"$error":"#N/A"},null,null,0,0]
[null,null,null,null,null,null,null,null,{"$error":"#N/A"},null,null,0,0]
[null,null,null,null,null,null,null,null,{"$error":"#N/A"},null,null,0,0]
[null,null,null,null,null,null,null,null,{"$error":"#N/A"},null,null,0,0]
[null,null,null,null,null,null,null,null,{"$error":"#N/A"},null,null,0,0]
[null,null,null,null,null,null,null,null,{"$f":"VLOOKUP(G1021,O1022:P1051,2,1)","v":{"$error":"#N/A"}},null,null,0,0]
[null,null,null,null,null,null,null,null,{"$error":"#N/A"},null,null,0,0]
[null,null,null,null,null,null,null,null,{"$error":"#N/A"},null,null,0,0]
[null,null,null,null,null,null,null,null,{"$error":"#N/A"},null,null,0,0]
[null,null,null,null,null,null,null,null,{"$error":"#N/A"},null,null,0,0]

{"sheet":"Awards","index":11,"n_rows":15,"n_cols":22,"rows_kept":15,"cut":false,"hidden":false,"merged":[[1,0,1,4]]}
[null,null,null,null,null,null,null,null,null,null,null,"FillRows",{"$f":"COUNTA(P:P)+1","v":15}]
["Raw Men 3-Lift 74-kg cls",null,null,null,null,null,null,null,null,{"$f":"OFFSET($V$1,MATCH(A2,$U:$U,0)-1,0)","v":{"$error":"#N/A"}},null,{"$f":"CONCATENATE(\"U3:U\",M1)","v":"U3:U15"},null,null,null,"Div","Cls","Event"]
["PLACE","NAME",{"$f":"Lifting!E3","v":"Kg"},"IPF Pts.","Team",null,null,null,"row",null,null,"PL","3-Lift",null,null,"F-M1-U",63,"PL",{"$f":"IF($P3=\"Wilks\",$P3,VLOOKUP($P3,Setup!$I:$J,2,FALSE))","v":"Raw Women (40-49)"},{"$f":"VLOOKUP(R3,$L$3:$M$7,2,FALSE)","v":"3-Lift"},{"$f":"CONCATENATE($S3,\" \",$T3,\" \",IF($Q3=\"\",\"\",CONCATENATE($Q3,\"-\",$M$10)))","v":"Raw Women (40-49) 3-Lift 63-kg cls"},{"$f":"CONCATENATE(P3,\"/\",Q3,\"/\",R3)","v":"F-M1-U/63/PL"}]
[1,{"$f":"IFERROR(INDIRECT(CONCATENATE(\"QuickPrint!B\",I4)),\"\")","v":""},{"$f":"IFERROR(INDIRECT(CONCATENATE(\"QuickPrint!Y\",I4)),\"\")","v":""},{"$f":"IFERROR(INDIRECT(CONCATENATE(\"QuickPrint!\",IF($J$10=3,\"AD\",\"AC\"),I4)),\"\")","v":""},{"$f":"IFERROR(VLOOKUP(INDIRECT(CONCATENATE(\"QuickPrint!c\",I4)),Setup!$M$6:$N$93,2,FALSE),\"\")","v":""},null,null,null,{"$f":"MATCH(J4,INDIRECT(CONCATENATE(\"QuickPrint!$Z:$Z\")),0)","v":{"$error":"#N/A"}},{"$f":"CONCATENATE(\"1/\",$J$2)","v":{"$error":"#N/A"}},null,"BP","Bench Press",null,null,"F-M1-U",72,"PL",{"$f":"IF($P4=\"Wilks\",$P4,VLOOKUP($P4,Setup!$I:$J,2,FALSE))","v":"Raw Women (40-49)"},{"$f":"VLOOKUP(R4,$L$3:$M$7,2,FALSE)","v":"3-Lift"},{"$f":"CONCATENATE($S4,\" \",$T4,\" \",IF($Q4=\"\",\"\",CONCATENATE($Q4,\"-\",$M$10)))","v":"Raw Women (40-49) 3-Lift 72-kg cls"},{"$f":"CONCATENATE(P4,\"/\",Q4,\"/\",R4)","v":"F-M1-U/72/PL"}]
[2,{"$f":"IFERROR(INDIRECT(CONCATENATE(\"QuickPrint!B\",I5)),\"\")","v":""},{"$f":"IFERROR(INDIRECT(CONCATENATE(\"QuickPrint!Y\",I5)),\"\")","v":""},{"$f":"IFERROR(INDIRECT(CONCATENATE(\"QuickPrint!\",IF($J$10=3,\"AD\",\"AC\"),I5)),\"\")","v":""},{"$f":"IFERROR(VLOOKUP(INDIRECT(CONCATENATE(\"QuickPrint!c\",I5)),Setup!$M$6:$N$93,2,FALSE),\"\")","v":""},null,null,null,{"$f":"MATCH(J5,INDIRECT(CONCATENATE(\"QuickPrint!$Z:$Z\")),0)","v":{"$error":"#N/A"}},{"$f":"CONCATENATE(\"2/\",$J$2)","v":{"$error":"#N/A"}},null,"SQ","Squat",null,null,"F-M2-U",63,"PL",{"$f":"IF($P5=\"Wilks\",$P5,VLOOKUP($P5,Setup!$I:$J,2,FALSE))","v":"Raw Women (50-59)"},"3-Lift","Raw Women (50-59) 3-Lift 63-kg cls","F-M2-U/63/PL"]
[3,{"$f":"IFERROR(INDIRECT(CONCATENATE(\"QuickPrint!B\",I6)),\"\")","v":""},{"$f":"IFERROR(INDIRECT(CONCATENATE(\"QuickPrint!Y\",I6)),\"\")","v":""},{"$f":"IFERROR(INDIRECT(CONCATENATE(\"QuickPrint!\",IF($J$10=3,\"AD\",\"AC\"),I6)),\"\")","v":""},{"$f":"IFERROR(VLOOKUP(INDIRECT(CONCATENATE(\"QuickPrint!c\",I6)),Setup!$M$6:$N$93,2,FALSE),\"\")","v":""},null,null,null,{"$f":"MATCH(J6,INDIRECT(CONCATENATE(\"QuickPrint!$Z:$Z\")),0)","v":{"$error":"#N/A"}},{"$f":"CONCATENATE(\"3/\",$J$2)","v":{"$error":"#N/A"}},null,"DL","Deadlift",null,null,"F-M2-U",72,"PL",{"$f":"IF($P6=\"Wilks\",$P6,VLOOKUP($P6,Setup!$I:$J,2,FALSE))","v":"Raw Women (50-59)"},"3-Lift","Raw Women (50-59) 3-Lift 72-kg cls","F-M2-U/72/PL"]
[4,{"$f":"IFERROR(INDIRECT(CONCATENATE(\"QuickPrint!B\",I7)),\"\")","v":""},{"$f":"IFERROR(INDIRECT(CONCATENATE(\"QuickPrint!Y\",I7)),\"\")","v":""},{"$f":"IFERROR(INDIRECT(CONCATENATE(\"QuickPrint!\",IF($J$10=3,\"AD\",\"AC\"),I7)),\"\")","v":""},{"$f":"IFERROR(VLOOKUP(INDIRECT(CONCATENATE(\"QuickPrint!c\",I7)),Setup!$M$6:$N$93,2,FALSE),\"\")","v":""},null,null,null,{"$f":"MATCH(J7,INDIRECT(CONCATENATE(\"QuickPrint!$Z:$Z\")),0)","v":{"$error":"#N/A"}},{"$f":"CONCATENATE(\"4/\",$J$2)","v":{"$error":"#N/A"}},null,"PP","Push Pull",null,null,"F-M3-U",63,"PL",{"$f":"IF($P7=\"Wilks\",$P7,VLOOKUP($P7,Setup!$I:$J,2,FALSE))","v":"Raw Women (60-69)"},"3-Lift","Raw Women (60-69) 3-Lift 63-kg cls","F-M3-U/63/PL"]
[5,{"$f":"IFERROR(INDIRECT(CONCATENATE(\"QuickPrint!B\",I8)),\"\")","v":""},{"$f":"IFERROR(INDIRECT(CONCATENATE(\"QuickPrint!Y\",I8)),\"\")","v":""},{"$f":"IFERROR(INDIRECT(CONCATENATE(\"QuickPrint!\",IF($J$10=3,\"AD\",\"AC\"),I8)),\"\")","v":""},{"$f":"IFERROR(VLOOKUP(INDIRECT(CONCATENATE(\"QuickPrint!c\",I8)),Setup!$M$6:$N$93,2,FALSE),\"\")","v":""},null,null,null,{"$f":"MATCH(J8,INDIRECT(CONCATENATE(\"QuickPrint!$Z:$Z\")),0)","v":{"$error":"#N/A"}},{"$f":"CONCATENATE(\"5/\",$J$2)","v":{"$error":"#N/A"}},null,null,null,null,null,"M-M1-U",74,"PL",{"$f":"IF($P8=\"Wilks\",$P8,VLOOKUP($P8,Setup!$I:$J,2,FALSE))","v":"Raw Men (40-49)"},"3-Lift","Raw Men (40-49) 3-Lift 74-kg cls","M-M1-U/74/PL"]
[null,null,null,null,null,null,null,null,null,null,null,null,null,null,null,"M-M1-U",83,"PL",{"$f":"IF($P9=\"Wilks\",$P9,VLOOKUP($P9,Setup!$I:$J,2,FALSE))","v":"Raw Men (40-49)"},"3-Lift","Raw Men (40-49) 3-Lift 83-kg cls","M-M1-U/83/PL"]
[null,null,null,null,null,null,null,null,"score code",{"$f":"IF(P3=\"Wilks\",4,VLOOKUP(OFFSET($P$1,MATCH(A2,$U:$U,0)-1,0),Setup!I5:K200,3,FALSE))","v":{"$error":"#N/A"}},null,{"$f":"Setup!B39","v":0},{"$f":"IF(L10=\"Pounds\",\"lb cls\",\"kg cls\")","v":"kg cls"},null,null,"M-M2-U",74,"PL",{"$f":"IF($P10=\"Wilks\",$P10,VLOOKUP($P10,Setup!$I:$J,2,FALSE))","v":"Raw Men (50-59)"},"3-Lift","Raw Men (50-59) 3-Lift 74-kg cls","M-M2-U/74/PL"]
[null,null,null,null,null,null,null,null,null,null,null,null,null,null,null,"M-M2-U",83,"PL",{"$f":"IF($P11=\"Wilks\",$P11,VLOOKUP($P11,Setup!$I:$J,2,FALSE))","v":"Raw Men (50-59)"},"3-Lift","Raw Men (50-59) 3-Lift 83-kg cls","M-M2-U/83/PL"]
[null,null,null,null,null,null,null,null,null,null,null,null,null,null,null,"M-M3-U",74,"PL",{"$f":"IF($P12=\"Wilks\",$P12,VLOOKUP($P12,Setup!$I:$J,2,FALSE))","v":"Raw Men (60-69)"},"3-Lift","Raw Men (60-69) 3-Lift 74-kg cls","M-M3-U/74/PL"]
[null,null,null,null,null,null,null,null,null,null,null,null,null,null,null,"M-M3-U",83,"PL",{"$f":"IF($P13=\"Wilks\",$P13,VLOOKUP($P13,Setup!$I:$J,2,FALSE))","v":"Raw Men (60-69)"},"3-Lift","Raw Men (60-69) 3-Lift 83-kg cls","M-M3-U/83/PL"]
[null,null,null,null,null,null,null,null,null,null,null,null,null,null,null,"M-M4-U",74,"PL",{"$f":"IF($P14=\"Wilks\",$P14,VLOOKUP($P14,Setup!$I:$J,2,FALSE))","v":"Raw Men (70+)-"},"3-Lift","Raw Men (70+)- 3-Lift 74-kg cls","M-M4-U/74/PL"]
[null,null,null,null,null,null,null,null,null,null,null,null,null,null,null,"M-M4-U",83,"PL",{"$f":"IF($P15=\"Wilks\",$P15,VLOOKUP($P15,Setup!$I:$J,2,FALSE))","v":"Raw Men (70+)-"},"3-Lift","Raw Men (70+)- 3-Lift 83-kg cls","M-M4-U/83/PL"]

{"sheet":"SpeakersCard","index":12,"n_rows":25,"n_cols":15,"rows_kept":25,"cut":false,"hidden":false,"merged":[[4,13,4,14],[5,8,5,9],[5,13,5,14],[16,3,16,4],[17,5,17,6],[16,11,16,12],[17,13,17,14],[11,2,11,3],[11,10,11,11],[4,11,4,12],[5,11,5,12],[15,1,15,3],[15,9,15,11],[10,0,10,1],[10,8,10,9],[11,0,11,1],[23,0,23,1],[23,8,23,9],[24,0,24,1],[24,8,24,9],[25,0,25,6],[25,8,25,14],[24,2,24,3],[24,10,24,11],[22,0,22,1],[17,3,17,4],[17,11,17,12],[12,0,12,6],[12,8,12,14],[14,0,14,4],[14,8,14,12],[18,13,18,14],[18,3,18,4],[18,11,18,12],[18,0,18,1],[18,5,18,6],[18,8,18,9],[22,8,22,9],[11,8,11,9],[3,3,3,4],[5,0,5,1],[9,0,9,1],[4,3,4,4],[9,8,9,9],[5,3,5,4],[4,5,4,6],[5,5,5,6],[1,0,1,4],[1,8,1,12],[3,11,3,12],[2,1,2,3],[2,9,2,11]]}
[]
[{"$f":"Setup!$B$6","v":"〇〇パワーリフティング選手権"},null,null,null,null,"Group:","A",null,{"$f":"Setup!$B$6","v":"〇〇パワーリフティング選手権"},null,null,null,null,"Group:","A"]
["Name &\nMbr #:","lifter5-5",null,null,null,"Lot number:",5,null,"Name &\nMbr #:","lifter2-2",null,null,null,"Lot number:",2]
["Birth Year:","1990-01-05","Team:","Abrev",null,"Weight\nClass:",72,null,"Birth Year:","1990-01-02","Team:","Abrev",null,"Weight\nClass:",72]
["Body Weight:",80,null,"Events Entered:",null,"Division(s)",null,null,"Body Weight:",65,null,"Events Entered:",null,"Division(s)"]
["Lifter/Coach\nInitials:",null,null,"pl",null,"FR-O",null,null,"Lifter/Coach\nInitials:",null,null,"pl",null,"FR-O"]
["Event","Rack Hts","1st\nAttempt","2nd Attempt","3rd\nAttempt","Best Attempt","Place",null,"Event","Rack Hts","1st\nAttempt","2nd Attempt","3rd\nAttempt","Best Attempt","Place"]
["Squat","14",null,null,null,null,null,null,"Squat","11"]
["Bench Press","10-11",null,null,null,null,null,null,"Bench Press","10-8"]
[null,null,null,null,"Subtotal",null,null,null,null,null,null,null,"Subtotal"]
["Deadlift",null,null,null,null,null,null,null,"Deadlift"]
["IPF Points:",null,null,null,"Total",null,null,null,"IPF Points:",null,null,null,"Total"]
[]
[]
[{"$f":"Setup!$B$6","v":"〇〇パワーリフティング選手権"},null,null,null,null,"Group:","A",null,{"$f":"Setup!$B$6","v":"〇〇パワーリフティング選手権"},null,null,null,null,"Group:","A"]
["Name &\nMbr #:","lifter3-3",null,null,null,"Lot number:",3,null,"Name &\nMbr #:","lifter4-4",null,null,null,"Lot number:",4]
["Birth Year:","1990-01-03","Team:","Abrev",null,"Weight\nClass:",72,null,"Birth Year:","1990-01-04","Team:","Abrev",null,"Weight\nClass:",72]
["Body Weight:",70,null,"Events Entered:",null,"Division(s)",null,null,"Body Weight:",75,null,"Events Entered:",null,"Division(s)"]
["Lifter/Coach\nInitials:",null,null,"pl",null,"FR-O",null,null,"Lifter/Coach\nInitials:",null,null,"pl",null,"FR-O"]
["Event","Rack Hts","1st\nAttempt","2nd Attempt","3rd\nAttempt","Best Attempt","Place",null,"Event","Rack Hts","1st\nAttempt","2nd Attempt","3rd\nAttempt","Best Attempt","Place"]
["Squat","12",null,null,null,null,null,null,"Squat","13"]
["Bench Press","10-9",null,null,null,null,null,null,"Bench Press","10-10"]
[null,null,null,null,"Subtotal",null,null,null,null,null,null,null,"Subtotal"]
["Deadlift",null,null,null,null,null,null,null,"Deadlift"]
["IPF Points:",null,null,null,"Total",null,null,null,"IPF Points:",null,null,null,"Total"]

{"sheet":"ContestResults","index":13,"n_rows":1,"n_cols":33,"rows_kept":1,"cut":false,"hidden":true,"merged":[]}
[null,null,null,null,null,null,null,null,null,null,null,null,null,null,null,null,null,null,null,null,null,null,null,null,null,null,null,null,null,null,null,null,{"$f":"3*COUNTA(C:C)","v":0}]

{"sheet":"ContestLog","index":14,"n_rows":256,"n_cols":10,"rows_kept":256,"cut":false,"hidden":false,"merged":[]}
["Time","Name",{"$f":"\"Weight Cls \"&IF(Setup!B39=\"Kilograms\",\"(Kg)\",\"(Lb)\")","v":"Weight Cls (Lb)"},"Lift",{"$f":"\"Weight (\"&Setup!G15&\")\"","v":"Weight (Kg)"},{"$f":"\"Total (\"&Setup!G15&\")\"","v":"Total (Kg)"},"Record?",null,null,{"$f":"COUNTA(B:B)+1","v":257}]
["15:49:23",1,53,"Squat 1",100]
["15:49:26",1,53,"Squat 1",100]
["15:49:32",1,53,"Squat 1",100]
["15:49:33",2,53,"Squat 1",100]
["15:49:38",2,53,"Bench Press 1",100]
["15:49:39",1,53,"Bench Press 1",100]
["15:49:46",2,53,"Deadlift 1",100,300]
["15:49:47",1,53,"Deadlift 1",-100]
["15:49:56",1,53,"Deadlift 2",110,310]
["02:35:09",1,52,"Bench Press 1",200,200]
["02:35:13",1,52,"Bench Press 1",200,200]
["02:35:17",1,52,"Bench Press 1",200,200]
["02:35:18",2,63,"Bench Press 1",200,200]
["02:35:19",3,72,"Bench Press 1",200,200]
["03:12:50",3,72,"Bench Press 1",200,200]
["12:31:54","善本 弥生",52,"Squat 1",100]
["12:31:55","伊差川 浩之",53,"Squat 1",200]
["12:31:56","中村 英明",53,"Squat 1",110]
["12:31:58","古城 資久",53,"Squat 1",100]
["12:31:59","高松 智美",52,"Squat 1",130]
["12:32:00","南澤 さより",63,"Squat 1",110]
["12:32:01","善本 光彦",66,"Squat 1",100]
["12:32:02","長谷川 大地",66,"Squat 1",130]
["12:32:04","余語 てるみ",63,"Squat 1",110]
["12:32:05","南　采沙",72,"Squat 1",130]
["12:32:07","藤原　和人",74,"Squat 1",140]
["12:32:09","堤　彩夏",84,"Squat 1",140]
["12:32:10","幸喜 輝明",83,"Squat 1",160]
["12:32:11","寺原　万留々","84+","Squat 1",160]
["12:32:13","中嶋　幸雄",93,"Squat 1",180]
["12:32:14","後藤　啓恵","84+","Squat 1",180]
["12:32:20","善本 弥生",52,"Bench Press 1",80]
["12:32:21","中村 英明",53,"Bench Press 1",80]
["12:32:23","長谷川 大地",66,"Bench Press 1",80]
["12:32:24","南澤 さより",63,"Bench Press 1",100]
["12:32:25","藤原　和人",74,"Bench Press 1",100]
["12:32:26","南　采沙",72,"Bench Press 1",110]
["12:32:27","幸喜 輝明",83,"Bench Press 1",110]
["12:32:29","堤　彩夏",84,"Bench Press 1",130]
["12:32:30","中嶋　幸雄",93,"Bench Press 1",130]
["12:32:31","寺原　万留々","84+","Bench Press 1",140]
["12:32:32","南 茂樹",105,"Bench Press 1",140]
["12:32:33","古城 資久",53,"Bench Press 1",160]
["12:32:35","後藤　啓恵","84+","Bench Press 1",160]
["12:32:36","伊差川 浩之",53,"Bench Press 1",180]
["12:32:37","余語 てるみ",63,"Bench Press 1",180]
["12:32:38","高松 智美",52,"Bench Press 1",200]
["12:32:39","善本 光彦",66,"Bench Press 1",200]
["12:32:41","善本 光彦",66,"Bench Press 1",200]
["12:32:47","中嶋　幸雄",93,"Deadlift 1",100,410]
["12:32:48","寺原　万留々","84+","Deadlift 1",100,400]
["12:32:49","南 茂樹",105,"Deadlift 1",110]
["12:32:50","後藤　啓恵","84+","Deadlift 1",110,450]
["12:32:51","古城 資久",53,"Deadlift 1",130,390]
["12:32:53","伊差川 浩之",53,"Deadlift 1",130,510]
["12:32:54","余語 てるみ",63,"Deadlift 1",140,430]
["12:32:55","善本 光彦",66,"Deadlift 1",140,440]
["12:32:56","善本 弥生",52,"Deadlift 1",150,330]
["12:32:57","南澤 さより",63,"Deadlift 1",150,360]
["12:32:59","南　采沙",72,"Deadlift 1",150,390]
["12:33:00","幸喜 輝明",83,"Deadlift 1",150,420]
["12:33:01","堤　彩夏",84,"Deadlift 1",150,420]
["12:33:02","中村 英明",53,"Deadlift 1",160,350]
["12:33:03","高松 智美",52,"Deadlift 1",160,490]
["12:33:04","長谷川 大地",66,"Deadlift 1",180,390]
["12:33:06","藤原　和人",74,"Deadlift 1",200,440]
["12:33:20","南 茂樹",105,"Deadlift 1",110]
["12:33:41","南 茂樹",105,"Squat 1",200,450]
["21:24:35","柳沢 由紀子",52,"Squat 1",100]
["21:24:36","原田 惠",52,"Squat 1",102.5]
["21:24:37","平野　豊美",52,"Squat 1",105]
["21:24:39","岡田 美佐",57,"Squat 1",107.5]
["21:24:40","鍋倉 由美子",57,"Squat 1",110]
["21:24:41","後藤　啓恵",57,"Squat 1",112.5]
["21:24:43","加藤 みどり",57,"Squat 1",115]
["21:24:44","前川　聖司",59,"Squat 1",117.5]
["21:24:45","浦野 雅彦",59,"Squat 1",120]
["21:24:46","山口　和久",59,"Squat 1",122.5]
["21:24:48","吉田　雅巳",66,"Squat 1",125]
["21:24:49","谷内　政宏",66,"Squat 1",127.5]
["21:24:50","大城　新順",66,"Squat 1",130]
["21:24:52","竹井　保満",66,"Squat 1",132.5]
["21:24:53","山本 英嗣",66,"Squat 1",135]
["21:24:54","中村 英明",66,"Squat 1",137.5]
["21:24:55","善本　光彦",66,"Squat 1",140]
["21:24:57","丸本 秀敏",74,"Squat 1",142.5]
["21:24:58","相原　竜也",74,"Squat 1",145]
["21:24:59","谷口　晃一",74,"Squat 1",147.5]
["21:25:00","寺門 浩之",74,"Squat 1",150]
["21:25:02","瀧田　悟",74,"Squat 1",152.5]
["21:25:03","平井 敏雄",74,"Squat 1",155]
["21:25:04","大澤　充",74,"Squat 1",157.5]
["21:25:06","越野 貴史",74,"Squat 1",160]
["21:25:07","森田 俊介",83,"Squat 1",162.5]
["21:25:11","山口 真人",83,"Squat 1",165]
["21:25:12","對馬 宏",83,"Squat 1",167.5]
["21:25:14","藤本　 章夫",83,"Squat 1",170]
["21:25:15","北野 利雄",83,"Squat 1",172.5]
["21:25:16","新田 昌和",83,"Squat 1",175]
["21:25:18","大森　了",83,"Squat 1",177.5]
["21:25:19","立花 浩二",83,"Squat 1",180]
["21:25:21","中島 諭正",83,"Squat 1",182.5]
["21:25:22","香西　和義",93,"Squat 1",185]
["21:25:25","南 茂樹",93,"Squat 1",187.5]
["21:25:31","柳沢 由紀子",52,"Bench Press 1",100]
["21:25:32","原田 惠",52,"Bench Press 1",102.5]
["21:25:33","平野　豊美",52,"Bench Press 1",105]
["21:25:34","岡田 美佐",57,"Bench Press 1",107.5]
["21:25:36","鍋倉 由美子",57,"Bench Press 1",110]
["21:25:37","後藤　啓恵",57,"Bench Press 1",112.5]
["21:25:38","加藤 みどり",57,"Bench Press 1",115]
["21:25:40","前川　聖司",59,"Bench Press 1",117.5]
["21:25:41","浦野 雅彦",59,"Bench Press 1",120]
["21:25:42","山口　和久",59,"Bench Press 1",122.5]
["21:25:44","吉田　雅巳",66,"Bench Press 1",125]
["21:25:45","谷内　政宏",66,"Bench Press 1",127.5]
["21:25:46","大城　新順",66,"Bench Press 1",130]
["21:25:48","竹井　保満",66,"Bench Press 1",132.5]
["21:25:49","山本 英嗣",66,"Bench Press 1",135]
["21:25:51","中村 英明",66,"Bench Press 1",137.5]
["21:25:52","善本　光彦",66,"Bench Press 1",140]
["21:25:53","丸本 秀敏",74,"Bench Press 1",142.5]
["21:25:55","相原　竜也",74,"Bench Press 1",145]
["21:25:56","谷口　晃一",74,"Bench Press 1",147.5]
["21:25:57","寺門 浩之",74,"Bench Press 1",150]
["21:25:59","瀧田　悟",74,"Bench Press 1",152.5]
["21:26:00","平井 敏雄",74,"Bench Press 1",155]
["21:26:01","大澤　充",74,"Bench Press 1",157.5]
["21:26:03","越野 貴史",74,"Bench Press 1",160]
["21:26:04","森田 俊介",83,"Bench Press 1",162.5]
["21:26:06","山口 真人",83,"Bench Press 1",165]
["21:26:07","對馬 宏",83,"Bench Press 1",167.5]
["21:26:08","藤本　 章夫",83,"Bench Press 1",170]
["21:26:10","北野 利雄",83,"Bench Press 1",172.5]
["21:26:11","新田 昌和",83,"Bench Press 1",175]
["21:26:12","大森　了",83,"Bench Press 1",177.5]
["21:26:14","立花 浩二",83,"Bench Press 1",180]
["21:26:15","中島 諭正",83,"Bench Press 1",182.5]
["21:26:16","香西　和義",93,"Bench Press 1",185]
["21:26:18","南 茂樹",93,"Bench Press 1",187.5]
["21:26:24","柳沢 由紀子",52,"Deadlift 1",100,300]
["21:26:25","原田 惠",52,"Deadlift 1",102.5,307.5]
["21:26:26","平野　豊美",52,"Deadlift 1",105,315]
["21:26:28","岡田 美佐",57,"Deadlift 1",107.5,322.5]
["21:26:29","鍋倉 由美子",57,"Deadlift 1",110,330]
["21:26:30","後藤　啓恵",57,"Deadlift 1",112.5,337.5]
["21:26:31","加藤 みどり",57,"Deadlift 1",115,345]
["21:26:32","前川　聖司",59,"Deadlift 1",117.5,352.5]
["21:26:34","浦野 雅彦",59,"Deadlift 1",120,360]
["21:26:35","山口　和久",59,"Deadlift 1",122.5,367.5]
["21:26:36","吉田　雅巳",66,"Deadlift 1",125,375]
["21:26:38","谷内　政宏",66,"Deadlift 1",127.5,382.5]
["21:26:39","大城　新順",66,"Deadlift 1",130,390]
["21:26:40","竹井　保満",66,"Deadlift 1",132.5,397.5]
["21:26:41","山本 英嗣",66,"Deadlift 1",135,405]
["21:26:42","中村 英明",66,"Deadlift 1",137.5,412.5]
["21:26:44","善本　光彦",66,"Deadlift 1",140,420]
["21:26:45","丸本 秀敏",74,"Deadlift 1",142.5,427.5]
["21:26:46","相原　竜也",74,"Deadlift 1",145,435]
["21:26:47","谷口　晃一",74,"Deadlift 1",147.5,442.5]
["21:26:49","寺門 浩之",74,"Deadlift 1",150,450]
["21:26:50","瀧田　悟",74,"Deadlift 1",152.5,457.5]
["21:26:51","平井 敏雄",74,"Deadlift 1",155,465]
["21:26:53","大澤　充",74,"Deadlift 1",157.5,472.5]
["21:26:54","越野 貴史",74,"Deadlift 1",160,480]
["21:26:55","森田 俊介",83,"Deadlift 1",162.5,487.5]
["21:26:56","山口 真人",83,"Deadlift 1",165,495]
["21:26:58","對馬 宏",83,"Deadlift 1",167.5,502.5]
["21:26:59","藤本　 章夫",83,"Deadlift 1",170,510]
["21:27:00","北野 利雄",83,"Deadlift 1",172.5,517.5]
["21:27:02","新田 昌和",83,"Deadlift 1",175,525]
["21:27:03","大森　了",83,"Deadlift 1",177.5,532.5]
["21:27:04","立花 浩二",83,"Deadlift 1",180,540]
["21:27:05","中島 諭正",83,"Deadlift 1",182.5,547.5]
["21:27:07","香西　和義",93,"Deadlift 1",185,555]
["21:27:08","南 茂樹",93,"Deadlift 1",187.5,562.5]
["21:27:09","南 茂樹",93,"Deadlift 1",187.5,562.5]
["21:27:10","南 茂樹",93,"Deadlift 1",187.5,562.5]
["21:27:11","南 茂樹",93,"Deadlift 1",187.5,562.5]
["00:41:08","柳沢 由紀子",63,"Squat 1",100]
["00:41:09","原田 惠",63,"Squat 1",102.5]
["00:41:10","平野　豊美",63,"Squat 1",105]
["00:41:12","岡田 美佐",63,"Squat 1",107.5]
["00:41:13","鍋倉 由美子",72,"Squat 1",110]
["00:41:14","後藤　啓恵",72,"Squat 1",112.5]
["00:41:16","加藤 みどり",72,"Squat 1",115]
["00:41:17","前川　聖司",74,"Squat 1",117.5]
["00:41:18","浦野 雅彦",74,"Squat 1",120]
["00:41:19","山口　和久",74,"Squat 1",122.5]
["00:41:21","吉田　雅巳",74,"Squat 1",125]
["00:41:22","谷内　政宏",74,"Squat 1",127.5]
["00:41:23","大城　新順",74,"Squat 1",130]
["00:41:24","竹井　保満",74,"Squat 1",132.5]
["00:41:26","山本 英嗣",74,"Squat 1",135]
["00:41:27","中村 英明",83,"Squat 1",137.5]
["00:41:28","善本　光彦",83,"Squat 1",140]
["00:41:29","丸本 秀敏",83,"Squat 1",142.5]
["00:41:31","相原　竜也",83,"Squat 1",145]
["00:41:32","谷口　晃一",83,"Squat 1",147.5]
["00:41:33","寺門 浩之",83,"Squat 1",150]
["00:41:34","瀧田　悟",83,"Squat 1",152.5]
["00:41:36","平井 敏雄",83,"Squat 1",155]
["00:41:37","大澤　充",83,"Squat 1",157.5]
["00:41:38","大澤　充",83,"Squat 1",157.5]
["00:41:44","柳沢 由紀子",63,"Bench Press 1",100]
["00:41:45","原田 惠",63,"Bench Press 1",102.5]
["00:41:47","平野　豊美",63,"Bench Press 1",105]
["00:41:48","岡田 美佐",63,"Bench Press 1",107.5]
["00:41:49","鍋倉 由美子",72,"Bench Press 1",110]
["00:41:50","後藤　啓恵",72,"Bench Press 1",112.5]
["00:41:52","加藤 みどり",72,"Bench Press 1",115]
["00:41:53","前川　聖司",74,"Bench Press 1",117.5]
["00:41:54","浦野 雅彦",74,"Bench Press 1",120]
["00:41:56","山口　和久",74,"Bench Press 1",122.5]
["00:41:57","吉田　雅巳",74,"Bench Press 1",125]
["00:41:58","谷内　政宏",74,"Bench Press 1",127.5]
["00:42:00","大城　新順",74,"Bench Press 1",130]
["00:42:01","竹井　保満",74,"Bench Press 1",132.5]
["00:42:02","山本 英嗣",74,"Bench Press 1",135]
["00:42:03","中村 英明",83,"Bench Press 1",137.5]
["00:42:04","善本　光彦",83,"Bench Press 1",140]
["00:42:06","丸本 秀敏",83,"Bench Press 1",142.5]
["00:42:07","相原　竜也",83,"Bench Press 1",145]
["00:42:08","谷口　晃一",83,"Bench Press 1",147.5]
["00:42:09","寺門 浩之",83,"Bench Press 1",150]
["00:42:11","瀧田　悟",83,"Bench Press 1",152.5]
["00:42:12","平井 敏雄",83,"Bench Press 1",155]
["00:42:13","大澤　充",83,"Bench Press 1",157.5]
["00:42:15","大澤　充",83,"Bench Press 1",157.5]
["00:42:16","大澤　充",83,"Bench Press 1",157.5]
["00:42:22","柳沢 由紀子",63,"Deadlift 1",100,300]
["00:42:23","原田 惠",63,"Deadlift 1",102.5,307.5]
["00:42:25","平野　豊美",63,"Deadlift 1",105,315]
["00:42:26","岡田 美佐",63,"Deadlift 1",107.5,322.5]
["00:42:27","鍋倉 由美子",72,"Deadlift 1",110,330]
["00:42:28","後藤　啓恵",72,"Deadlift 1",112.5,337.5]
["00:42:30","加藤 みどり",72,"Deadlift 1",115,345]
["00:42:31","前川　聖司",74,"Deadlift 1",117.5,352.5]
["00:42:32","浦野 雅彦",74,"Deadlift 1",120,360]
["00:42:33","山口　和久",74,"Deadlift 1",122.5,367.5]
["00:42:35","吉田　雅巳",74,"Deadlift 1",125,375]
["00:42:36","谷内　政宏",74,"Deadlift 1",127.5,382.5]
["00:42:37","大城　新順",74,"Deadlift 1",130,390]
["00:42:38","竹井　保満",74,"Deadlift 1",132.5,397.5]
["00:42:40","山本 英嗣",74,"Deadlift 1",135,405]
["00:42:41","中村 英明",83,"Deadlift 1",137.5,412.5]
["00:42:42","善本　光彦",83,"Deadlift 1",140,420]
["00:42:44","丸本 秀敏",83,"Deadlift 1",142.5,427.5]
["00:42:45","相原　竜也",83,"Deadlift 1",145,435]
["00:42:46","谷口　晃一",83,"Deadlift 1",147.5,442.5]
["00:42:47","寺門 浩之",83,"Deadlift 1",150,450]
["00:42:49","瀧田　悟",83,"Deadlift 1",152.5,457.5]
["00:42:50","平井 敏雄",83,"Deadlift 1",155,465]
["00:42:51","大澤　充",83,"Deadlift 1",157.5,472.5]
["00:42:53","大澤　充",83,"Deadlift 1",157.5,472.5]

{"sheet":"KG Records","index":15,"n_rows":151,"n_cols":38,"rows_kept":151,"cut":false,"hidden":true,"merged":[]}
[null,"Y1","Y2","Y3","T1","T2","T3","JR","O","M1a","M1b","M2a","M2b","M3a","M3b","M4a","M4b","M5a","M5b","M6","R-T1","R-T2","R-T3","R-Y1","R-Y2","R-Y3","R-JR","R-O","R-M1A","R-M1B","R-M2A","R-M2B","R-M3A","R-M3B","R-M4A","R-M4B","R-M5A","R-M5B"]
["30-SQ",0,0,0,0,0,0,0,0,0,0,0,0,0,0,0,0,0,0,0,0,0,0,45,45,45,0,0,0,0,0,0,0,0,0,0,0,0]
["30-BP",0,0,0,0,0,0,0,0,0,0,0,0,0,0,0,0,0,0,0,0,0,0,26,26,26,0,0,0,0,0,0,0,0,0,0,0,0]
["30-DL",0,0,0,0,0,0,0,0,0,0,0,0,0,0,0,0,0,0,0,0,0,0,70,70,70,0,0,0,0,0,0,0,0,0,0,0,0]
["30-TL",0,0,0,0,0,0,0,0,0,0,0,0,0,0,0,0,0,0,0,0,0,0,141,141,141,0,0,0,0,0,0,0,0,0,0,0,0]
["35-SQ",0,0,0,0,0,0,0,0,0,0,0,0,0,0,0,0,0,0,0,0,0,0,55,55,55,0,0,0,0,0,0,0,0,0,0,0,0]
["35-BP",0,0,0,0,0,0,0,0,0,0,0,0,0,0,0,0,0,0,0,0,0,0,30,30,30,0,0,0,0,0,0,0,0,0,0,0,0]
["35-DL",0,0,0,0,0,0,0,0,0,0,0,0,0,0,0,0,0,0,0,0,0,0,75,75,75,0,0,0,0,0,0,0,0,0,0,0,0]
["35-TL",0,0,0,0,0,0,0,0,0,0,0,0,0,0,0,0,0,0,0,0,0,0,160,160,160,0,0,0,0,0,0,0,0,0,0,0,0]
["40-SQ",0,0,0,0,0,0,0,0,0,0,0,0,0,0,0,0,0,0,0,0,0,0,0,62.5,81.5,0,0,0,0,0,0,0,0,0,0,0,0]
["40-BP",0,0,0,0,0,0,0,0,0,0,0,0,0,0,0,0,0,0,0,0,0,0,0,36,50,0,0,0,0,0,0,0,0,0,0,0,0]
["40-DL",0,0,0,0,0,0,0,0,0,0,0,0,0,0,0,0,0,0,0,0,0,0,0,93,100.5,0,0,0,0,0,0,0,0,0,0,0,0]
["40-TL",0,0,0,0,0,0,0,0,0,0,0,0,0,0,0,0,0,0,0,0,0,0,0,188,232,0,0,0,0,0,0,0,0,0,0,0,0]
["44-SQ",0,0,0,0,0,0,0,0,0,0,0,0,0,0,0,0,0,0,0,0,0,0,45,75,96,0,0,0,0,0,0,0,0,0,0,0,0]
["44-BP",0,0,0,0,0,0,0,0,0,0,0,0,0,0,0,0,0,0,0,0,0,0,32.5,40,57.5,0,0,0,0,0,0,0,0,0,0,0,0]
["44-DL",0,0,0,0,142.5,142.5,142.5,0,0,0,0,0,0,0,0,0,0,0,0,0,0,0,75,105,130,0,0,0,0,0,0,0,0,0,0,0,0]
["44-TL",0,0,0,0,317.5,317.5,317.5,0,0,0,0,0,0,0,0,0,0,0,0,0,0,0,152.5,220,280,0,0,0,0,0,0,0,0,0,0,0,0]
["48-SQ",0,0,0,0,0,0,0,0,0,0,0,0,0,0,0,0,0,0,0,70,70,70,42.5,55,105,70,70,0,0,0,0,0,0,0,0,0,0]
["48-BP",0,0,0,0,0,0,0,0,0,0,0,0,0,0,0,0,0,0,0,57.5,57.5,57.5,22.5,42.5,62.5,57.5,57.5,0,0,0,0,0,0,0,0,0,0]
["48-DL",0,0,0,0,0,0,0,0,0,0,0,0,0,0,0,0,0,0,0,97.5,97.5,97.5,55,87.5,137.5,97.5,97.5,0,0,0,0,0,0,0,0,0,0]
["48-TL",0,0,0,0,0,0,0,0,0,0,0,0,0,0,0,0,0,0,0,225,225,225,120,180,305,225,225,0,0,0,0,0,0,0,0,0,0]
["53-SQ",0,55,82.5,162.5,210,217.5,217.5,217.5,0,0,0,0,0,0,0,0,0,0,0,142.5,145,165,15,77.5,105,170,165,0,0,0,0,0,0,0,0,0,0]
["53-BP",0,35.5,62.5,97.5,157.5,157.5,157.5,145,0,0,0,0,0,0,0,0,0,0,0,82.5,95,115,20,45,72.5,117.5,115,0,0,0,0,0,0,0,0,0,0]
["53-DL",0,97.5,120,195,207.5,230,250,237.5,0,0,0,0,0,0,0,0,0,0,0,201,201,230,52.5,112.5,140,271.5,232.5,0,0,0,0,0,0,0,0,0,0]
["53-TL",0,188,265,450,530,547.5,642.5,642.5,0,550,502.5,502.5,500,0,0,0,0,0,0,421,421,502.5,157.5,257.5,317.5,559,740,0,0,0,0,0,0,0,0,0,0]
["59-SQ",0,0,105,197.5,215.5,242.5,250,255.5,253,253,253,152.5,152.5,152.5,142.5,0,0,0,0,165,195,212.5,35,72.5,112.5,212.5,242.5,192.5,192.5,192.5,171,171,117.5,105,77.5,77.5,0]
["59-BP",0,0,52.5,125,149.69999999999999,150,167.5,167.5,142.5,132.5,117.5,117.5,97.5,97.5,97.5,0,0,0,0,115.5,115.5,127.5,40,40,72.5,150,150,110,102.5,95,95,95,80,80,42.5,42.5,0]
["59-DL",0,0,115,205,217.5,227.5,258.5,262.5,255,255,252.5,177.5,177.5,177.5,177.5,0,0,0,0,201,217.5,242.5,60,100,137.5,250,252.5,252.5,252.5,252.5,201,201,137.5,160,102.5,102.5,0]
["59-TL",0,240,272.5,527.5,537.5,590,605.5,648,612.5,612.5,610.5,430,412.5,412.5,412.5,0,0,0,0,462.5,525,557.5,240,240,315,577.5,577.5,545,545,535,396,396,340,340,222.5,222.5,0]
["66-SQ",0,0,82.5,205,245,272.5,317.5,317.5,250,225,225,200,200,200,165,112.5,0,0,0,170,193,207.5,0,150,150,253,255,197.5,191,191,190,185.5,122.5,122.5,82.5,82.5,82.5]
["66-BP",0,0,57.5,132.5,152.5,205,230,230,142.5,147.5,147.5,137.5,137.5,137.5,132.5,75,0,0,0,132.5,137.5,142.5,0,57.5,78,167.5,167.5,147.5,147.5,142.5,142.5,110,92.5,92.5,77.5,62.5,62.5]
["66-DL",0,0,100,220,240,260,275,277.5,272.2,272.2,272.2,225,210,210,157.5,120,0,0,0,205,212.5,228,0,75,155,270,277.5,262.5,235,230,205,190,150.5,150.5,122.5,100,100]
["66-TL",0,0,240,507.5,605,700,770,770,625,587.5,577.5,537.5,515,515,430,282.5,0,0,0,507.5,507.5,575,0,272.5,352.5,688,688,567.5,536,536,517.5,465.5,350,350,245,245,245]
["74-SQ",0,0,0,232.5,255,305,327.5,327.5,280,267.5,267.5,242.5,235,200,175,152.5,67.5,0,0,200,215,255.5,0,0,200,263.5,265.5,247.5,220,197.5,183,175.5,160,160,130,125,0]
["74-BP",0,0,0,145,160,200.5,235,235,187.5,170,170,145,145,140,140,110,62.5,0,0,142.5,142.5,165,0,0,97.5,177.5,192.5,179,179,179,117.5,117.5,117.5,117.5,92.5,90,0]
["74-DL",0,0,0,227.5,292.60000000000002,297.5,330,330,302.5,272.5,272.5,255,230,225,220,197.5,125,0,0,192.5,252.5,280.5,0,0,182.5,305,307.5,307.5,240,240,240,202.5,195,195,167.5,155,0]
["74-TL",0,0,0,572.5,662.5,757.5,820,820,760,697.5,697.5,600,572.5,534.9,510,457.5,255,0,0,480,605,670.5,0,0,480,735,750,717.5,582.5,566.5,533,467.5,452.5,452.5,395,370,0]
["83-SQ",0,0,0,290.5,325,325,352.5,370,337.5,337.5,317.5,305,222.5,220,197.5,160,160,160,0,207.5,240,260,0,0,177.5,300.5,300.5,270,260,237.5,205.5,192.5,192.5,162.5,147.5,147.5,65]
["83-BP",0,0,0,160,200,215,300,300,250,242.5,212.5,197.5,173.5,152.5,147.5,125,107.5,90,0,137.5,175,177.5,0,0,97.5,195,201.5,187.5,180,180,155,140.5,133,115,91,82.5,80]
["83-DL",0,0,0,277.5,310,312.5,327.5,337.5,332.5,320,319.89999999999998,307.5,255,244.9,230,192.5,190,175,0,227.5,282.5,317.5,0,0,180,320.5,340,290,287.5,285,277.5,240,240,213.5,185,182.5,117.5]
["83-TL",0,0,0,728,817.5,817.5,877.5,907.5,862.5,862.5,772.5,760,600,557.5,560,457.5,440,420,0,535,645,740,0,0,455,810,813,707.5,685,677.5,602.5,532.5,532.5,491,410,410,242.5]
["93-SQ",0,40,0,250,317.5,342.5,375,375,347.5,347.5,347.5,325,280,222.5,200,170,150,65,0,220,263.5,290,0,30,170,327.5,327.5,325.5,325.5,325.5,325.5,208,208,180,145,145,0]
["93-BP",0,42.5,0,170,207.5,232.5,260,267.5,262.5,260,230,217.5,182.5,148,137.4,115,102.1,85,0,147.5,182.5,182.5,0,32.5,120,200,230,230,230,215,210,167.5,125,115.5,115,87.5,0]
["93-DL",0,92.5,0,257.5,322.5,350,377.5,377.5,343,332.5,328,325,265,260,245,199.9,172.5,125,0,237.5,317.5,327.5,0,77.5,170,352.5,352.5,320,310,310,310,263.10000000000002,263.10000000000002,220,180.5,180.5,0]
["93-TL",0,175,0,617.5,800,900,972.5,972.5,900,900,900,830,677.5,607.5,547.5,460,417.5,275,0,567.5,735,792.5,0,140,460,840,840,830,830,830,830,612.5,555.5,510,417.5,405,0]
["105-SQ",0,0,0,277.5,330,337.5,355,382.5,355,355,345,320,295,250,217.5,170,115,0,0,240,280,285,0,0,140,312.5,331.5,292.5,275,275,275,235,195,180,127.5,105,0]
["105-BP",0,0,0,182.5,207.5,242.5,285,323.5,243,243,242.5,242.5,227.5,188.2,175,147.5,100,0,0,147.5,172.5,187.5,0,0,110,215,238.5,232.5,232.5,185,170,158,153,120,107.5,102.5,0]
["105-DL",0,0,0,262.5,300,322.10000000000002,342.5,377.5,335,332.5,315,315,315,260,253,220,147.5,0,0,245,287.5,325,0,0,157.5,347.5,367.5,315,295,295,295,277.5,230.5,210,200,152.5,0]
["105-TL",0,0,0,682.5,765,862.5,907.5,986,915,915,836,822.5,770,630.5,612.5,502.5,362.5,0,0,632.5,735,795,0,0,407.5,842.5,890,773,745,715,712.5,600,578.5,505,435,360,0]
["120-SQ",0,0,0,282.5,360,365.5,405,413,413,412.5,350,317.5,267.5,247.5,205,0,0,0,0,230,280,317.5,0,0,150,372.5,386,378.5,378.5,378.5,275,232.5,232.5,187.5,92.5,0,0]
["120-BP",0,0,0,162.5,245,282.5,295,320,312.5,262.5,262.5,242.5,195,187.5,165,0,0,0,0,145,182.5,205,0,0,75,242.5,253,220,205,197.5,185,175,160,147.5,110,0,0]
["120-DL",0,0,0,260,307.5,330,365,372.5,355.5,332.5,325,320,320,281.5,260,0,0,0,0,255,282.5,306.2,0,0,155,365,372,372,372,342.5,292.5,280,280,230,147.5,0,0]
["120-TL",0,0,0,690,872.5,950.5,1035,1042.5,1015.5,957.5,945,822.5,717.5,706,622.5,0,0,0,0,585.5,732.5,805,0,0,380,890,978.5,944.5,944.5,895,720,640,640,525,335,0,0]
["120+-SQ",0,0,0,290,365,424.8,424.8,505,430.9,430.9,402.5,320,310,272.5,210,92.5,0,0,0,330,365.5,425.5,0,197.5,197.5,425.5,485,340,337.5,330,257.5,228,190,182.5,92.5,82.5,0]
["120+-BP",0,0,0,175,260,272.5,350,410,350,297.5,292.5,292.5,235,195,155,100,0,0,0,175,190,207.5,0,135,135,235,265.5,260,245,232.5,190,183.7,145,145,100,77.5,0]
["120+-DL",0,0,0,257.5,319.8,317.5,365,410,400,342.5,320,319.89999999999998,290,257.5,190,142.5,0,0,0,267.5,287.5,306,0,220,220,335.5,392.5,380,380,325,277.5,250,245,182.5,142.5,115,0]
["120+-TL",0,0,0,722.5,907.5,950,1057.5,1272.5,1057.5,1052.5,945,862.5,785,705,520,335,0,0,0,722.5,790.5,920.5,0,552.5,552.5,932.5,1105,937.5,937.5,868,707.5,622.5,577.5,510,335,267.5,0]
["30-BPO",0,0,0,0,0,0,0,0,0,0,0,0,0,0,0,0,0,0,0,0,0,0,26,26,26,0,0,0,0,0,0,0,0,0,0,0,0]
["35-BPO",0,0,0,0,0,0,0,0,0,0,0,0,0,0,0,0,0,0,0,0,0,0,30,30,30,0,0,0,0,0,0,0,0,0,0,0,0]
["40-BPO",0,0,0,0,0,0,0,0,0,0,0,0,0,0,0,0,0,0,0,45,45,45,0,45,50,45,45,0,0,0,0,0,0,0,0,0,0]
["44-BPO",0,0,0,0,0,0,0,0,0,0,0,0,0,0,0,0,0,0,0,0,0,0,32.5,40,57.5,0,0,0,0,0,0,0,0,0,0,0,0]
["48-BPO",0,0,0,0,0,0,0,0,0,0,0,0,0,0,0,0,0,0,0,57.5,57.5,57.5,22.5,42.5,62.5,57.5,57.5,0,0,0,0,0,0,0,0,0,0]
["53-BPO",0,35.5,62.5,97.5,157.5,157.5,157.5,145,0,0,0,0,0,0,0,0,0,0,0,82.5,95,115,20,45,72.5,117.5,115,0,0,0,0,0,0,0,0,0,0]
["59-BPO",0,0,52.5,125,150.5,150.5,167.5,142.5,142.5,150,135,135,135,120,97.5,82.5,57.5,0,0,115.5,115.5,142.5,40,40,72.5,150,155,115,107.5,105.5,105.5,105.5,102.5,85,85,42.5,0]
["66-BPO",0,0,0,132.5,160,213.5,240,240,170,170,147.5,132.5,132.5,137.5,132.5,0,40,0,0,132.5,137.5,142.5,0,57.5,78,167.5,170,147.5,147.5,142.5,142.5,128,127.5,97.5,97.5,92.5,62.5]
["74-BPO",0,0,0,145,160,212.5,235,235,195,195,190,175.5,175.5,145,140,113.5,105,0,0,142.5,142.5,165,0,50,97.5,193,195,182.5,182.5,180,148.5,148.5,128,128,105,105,0]
["83-BPO",0,0,0,165.6,200,220,300,300,263,255,225,215,180,170,160.5,125,107.5,90,37.5,137.5,175,185,0,0,97.5,195,202.5,217.5,197.5,197.5,160,147.5,137.5,137.5,108,83,83]
["93-BPO",0,42.5,0,170,207.5,260,265,320,319,275,230,218.5,192.5,192.5,182.5,115,110,85,0,147.5,200,200,0,32.5,120,200,233.5,233.5,233.5,222.5,210,167.5,145,142.5,116,77.5,0]
["105-BPO",0,0,0,182.5,207.5,288.5,288.5,337,337,337,337,252.5,227.5,170,200,147.5,125,0,0,147.5,172.5,187.5,0,0,110,215,242.5,232.5,232.5,195,187.5,170,160,145,145,122.5,0]
["120-BPO",0,0,0,170,245,283,295,356.5,315.5,302.5,302.5,242.5,217.5,200,197.5,155,0,0,0,145,162.4,205,0,0,75,242.5,253,240,240,240,207.5,190,160,147.5,127.5,0,0]
["120+-BPO",0,0,0,175,260,272.5,350,410,385,362.5,320,320,287.5,232.5,180,100,0,0,0,175,190,207.5,0,135,135,272.5,290,260,247.5,237.5,228,228,160,145,130,77.5,0]
["30-DLO",0,0,0,0,0,0,0,0,0,0,0,0,0,0,0,0,0,0,0,0,0,0,70,70,70,0,0,0,0,0,0,0,0,0,0,0,0]
["35-DLO",0,0,0,0,0,0,0,0,0,0,0,0,0,0,0,0,0,0,0,0,0,0,75,75,75,0,0,0,0,0,0,0,0,0,0,0,0]
["40-DLO",0,0,0,0,0,0,0,0,0,0,0,0,0,0,0,0,0,0,0,90,90,90,0,93,100.5,90,90,0,0,0,0,0,0,0,0,0,0]
["44-DLO",0,0,0,0,142.5,142.5,142.5,0,0,0,0,0,0,0,0,0,0,0,0,0,0,0,75,105,130,0,0,0,0,0,0,0,0,0,0,0,0]
["48-DLO",0,0,0,0,0,0,0,0,0,0,0,0,0,0,0,0,0,0,0,97.5,97.5,97.5,55,87.5,137.5,97.5,97.5,0,0,0,0,0,0,0,0,0,0]
["53-DLO",0,97.5,120,195,207.5,230,257.5,237.5,0,0,0,0,0,0,0,0,0,0,0,201,201,230,52.5,112.5,140,271.5,232.5,0,0,0,0,0,0,0,0,0,0]
["59-DLO",0,0,115,205,217.5,227.5,258.5,262.5,255,255,252.5,177.5,177.5,177.5,177.5,0,0,0,0,201,217.5,242.5,60,100,137.5,250,252.5,252.5,252.5,252.5,201,201,137.5,160,102.5,102.5,0]
["66-DLO",0,0,0,220,240,260,275,277.5,272.2,272.2,272.2,225,210,210,157.5,0,0,0,0,205,212.5,228,0,75,155,270,277.5,262.5,235,230,205,190,150.5,150.5,122.5,100,100]
["74-DLO",0,0,0,227.5,292.60000000000002,297.5,330,330,302.5,265,272.5,255,230,225,220,197.5,125,0,0,192.5,252.5,280.5,0,0,182.5,305,307.5,307.5,240,240,240,202.5,195,195,167.5,155,0]
["83-DLO",0,0,0,277.5,310,312.5,327.5,340,332.5,320,320,307.5,255,245,230,192.5,190,175,0,227.5,282.5,317.5,0,0,180,320.5,340,290,287.5,285,277.5,240,240,213.5,185,182.5,117.5]
["93-DLO",0,92.5,0,257.5,322.5,367.5,377.5,377.5,349.3,332.5,328,325,265,260,245,200,172.5,125,0,237.5,317.5,327.5,0,77.5,170,352.5,352.5,320,312.5,312.5,312.5,277,263.10000000000002,220,180.5,180.5,0]
["105-DLO",0,0,0,262.5,300,322.10000000000002,382.5,387.5,335,307.5,307.5,305,315,260,253,220,0,0,0,245,287.5,325,0,0,157.5,347.5,367.5,315,295,295,295,277.5,230.5,210,200,0,0]
["120-DLO",0,0,0,690,690,690,690,372.5,355.5,355.5,347.5,301.60000000000002,320,281.5,260,0,0,0,0,255,282.5,306.2,0,0,155,365,372,372,372,342.5,292.5,280,280,230,177.5,0,0]
["120+-DLO",0,0,0,272.5,319.8,320,385.6,410,400,362.9,320,320,290,257.5,190,142.5,0,0,0,267.5,287.5,306,0,220,220,335.5,392.5,380,380,325,280,251.8,245,182.5,142.5,0,0]
["30-SQ",0,0,0,0,0,0,0,0,0,0,0,0,0,0,0,0,0,0,0,0,0,0,47.5,47.5,47.5,0,0,0,0,0,0,0,0,0,0,0,0]
["30-BP",0,0,0,0,0,0,0,0,0,0,0,0,0,0,0,0,0,0,0,0,0,0,25,25.5,25.5,0,0,0,0,0,0,0,0,0,0,0,0]
["30-DL",0,0,0,0,0,0,0,0,0,0,0,0,0,0,0,0,0,0,0,0,0,0,60,65,65,0,0,0,0,0,0,0,0,0,0,0,0]
["30-TL",0,0,0,0,0,0,0,0,0,0,0,0,0,0,0,0,0,0,0,0,0,0,122.5,135.5,135.5,0,0,0,0,0,0,0,0,0,0,0,0]
["35-SQ",45,0,0,0,0,0,0,0,0,0,0,0,0,0,0,0,0,0,0,0,0,0,60.5,60.5,60.5,0,0,0,0,0,0,0,0,0,0,0,0]
["35-BP",25,0,0,0,0,0,0,0,0,0,0,0,0,0,0,0,0,0,0,0,0,0,31,31,31,0,0,0,0,0,0,0,0,0,0,0,0]
["35-DL",57.5,0,0,0,0,0,0,0,0,0,0,0,0,0,0,0,0,0,0,0,0,0,76,76,76,0,0,0,0,0,0,0,0,0,0,0,0]
["35-TL",127.5,0,0,0,0,0,0,0,0,0,0,0,0,0,0,0,0,0,0,0,0,0,166.5,166.5,166.5,0,0,0,0,0,0,0,0,0,0,0,0]
["40-SQ",0,0,0,0,0,0,0,0,0,0,0,0,0,0,0,0,0,0,0,0,0,0,47.5,70.5,70.5,0,0,0,0,0,0,0,0,0,0,0,0]
["40-BP",0,0,0,0,0,0,0,0,0,0,0,0,0,0,0,0,0,0,0,0,0,0,30,45,45,0,0,0,0,0,0,0,0,0,0,0,0]
["40-DL",0,0,0,0,0,0,0,0,0,0,0,0,0,0,0,0,0,0,0,0,0,0,72.5,87.5,90.7,0,0,0,0,0,0,0,0,0,0,0,0]
["40-TL",0,0,0,0,0,0,0,0,0,0,0,0,0,0,0,0,0,0,0,0,0,0,147.5,202.5,202.5,0,0,0,0,0,0,0,0,0,0,0,0]
["43-SQ",0,0,0,92.5,137.5,137.5,137.5,125,0,0,0,0,0,0,0,0,0,0,0,97.5,100.5,100.5,0,65,75,100.5,85,0,0,0,0,0,0,0,0,0,0]
["43-BP",0,0,0,47.5,77.5,83,83,62.5,0,0,0,0,0,0,0,0,0,0,0,52.5,62.5,70,0,32.5,43,70,62.5,0,0,0,0,0,0,0,0,0,0]
["43-DL",0,0,0,92.5,142.5,142.5,142.5,142.5,0,0,0,0,0,0,0,0,0,0,0,105,125,125,0,75,92.5,125,125,0,0,0,0,0,0,0,0,0,0]
["43-TL",0,0,0,282.5,342.5,348,348,320,207.5,0,0,0,0,0,0,0,0,0,0,252.5,272.5,277.5,0,172.5,207.5,277.5,272.5,207.5,237.5,0,0,0,0,0,0,0,0]
["47-SQ",0,0,52.5,132.5,137.5,140,152.5,165,132.5,132.5,122.5,112.5,102.5,102.5,100,0,0,0,0,105,105,105,47.5,47.5,97.5,125,142.5,125,102.5,102.5,88,88,88,85,0,0,0]
["47-BP",0,0,37.5,72.5,82.5,82.5,92.5,92.5,77.099999999999994,77.099999999999994,65,65,50,50,45,0,0,0,0,65,65,75,27.5,27.5,65,85,85,65,48,48,45,45,45,40,0,0,0]
["47-DL",0,0,77.5,147.5,147.5,160,162.5,162.5,152.5,152.5,145,142.5,127.5,127.5,127.5,0,0,0,0,125,125,132.5,72.5,72.5,122.5,151,182.5,147.5,120,120,120,120,120,120,0,0,0]
["47-TL",0,242.5,242.5,350,347.5,370,392.5,402.5,357.5,357.5,327.5,317.5,272.5,272.5,272.5,0,0,0,0,285,285,292.5,147.5,177.5,285,335,397.5,335,265,265,251,251,251,245,0,0,0]
["52-SQ",0,0,100,160,177.5,180,194,194,182.5,182.5,130,120,115,100,76,76,0,0,36.299999999999997,102.5,107.5,117.5,20,75,80,142.5,156.5,156.5,156.5,152.5,100,100,85,80,65,0,0]
["52-BP",0,0,52.5,102.5,102.5,102.5,132.5,132.5,110,92.5,77.5,75,75,51,51,51,0,0,22.7,70,70,80,20,45,47.5,82.5,97.5,97.5,80.5,80.5,65,65,52.5,52.5,42.5,0,0]
["52-DL",0,0,90,170,183,180,183,192.5,170,170,157.5,145,123.5,102.5,88,88,0,0,61.2,132.5,132.5,147.4,35,110.5,95,166.5,187.5,187.5,162.5,158,132.5,132.5,115.5,115.5,80,0,0]
["52-TL",0,0,242.5,397.5,425,437.5,501.5,501.5,442.5,440,350,337.5,292.5,250,211,211,0,0,120.2,295,300,327.5,75,230.5,210,363.5,430,430,394,391,295,295,247.5,225.5,187.5,0,0]
["57-SQ",0,0,0,165,200,205,205,205,155,150,150,122.5,102.5,75,75,75,0,0,0,130,143,143,0,77.5,102.5,152.5,174.5,142.5,132.5,125.5,90,87.5,85,70,62.5,0,0]
["57-BP",0,0,0,83,110,115,137.5,137.5,120,97.5,97.5,97.5,71.5,71.5,71.5,71.5,0,0,0,75,85,95,0,45,63,95,100,80,80,80,65,60,47.5,45,40,0,0]
["57-DL",0,0,0,175,183.5,192.5,192.5,197.5,182.5,177.5,177.5,147.5,132.5,95,92.5,90,0,0,0,137.5,167.5,170,0,92.5,113,185,193,162.5,162.5,151,125,120,115,97.5,77.5,0,0]
["57-TL",0,0,177.5,412.5,475.5,500,522.5,522.5,445,397.5,392.5,365,292.5,207.5,207.5,207.5,0,0,0,327.5,370,390,177.5,215,262.5,418,463,370.5,347.5,335.5,280,267.5,247.5,212.5,180,0,0]
["63-SQ",0,37.5,0,165,182.5,202.5,202.5,215,200,187.5,175,162.5,110,110,90,67.5,0,0,0,146,146,152.5,0,68,107.5,160,180,155,155,132.5,131,102.5,90,82.5,32.5,0,0]
["63-BP",0,25,0,92.5,102.5,117.5,125,150,140.5,130,130,85,75,72.5,72.5,35,0,0,0,65,82.5,95,0,32.5,58,100,142.5,142.5,142.5,80,75,73,62.5,62.5,32.5,0,0]
["63-DL",0,52.5,0,181.4,205,215,215,227.5,197.5,190,183,180,137.5,130,130,80,0,0,0,164.5,166,195,0,95.5,140,197.5,221,202.5,202.5,175.5,160,135.5,125,125,60,0,0]
["63-TL",0,115,0,417.5,477.5,500,500,547.5,507.5,457.5,452.5,417.5,312.5,297.5,292.5,182.5,0,0,0,363,376,417.5,0,192.5,305.5,442.5,499.5,499.5,499.5,353,352.5,311,270,267.5,125,0,0]
["72-SQ",0,0,0,175,200,217.5,222.5,255,245,240,170,162.5,152.5,142.5,140,38.6,0,0,0,125,168.5,180,0,77.5,113,180,188,175,147.5,145.5,145.5,120.5,105,105,45,0,0]
["72-BP",0,0,0,90,120,132.5,137.5,170,165,165,115,105,92.5,90,90,27.2,0,0,0,67,107.5,115,0,32.5,58,115,144,144,115,87.5,80.5,80.5,70,67.5,42.5,0,0]
["72-DL",0,0,0,170,220,220,220,252.5,249,249,180,180,157.5,157.5,150,61.2,0,0,0,147.5,200.5,205,0,107.5,132.5,205,246,205,195,195,195,150.5,130,125,92.5,0,0]
["72-TL",0,0,0,430,500,530,542.5,654,654,654,450,445,390,390,377.5,127,0,0,0,337.5,476.5,497.5,0,225,303.5,497.5,549,487.5,452.5,418.5,418.5,332.5,305,297.5,180,0,0]
["84-SQ",0,37.5,55,180,210.5,227.5,240.5,273.5,247.5,245,180,145,105,105,105,97.5,0,0,0,130,180,222.5,0,62.5,125,225,222.5,200,200,145,142.5,115.5,100,82.5,82.5,0,0]
["84-BP",0,27.5,35,100,137.5,140,166,192.5,192.5,192.5,130.5,102.5,75,75,75,72.5,0,0,0,67.5,105,127.5,0,42.5,52.5,127.5,127.5,125,125,100,90,72.5,72.5,57.5,52.5,0,0]
["84-DL",0,0,87.5,200,200,225,235,235,228,228,210,152.5,135,135,135,122.5,0,0,0,181.4,205,227.5,0,93,137.5,227.5,235,227.5,227.5,170,152.5,152.5,132.5,125,125,0,0]
["84-TL",0,175,175,475,507.5,555,612.5,671,663.5,663.5,483,392.5,307.5,307.5,307.5,280,0,0,0,337.5,490,572.5,0,198,315,572.5,572.5,512.5,512.5,395,372.5,330,305,255,252.5,0,0]
["84+-SQ",0,0,162.5,202.5,262.5,290,292.5,315,255,255,255,255,237.5,150,0,0,0,0,0,182.5,262.5,262.5,0,45,110,262.5,273,195,182.5,175,138.4,115,100.5,90,90,52.5,0]
["84+-BP",0,0,47.5,112.5,168,178,190,210,185,157.5,157.5,157.5,122.5,67.5,0,0,0,0,0,65,120,120,0,42.5,50,120,151.5,121,120,115.5,93,80,80,80,55,40,0]
["84+-DL",0,0,135,212.5,230,230,230,260.5,227.5,227.5,227.5,220,215,152.5,0,0,0,0,0,127.5,238,238,0,102.5,132.5,238,247,212.5,200,200,157.5,147.5,122.5,120,120,115,0]
["84+-TL",0,345,345,502.5,603.5,625,625,778,612.5,612.5,612.5,612.5,575,370,0,0,0,0,0,445,615.5,615.5,0,190,292.5,615.5,671.5,500,480,480,369.7,300,285.5,265,265,202.5,0]
["30-BPO",0,0,0,0,0,0,0,0,0,0,0,0,0,0,0,0,0,0,0,0,0,0,25,25.5,25.5,0,0,0,0,0,0,0,0,0,0,0,0]
["35-BPO",25,0,0,0,0,0,0,0,0,0,0,0,0,0,0,0,0,0,0,0,0,0,31,31,31,0,0,0,0,0,0,0,0,0,0,0,0]
["40-BPO",0,0,0,0,0,0,0,0,0,0,0,0,0,0,0,0,0,0,0,0,0,0,30,45,45,0,0,0,0,0,0,0,0,0,0,0,0]
["43-BPO",0,0,0,47.5,77.5,83,83,62.5,0,0,0,0,0,0,0,0,0,0,0,60,62.5,70,0,32.5,43,70,62.5,0,0,0,0,0,0,0,0,0,0]
["47-BPO",0,0,37.5,72.5,82.5,85,92.5,92.5,77.099999999999994,77.099999999999994,72.5,72.5,50,50,45,40,0,0,0,65,65,75,27.5,27.5,65,85,85,65,48,48,52.5,52.5,45,40,0,0,0]
["52-BPO",0,0,0,102.5,107.5,107.5,132.5,132.5,112.5,92.5,87.5,87.5,75,67.5,51,51,0,25,22.7,70,85,85,20,45,47.5,100,100,97.5,80.5,80.5,65,65,52.5,52.5,42.5,0,0]
["57-BPO",0,0,0,83,110,115,137.5,137.5,130,112.5,112.5,112.5,60.5,71.5,71.5,71.5,0,0,0,75,85,95,0,45,63,95,100,82.5,80,80,67.5,60,47.5,47.5,40,0,0]
["63-BPO",0,25,0,92.5,110,117.5,125,150,140.5,130,130,102.5,77.5,72.5,72.5,35,0,0,0,65,82.5,95,0,32.5,58,100,144,144,144,80,75,73,62.5,62.5,32.5,0,0]
["72-BPO",0,0,0,90,120,132.5,140,170,165,165,115,105,92.5,92.5,90,50,0,0,0,67,107.5,115,0,32.5,58,115,144,144,115,105,80.5,80.5,70,67.5,42.5,30,30]
["84-BPO",0,27.5,35,122.5,140,155,166,192.5,192.5,192.5,130.5,97.5,87.5,65,75,75,0,0,0,77.5,105,127.5,0,42.5,52.5,127.5,127.5,125,125,100,92.5,75,75,75,75,25,0]
["84+-BPO",0,0,0,112.5,168,178,190,210,190.5,182.5,172.5,160,122.5,85,80,0,0,0,0,95,120,120,0,42.5,50,120,151.5,122.5,120,120,93,85,80,80,71.5,40,0]
["30-DLO",0,0,0,0,0,0,0,0,0,0,0,0,0,0,0,0,0,0,0,0,0,0,60,65,65,0,0,0,0,0,0,0,0,0,0,0,0]
["35-DLO",57.5,0,0,0,0,0,0,0,0,0,0,0,0,0,0,0,0,0,0,0,0,0,76,76,76,0,0,0,0,0,0,0,0,0,0,0,0]
["40-DLO",0,0,0,0,0,0,0,0,0,0,0,0,0,0,0,0,0,0,0,0,0,0,72.5,87.5,90.7,0,0,0,0,0,0,0,0,0,0,0,0]
["43-DLO",0,0,0,92.5,142.5,142.5,142.5,142.5,0,0,0,0,0,0,0,0,0,0,0,105,125,125,0,75,92.5,125,125,0,0,0,0,0,0,0,0,0,0]
["47-DLO",0,0,77.5,147.5,147.5,160,162.5,162.5,152.5,152.5,145,142.5,127.5,127.5,127.5,0,0,0,0,125,125,132.5,72.5,72.5,122.5,151,182.5,147.5,120,120,120,120,120,120,0,0,0]
["52-DLO",0,0,0,170,183,180,182.5,192.5,170,170,157.5,145,123.5,102.5,88,88,0,0,61.2,132.5,132.5,147.4,35,110.5,102.5,166.5,187.5,187.5,162.5,158,132.5,132.5,115.5,115.5,80,65,0]
["57-DLO",0,0,0,175,183.7,192.5,192.5,197.5,182.5,177.5,177.5,147.5,132.5,95,92.5,90,0,0,0,137.5,167.5,170,0,92.5,113,185,193,162.5,162.5,151,125,120,115,97.5,77.5,0,0]
["63-DLO",0,52.5,0,181.4,205,215,215,227.5,197.5,190,183,180,137.5,130,130,80,0,0,0,164.5,166,195,0,95.5,140,197.5,221,202.5,202.5,175.5,160,135.5,125,125,60,0,0]
["72-DLO",0,0,0,170,220,220,220,257.5,249,249,180,180,157.5,157.5,150,61.2,0,0,0,147.5,200.5,205,0,107.5,132.5,205,246,205,195,195,195,150.5,130,125,92.5,42.5,42.5]
["84-DLO",0,55,87.5,200,204.1,225,235,252.5,228,228,210,152.5,115,115,135,122.5,0,0,0,181.4,205,227.5,0,93,137.5,227.5,235,227.5,227.5,170,152.5,152.5,132.5,115,125,60,0]
["84+-DLO",0,0,0,212.5,230,230,230,260.5,227.5,227.5,227.5,220,215,152.5,125,0,0,0,0,182.5,238,238,0,102.5,132.5,238,247,212.5,200,200,160,160,122.5,120,120,115,0]

{"sheet":"LB Records","index":16,"n_rows":151,"n_cols":38,"rows_kept":151,"cut":false,"hidden":true,"merged":[]}
[null,"Y1","Y2","Y3","T1","T2","T3","JR","O","M1a","M1b","M2a","M2b","M3a","M3b","M4a","M4b","M5a","M5b","M6","R-T1","R-T2","R-T3","R-Y1","R-Y2","R-Y3","R-JR","R-O","R-M1A","R-M1B","R-M2A","R-M2B","R-M3A","R-M3B","R-M4A","R-M4B","R-M5A","R-M5B"]
["66-SQ",0,0,0,0,0,0,0,0,0,0,0,0,0,0,0,0,0,0,0,0,0,0,99.2,99.2,99.2,0,0,0,0,0,0,0,0,0,0,0,0]
["66-BP",0,0,0,0,0,0,0,0,0,0,0,0,0,0,0,0,0,0,0,0,0,0,57.3,57.3,57.3,0,0,0,0,0,0,0,0,0,0,0,0]
["66-DL",0,0,0,0,0,0,0,0,0,0,0,0,0,0,0,0,0,0,0,0,0,0,154.30000000000001,154.30000000000001,154.30000000000001,0,0,0,0,0,0,0,0,0,0,0,0]
["66-TL",0,0,0,0,0,0,0,0,0,0,0,0,0,0,0,0,0,0,0,0,0,0,310.89999999999998,310.89999999999998,310.89999999999998,0,0,0,0,0,0,0,0,0,0,0,0]
["77-SQ",0,0,0,0,0,0,0,0,0,0,0,0,0,0,0,0,0,0,0,0,0,0,121.3,121.3,121.3,0,0,0,0,0,0,0,0,0,0,0,0]
["77-BP",0,0,0,0,0,0,0,0,0,0,0,0,0,0,0,0,0,0,0,0,0,0,66.099999999999994,66.099999999999994,66.099999999999994,0,0,0,0,0,0,0,0,0,0,0,0]
["77-DL",0,0,0,0,0,0,0,0,0,0,0,0,0,0,0,0,0,0,0,0,0,0,165.3,165.3,165.3,0,0,0,0,0,0,0,0,0,0,0,0]
["77-TL",0,0,0,0,0,0,0,0,0,0,0,0,0,0,0,0,0,0,0,0,0,0,352.7,352.7,352.7,0,0,0,0,0,0,0,0,0,0,0,0]
["88-SQ",0,0,0,0,0,0,0,0,0,0,0,0,0,0,0,0,0,0,0,0,0,0,0,137.80000000000001,179.7,0,0,0,0,0,0,0,0,0,0,0,0]
["88-BP",0,0,0,0,0,0,0,0,0,0,0,0,0,0,0,0,0,0,0,0,0,0,0,79.400000000000006,110.2,0,0,0,0,0,0,0,0,0,0,0,0]
["88-DL",0,0,0,0,0,0,0,0,0,0,0,0,0,0,0,0,0,0,0,0,0,0,0,205,221.6,0,0,0,0,0,0,0,0,0,0,0,0]
["88-TL",0,0,0,0,0,0,0,0,0,0,0,0,0,0,0,0,0,0,0,0,0,0,0,414.5,511.5,0,0,0,0,0,0,0,0,0,0,0,0]
["97-SQ",0,0,0,0,0,0,0,0,0,0,0,0,0,0,0,0,0,0,0,0,0,0,99.2,165.3,211.6,0,0,0,0,0,0,0,0,0,0,0,0]
["97-BP",0,0,0,0,0,0,0,0,0,0,0,0,0,0,0,0,0,0,0,0,0,0,71.7,88.2,126.8,0,0,0,0,0,0,0,0,0,0,0,0]
["97-DL",0,0,0,0,314.2,314.2,314.2,0,0,0,0,0,0,0,0,0,0,0,0,0,0,0,165.3,231.5,286.60000000000002,0,0,0,0,0,0,0,0,0,0,0,0]
["97-TL",0,0,0,0,700,700,700,0,0,0,0,0,0,0,0,0,0,0,0,0,0,0,336.2,485,617.29999999999995,0,0,0,0,0,0,0,0,0,0,0,0]
["105-SQ",0,0,0,0,0,0,0,0,0,0,0,0,0,0,0,0,0,0,0,154.30000000000001,154.30000000000001,154.30000000000001,93.7,121.3,231.5,154.30000000000001,154.30000000000001,0,0,0,0,0,0,0,0,0,0]
["105-BP",0,0,0,0,0,0,0,0,0,0,0,0,0,0,0,0,0,0,0,126.8,126.8,126.8,49.6,93.7,137.80000000000001,126.8,126.8,0,0,0,0,0,0,0,0,0,0]
["105-DL",0,0,0,0,0,0,0,0,0,0,0,0,0,0,0,0,0,0,0,215,215,215,121.3,192.9,303.10000000000002,215,215,0,0,0,0,0,0,0,0,0,0]
["105-TL",0,0,0,0,0,0,0,0,0,0,0,0,0,0,0,0,0,0,0,496,496,496,264.60000000000002,396.8,672.4,496,496,0,0,0,0,0,0,0,0,0,0]
["116-SQ",0,121.3,181.9,358.3,463,479.5,479.5,479.5,0,0,0,0,0,0,0,0,0,0,0,314.2,319.7,363.8,33.1,170.9,231.5,374.8,363.8,0,0,0,0,0,0,0,0,0,0]
["116-BP",0,78.3,137.80000000000001,215,347.2,347.2,347.2,319.7,0,0,0,0,0,0,0,0,0,0,0,181.9,209.4,253.5,44.1,99.2,159.80000000000001,259,253.5,0,0,0,0,0,0,0,0,0,0]
["116-DL",0,215,264.60000000000002,429.9,457.5,507.1,551.20000000000005,523.6,0,0,0,0,0,0,0,0,0,0,0,443.1,443.1,507.1,115.7,248,308.60000000000002,598.6,512.6,0,0,0,0,0,0,0,0,0,0]
["116-TL",0,414.5,584.20000000000005,992.1,1168.4000000000001,1207,1416.5,1416.5,0,1212.5,1107.8,1107.8,1102.3,0,0,0,0,0,0,928.1,928.1,1107.8,347.2,567.70000000000005,700,1232.4000000000001,1631.4,0,0,0,0,0,0,0,0,0,0]
["130-SQ",0,0,231.5,435.4,475,534.6,551.20000000000005,563.29999999999995,557.79999999999995,557.79999999999995,557.79999999999995,336.2,336.2,336.2,314.2,0,0,0,0,363.8,429.9,468.5,77.2,159.80000000000001,248,468.5,534.6,424.4,424.4,424.4,377,377,259,231.5,170.9,170.9,0]
["130-BP",0,0,115.7,275.60000000000002,330,330.7,369.3,369.3,314.2,292,259,259,215,215,215,0,0,0,0,254.6,254.6,281.10000000000002,88.2,88.2,159.80000000000001,330.7,330.7,242.5,226,209.4,209.4,209.4,176.4,176.4,93.7,93.7,0]
["130-DL",0,0,253.5,451.9,479.5,501.6,569.9,578.70000000000005,562.20000000000005,562.20000000000005,556.70000000000005,391.3,391.3,391.3,391.3,0,0,0,0,443.1,479.5,534.6,132.30000000000001,220.5,303.10000000000002,551.20000000000005,556.70000000000005,556.70000000000005,556.70000000000005,556.70000000000005,443.1,443.1,303.10000000000002,352.7,226,226,0]
["130-TL",0,529.1,600.79999999999995,1162.9000000000001,1185,1300.7,1334.9,1428.6,1350.3,1350.3,1345.9,948,909.4,909.4,909.4,0,0,0,0,1019.6,1157.4000000000001,1229.0999999999999,529.1,529.1,694.5,1273.2,1273.2,1201.5,1201.5,1179.5,873,873,749.6,749.6,490.5,490.5,0]
["145-SQ",0,0,181.9,451.9,540.1,600.79999999999995,700,700,551.20000000000005,496,496,440.9,440.9,440.9,363.8,248,0,0,0,374.8,425.5,457.5,0,330.7,330.7,557.79999999999995,562.20000000000005,435.4,421.1,421.1,418.9,409,270.10000000000002,270.10000000000002,181.9,181.9,181.9]
["145-BP",0,0,126.8,292.10000000000002,336.2,451.9,507.1,507.1,314.2,325.2,325.2,303.10000000000002,303.10000000000002,303.10000000000002,292.10000000000002,165.3,0,0,0,292.10000000000002,303.10000000000002,314.2,0,126.8,172,369.3,369.3,325.2,325.2,314.2,314.2,242.5,203.9,203.9,170.9,137.80000000000001,137.80000000000001]
["145-DL",0,0,220.5,485,529.1,573.20000000000005,606.29999999999995,611.79999999999995,600,600,600,496,463,463,347.2,264.60000000000002,0,0,0,451.9,468.5,502.7,0,165.3,341.7,595.20000000000005,611.79999999999995,578.70000000000005,518.1,507.1,451.9,418.9,331.8,331.8,270.10000000000002,220.5,220.5]
["145-TL",0,0,529.1,1118.8,1333.8,1543.2,1697.6,1697.6,1377.9,1295.2,1273.2,1185,1135.4000000000001,1135.4000000000001,948,622.79999999999995,0,0,0,1118.8,1118.8,1267.7,0,600.79999999999995,777.1,1516.8,1516.8,1251.0999999999999,1181.7,1181.7,1140.9000000000001,1026.3,771.6,771.6,540.1,540.1,540.1]
["163-SQ",0,0,0,512.6,562.20000000000005,672.4,722,722,617.29999999999995,589.70000000000005,589.70000000000005,534.6,518.1,440.9,385.8,336.2,148.80000000000001,0,0,440.9,474,563.29999999999995,0,0,440.9,580.9,585.29999999999995,545.6,485,435.4,403.4,386.9,352.7,352.7,286.60000000000002,275.60000000000002,0]
["163-BP",0,0,0,319.7,352.7,442,518.1,518.1,413.4,374.8,374.8,319.7,319.7,308.60000000000002,308.60000000000002,242.5,137.80000000000001,0,0,314.2,314.2,363.8,0,0,215,391.3,424.4,394.6,394.6,394.6,259,259,259,259,203.9,198.4,0]
["163-DL",0,0,0,501.6,645.1,655.9,727.5,727.5,666.9,600.79999999999995,600.79999999999995,562.20000000000005,507.1,496,485,435.4,275.60000000000002,0,0,424.4,556.70000000000005,618.4,0,0,402.3,672.4,677.9,677.9,529.1,529.1,529.1,446.4,429.9,429.9,369.3,341.7,0]
["163-TL",0,0,0,1262.0999999999999,1460.6,1670,1807.8,1807.8,1675.5,1537.7,1537.7,1322.8,1262.0999999999999,1179.3,1124.4000000000001,1008.6,562.20000000000005,0,0,1058.2,1333.8,1478.2,0,0,1058.2,1620.4,1653.5,1581.8,1284.2,1248.9000000000001,1175.0999999999999,1030.7,997.6,997.6,870.8,815.7,0]
["183-SQ",0,0,0,640.4,716.5,716.5,777.1,815.7,744.1,744.1,700,672.4,490.5,485,435.4,352.7,352.7,352.7,0,457.5,529.1,573.20000000000005,0,0,391.3,662.5,662.5,595.20000000000005,573.20000000000005,523.6,453,424.4,424.4,358.3,325.2,325.2,143.30000000000001]
["183-BP",0,0,0,352.7,440.9,474,661.4,661.4,551.20000000000005,534.6,468.5,435.4,382.5,336.2,325.2,275.60000000000002,237,198.4,0,303.10000000000002,385.8,391.3,0,0,215,429.9,444.2,413.4,396.8,396.8,341.7,309.7,293.2,253.5,200.6,181.9,176.4]
["183-DL",0,0,0,611.79999999999995,683.4,688.9,722,744.1,733,705.5,705.3,677.9,562.20000000000005,540,507.1,424.4,418.9,385.8,0,501.6,622.79999999999995,700,0,0,396.8,706.6,749.6,639.29999999999995,633.79999999999995,628.29999999999995,611.79999999999995,529.1,529.1,470.7,407.9,402.3,259]
["183-TL",0,0,0,1605,1802.3,1802.3,1934.6,2000.7,1901.5,1901.5,1703.1,1675.5,1322.8,1229.0999999999999,1234.5999999999999,1008.6,970,925.9,0,1179.5,1422,1631.4,0,0,1003.1,1785.7,1792.4,1559.8,1510.2,1493.6,1328.3,1174,1174,1082.5,903.9,903.9,534.6]
["205-SQ",0,88.2,0,551.20000000000005,700,755.1,826.7,826.7,766.1,766.1,766.1,716.5,617.29999999999995,490.5,440.9,374.8,330.7,143.30000000000001,0,485,580.9,639.29999999999995,0,66.099999999999994,374.8,722,722,717.6,717.6,717.6,717.6,458.6,458.6,396.8,319.7,319.7,0]
["205-BP",0,93.7,0,374.8,457.5,512.6,573.20000000000005,589.70000000000005,578.70000000000005,573.20000000000005,507.1,479.5,402.3,326.3,303,253.5,225,187.4,0,325.2,402.3,402.3,0,71.7,264.60000000000002,440.9,507.1,507.1,507.1,474,463,369.3,275.60000000000002,254.6,253.5,192.9,0]
["205-DL",0,203.9,0,567.70000000000005,711,771.6,832.2,832.2,756.2,733,723.1,716.5,584.20000000000005,573.20000000000005,540.1,440.7,380.3,275.60000000000002,0,523.6,700,722,0,170.9,374.8,777.1,777.1,705.5,683.4,683.4,683.4,580,580,485,397.9,397.9,0]
["205-TL",0,385.8,0,1361.4,1763.7,1984.2,2144,2144,1984.2,1984.2,1984.2,1829.8,1493.6,1339.3,1207,1014,920.4,606.29999999999995,0,1251.0999999999999,1620.4,1747.2,0,308.60000000000002,1014.1,1851.9,1851.9,1829.8,1829.8,1829.8,1829.8,1350.3,1224.7,1124.4000000000001,920.4,892.9,0]
["231-SQ",0,0,0,611.79999999999995,727.5,744.1,782.6,843.3,782.6,782.6,760.6,705.5,650.4,551.20000000000005,479.5,374.8,253.5,0,0,529.1,617.29999999999995,628.29999999999995,0,0,308.60000000000002,688.9,730.8,644.9,606.29999999999995,606.29999999999995,606.29999999999995,518.1,429.9,396.8,281.10000000000002,231.5,0]
["231-BP",0,0,0,402.3,457.5,534.6,628.29999999999995,713.2,535.70000000000005,535.70000000000005,534.6,534.6,501.6,415,385.8,325.2,220.5,0,0,325.2,380.3,413.4,0,0,242.5,474,525.79999999999995,512.6,512.6,407.9,374.8,348.3,337.3,264.60000000000002,237,226,0]
["231-DL",0,0,0,578.70000000000005,661.4,710,755,832.2,738.5,733,694.5,694.5,694.5,573.20000000000005,557.79999999999995,485,325.2,0,0,540.1,633.79999999999995,716.5,0,0,347.2,766.1,810.2,694.5,650.4,650.4,650.4,611.79999999999995,508.2,463,440.9,336.2,0]
["231-TL",0,0,0,1504.7,1686.5,1901.5,2000.7,2173.8000000000002,2017.2,2017.2,1843.1,1813.3,1697.6,1390,1350.3,1107.8,799.2,0,0,1394.4,1620.4,1752.7,0,0,898.4,1857.4,1962.1,1704.2,1642.4,1576.3,1570.8,1322.8,1275.4000000000001,1113.3,959,793.7,0]
["264-SQ",0,0,0,622.79999999999995,793.7,805.8,892.9,910.5,910.5,909.4,771.6,700,589.70000000000005,545.6,451.9,0,0,0,0,507.1,617.29999999999995,700,0,0,330.7,821.2,851,834.4,834.4,834.4,606.29999999999995,512.6,512.6,413.4,203.9,0,0]
["264-BP",0,0,0,358.3,540.1,622.79999999999995,650.4,705.5,688.9,578.70000000000005,578.70000000000005,534.6,429.9,413.4,363.8,0,0,0,0,319.7,402.3,451.9,0,0,165.3,534.6,557.79999999999995,485,451.9,435.4,407.9,385.8,352.7,325.2,242.5,0,0]
["264-DL",0,0,0,573.20000000000005,677.9,727.5,804.7,821.2,783.7,733,716.5,705.5,705.5,620.6,573.20000000000005,0,0,0,0,562.20000000000005,622.79999999999995,675,0,0,341.7,804.7,820.1,820.1,820.1,755.1,644.9,617.29999999999995,617.29999999999995,507.1,325.2,0,0]
["264-TL",0,0,0,1521.2,1923.5,2095.5,2281.8000000000002,2298.3000000000002,2238.8000000000002,2110.9,2083.4,1813.3,1581.8,1556.5,1372.4,0,0,0,0,1290.8,1614.9,1774.7,0,0,837.8,1962.1,2157.1999999999998,2082.3000000000002,2082.3000000000002,1973.1,1587.3,1411,1411,1157.4000000000001,738.5,0,0]
["264+-SQ",0,0,0,639.29999999999995,804.7,936.5,936.5,1113.3,950,950,887.4,705.5,683.4,600.79999999999995,463,203.9,0,0,0,727.5,805.8,938.1,0,435.4,435.4,938.1,1069.2,749.6,744.1,727.5,567.70000000000005,502.7,418.9,402.3,203.9,181.9,0]
["264+-BP",0,0,0,385.8,573.20000000000005,600.79999999999995,771.6,903.9,771.6,655.9,644.9,644.9,518.1,429.9,341.7,220.5,0,0,0,385.8,418.9,457.5,0,297.60000000000002,297.60000000000002,518.1,585.29999999999995,573.20000000000005,540.1,512.6,418.9,405,319.7,319.7,220.5,170.9,0]
["264+-DL",0,0,0,567.70000000000005,705,700,804.7,903.9,881.8,755.1,705.5,705.3,639.29999999999995,567.70000000000005,418.9,314.2,0,0,0,589.70000000000005,633.79999999999995,674.6,0,485,485,739.7,865.3,837.8,837.8,716.5,611.79999999999995,551.20000000000005,540.1,402.3,314.2,253.5,0]
["264+-TL",0,0,0,1592.8,2000.7,2094.4,2331.4,2805.4,2331.4,2320.4,2083.4,1901.5,1730.6,1554.3,1146.4000000000001,738.5,0,0,0,1592.8,1742.8,2029.4,0,1218.0999999999999,1218.0999999999999,2055.8000000000002,2436.1,2066.8000000000002,2066.8000000000002,1913.6,1559.8,1372.4,1273.2,1124.4000000000001,738.5,589.70000000000005,0]
["66-BPO",0,0,0,0,0,0,0,0,0,0,0,0,0,0,0,0,0,0,0,0,0,0,57.3,57.3,57.3,0,0,0,0,0,0,0,0,0,0,0,0]
["77-BPO",0,0,0,0,0,0,0,0,0,0,0,0,0,0,0,0,0,0,0,0,0,0,66.099999999999994,66.099999999999994,66.099999999999994,0,0,0,0,0,0,0,0,0,0,0,0]
["88-BPO",0,0,0,0,0,0,0,0,0,0,0,0,0,0,0,0,0,0,0,99.2,99.2,99.2,0,99.2,110.2,99.2,99.2,0,0,0,0,0,0,0,0,0,0]
["97-BPO",0,0,0,0,0,0,0,0,0,0,0,0,0,0,0,0,0,0,0,0,0,0,71.7,88.2,126.8,0,0,0,0,0,0,0,0,0,0,0,0]
["105-BPO",0,0,0,0,0,0,0,0,0,0,0,0,0,0,0,0,0,0,0,126.8,126.8,126.8,49.6,93.7,137.80000000000001,126.8,126.8,0,0,0,0,0,0,0,0,0,0]
["116-BPO",0,78.3,137.80000000000001,215,347.2,347.2,347.2,319.7,0,0,0,0,0,0,0,0,0,0,0,181.9,209.4,253.5,44.1,99.2,159.80000000000001,259,253.5,0,0,0,0,0,0,0,0,0,0]
["130-BPO",0,0,115.7,275.60000000000002,331.8,331.8,369.3,314.2,314.2,330.7,297.60000000000002,297.60000000000002,297.60000000000002,264.60000000000002,215,181.9,126.8,0,0,254.6,254.6,314.2,88.2,88.2,159.80000000000001,330.7,341.7,253.5,237,232.6,232.6,232.6,226,187.4,187.4,93.7,0]
["145-BPO",0,0,0,292.10000000000002,352.7,470.7,529.1,529.1,374.8,374.8,325.2,292.10000000000002,292.10000000000002,303.10000000000002,292.10000000000002,0,88.2,0,0,292.10000000000002,303.10000000000002,314.2,0,126.8,172,369.3,374.8,325.2,325.2,314.2,314.2,282.2,281.10000000000002,215,215,203.9,137.80000000000001]
["163-BPO",0,0,0,319.7,352.7,468.5,518.1,518.1,429.9,429.9,418.9,386.9,386.9,319.7,308.60000000000002,250.2,231.5,0,0,314.2,314.2,363.8,0,110.2,215,425.5,429.9,402.3,402.3,396.8,327.39999999999998,327.39999999999998,282.2,282.2,231.5,231.5,0]
["183-BPO",0,0,0,365,440.9,485,661.4,661.4,579.79999999999995,562.20000000000005,496,474,396.8,374.8,353.8,275.60000000000002,237,198.4,82.7,303.10000000000002,385.8,407.9,0,0,215,429.9,446.4,479.5,435.4,435.4,352.7,325.2,303.10000000000002,303.10000000000002,238.1,183,183]
["205-BPO",0,93.7,0,374.8,457.5,573.20000000000005,584.20000000000005,705.5,703.3,606.29999999999995,507.1,481.7,424.4,424.4,402.3,253.5,242.5,187.4,0,325.2,440.9,440.9,0,71.7,264.60000000000002,440.9,514.79999999999995,514.79999999999995,514.79999999999995,490.5,463,369.3,319.7,314.2,255.7,170.9,0]
["231-BPO",0,0,0,402.3,457.5,636,636,743,743,743,743,556.70000000000005,501.6,374.8,440.9,325.2,275.60000000000002,0,0,325.2,380.3,413.4,0,0,242.5,474,534.6,512.6,512.6,429.9,413.4,374.8,352.7,319.7,319.7,270.10000000000002,0]
["264-BPO",0,0,0,374.8,540.1,623.9,650.4,785.9,695.6,666.9,666.9,534.6,479.5,440.9,435.4,341.7,0,0,0,319.7,358,451.9,0,0,165.3,534.6,557.79999999999995,529.1,529.1,529.1,457.5,418.9,352.7,325.2,281.10000000000002,0,0]
["264+-BPO",0,0,0,385.8,573.20000000000005,600.79999999999995,771.6,903.9,848.8,799.2,705.5,705.5,633.79999999999995,512.6,396.8,220.5,0,0,0,385.8,418.9,457.5,0,297.60000000000002,297.60000000000002,600.79999999999995,639.29999999999995,573.20000000000005,545.6,523.6,502.7,502.7,352.7,319.7,286.60000000000002,170.9,0]
["66-DLO",0,0,0,0,0,0,0,0,0,0,0,0,0,0,0,0,0,0,0,0,0,0,154.30000000000001,154.30000000000001,154.30000000000001,0,0,0,0,0,0,0,0,0,0,0,0]
["77-DLO",0,0,0,0,0,0,0,0,0,0,0,0,0,0,0,0,0,0,0,0,0,0,165.3,165.3,165.3,0,0,0,0,0,0,0,0,0,0,0,0]
["88-DLO",0,0,0,0,0,0,0,0,0,0,0,0,0,0,0,0,0,0,0,198.4,198.4,198.4,0,205,221.6,198.4,198.4,0,0,0,0,0,0,0,0,0,0]
["97-DLO",0,0,0,0,314.2,314.2,314.2,0,0,0,0,0,0,0,0,0,0,0,0,0,0,0,165.3,231.5,286.60000000000002,0,0,0,0,0,0,0,0,0,0,0,0]
["105-DLO",0,0,0,0,0,0,0,0,0,0,0,0,0,0,0,0,0,0,0,215,215,215,121.3,192.9,303.10000000000002,215,215,0,0,0,0,0,0,0,0,0,0]
["116-DLO",0,215,264.60000000000002,429.9,457.5,507.1,567.70000000000005,523.6,0,0,0,0,0,0,0,0,0,0,0,443.1,443.1,507.1,115.7,248,308.60000000000002,598.6,512.6,0,0,0,0,0,0,0,0,0,0]
["130-DLO",0,0,253.5,451.9,479.5,501.6,569.9,578.70000000000005,562.20000000000005,562.20000000000005,556.70000000000005,391.3,391.3,391.3,391.3,0,0,0,0,443.1,479.5,534.6,132.30000000000001,220.5,303.10000000000002,551.20000000000005,556.70000000000005,556.70000000000005,556.70000000000005,556.70000000000005,443.1,443.1,303.10000000000002,352.7,226,226,0]
["145-DLO",0,0,0,485,529.1,573.20000000000005,606.29999999999995,611.79999999999995,600,600,600,496,463,463,347.2,0,0,0,0,451.9,468.5,502.7,0,165.3,341.7,595.20000000000005,611.79999999999995,578.70000000000005,518.1,507.1,451.9,418.9,331.8,331.8,270.10000000000002,220.5,220.5]
["163-DLO",0,0,0,501.6,645.1,655.9,727.5,727.5,666.9,584.20000000000005,600.79999999999995,562.20000000000005,507.1,496,485,435.4,275.60000000000002,0,0,424.4,556.70000000000005,618.4,0,0,402.3,672.4,677.9,677.9,529.1,529.1,529.1,446.4,429.9,429.9,369.3,341.7,0]
["183-DLO",0,0,0,611.79999999999995,683.4,688.9,722,749.6,733,705.5,705.5,677.9,562.20000000000005,540.1,507.1,424.4,418.9,385.8,0,501.6,622.79999999999995,700,0,0,396.8,706.6,749.6,639.29999999999995,633.79999999999995,628.29999999999995,611.79999999999995,529.1,529.1,470.7,407.9,402.3,259]
["205-DLO",0,203.9,0,567.70000000000005,711,810.2,832.2,832.2,770,733,723.1,716.5,584.20000000000005,573.20000000000005,540.1,440.9,380.3,275.60000000000002,0,523.6,700,722,0,170.9,374.8,777.1,777.1,705.5,688.9,688.9,688.9,610.70000000000005,580,485,397.9,397.9,0]
["231-DLO",0,0,0,578.70000000000005,661.4,710,843.3,854.3,738.5,677.9,677.9,672.4,694.5,573.20000000000005,557.79999999999995,485,0,0,0,540.1,633.79999999999995,716.5,0,0,347.2,766.1,810.2,694.5,650.4,650.4,650.4,611.79999999999995,508.2,463,440.9,0,0]
["264-DLO",0,0,0,1521.2,1521.2,1521.2,1521.2,821.2,783.7,783.7,766.1,665,705.5,620.6,573.20000000000005,0,0,0,0,562.20000000000005,622.79999999999995,675,0,0,341.7,804.7,820.1,820.1,820.1,755.1,644.9,617.29999999999995,617.29999999999995,507.1,391.3,0,0]
["264+-DLO",0,0,0,600.79999999999995,705,705.5,850,903.9,881.8,800,705.5,705.5,639.29999999999995,567.70000000000005,418.9,314.2,0,0,0,589.70000000000005,633.79999999999995,674.6,0,485,485,739.7,865.3,837.8,837.8,716.5,617.29999999999995,555,540.1,402.3,314.2,0,0]
["66-SQ",0,0,0,0,0,0,0,0,0,0,0,0,0,0,0,0,0,0,0,0,0,0,104.7,104.7,104.7,0,0,0,0,0,0,0,0,0,0,0,0]
["66-BP",0,0,0,0,0,0,0,0,0,0,0,0,0,0,0,0,0,0,0,0,0,0,55.1,56.2,56.2,0,0,0,0,0,0,0,0,0,0,0,0]
["66-DL",0,0,0,0,0,0,0,0,0,0,0,0,0,0,0,0,0,0,0,0,0,0,132.30000000000001,143.30000000000001,143.30000000000001,0,0,0,0,0,0,0,0,0,0,0,0]
["66-TL",0,0,0,0,0,0,0,0,0,0,0,0,0,0,0,0,0,0,0,0,0,0,270.10000000000002,298.7,298.7,0,0,0,0,0,0,0,0,0,0,0,0]
["77-SQ",99.2,0,0,0,0,0,0,0,0,0,0,0,0,0,0,0,0,0,0,0,0,0,133.4,133.4,133.4,0,0,0,0,0,0,0,0,0,0,0,0]
["77-BP",55.1,0,0,0,0,0,0,0,0,0,0,0,0,0,0,0,0,0,0,0,0,0,68.3,68.3,68.3,0,0,0,0,0,0,0,0,0,0,0,0]
["77-DL",126.8,0,0,0,0,0,0,0,0,0,0,0,0,0,0,0,0,0,0,0,0,0,167.6,167.6,167.6,0,0,0,0,0,0,0,0,0,0,0,0]
["77-TL",281.10000000000002,0,0,0,0,0,0,0,0,0,0,0,0,0,0,0,0,0,0,0,0,0,367.1,367.1,367.1,0,0,0,0,0,0,0,0,0,0,0,0]
["88-SQ",0,0,0,0,0,0,0,0,0,0,0,0,0,0,0,0,0,0,0,0,0,0,104.7,155.4,155.4,0,0,0,0,0,0,0,0,0,0,0,0]
["88-BP",0,0,0,0,0,0,0,0,0,0,0,0,0,0,0,0,0,0,0,0,0,0,66.099999999999994,99.2,99.2,0,0,0,0,0,0,0,0,0,0,0,0]
["88-DL",0,0,0,0,0,0,0,0,0,0,0,0,0,0,0,0,0,0,0,0,0,0,159.80000000000001,192.9,200,0,0,0,0,0,0,0,0,0,0,0,0]
["88-TL",0,0,0,0,0,0,0,0,0,0,0,0,0,0,0,0,0,0,0,0,0,0,325.2,446.4,446.4,0,0,0,0,0,0,0,0,0,0,0,0]
["94-SQ",0,0,0,203.9,303.10000000000002,303.10000000000002,303.10000000000002,275.60000000000002,0,0,0,0,0,0,0,0,0,0,0,215,221.6,221.6,0,143.30000000000001,165.3,221.6,187.4,0,0,0,0,0,0,0,0,0,0]
["94-BP",0,0,0,104.7,170.9,183,183,137.80000000000001,0,0,0,0,0,0,0,0,0,0,0,115.7,137.80000000000001,154.30000000000001,0,71.7,94.8,154.30000000000001,137.80000000000001,0,0,0,0,0,0,0,0,0,0]
["94-DL",0,0,0,203.9,314.2,314.2,314.2,314.2,0,0,0,0,0,0,0,0,0,0,0,231.5,275.60000000000002,275.60000000000002,0,165.3,203.9,275.60000000000002,275.60000000000002,0,0,0,0,0,0,0,0,0,0]
["94-TL",0,0,0,622.79999999999995,755.1,767.2,767.2,705.5,457.5,0,0,0,0,0,0,0,0,0,0,556.70000000000005,600.79999999999995,611.79999999999995,0,380.3,457.5,611.79999999999995,600.79999999999995,457.5,523.6,0,0,0,0,0,0,0,0]
["103-SQ",0,0,115.7,292.10000000000002,303.10000000000002,308.60000000000002,336.2,363.8,292.10000000000002,292.10000000000002,270.10000000000002,248,226,226,220.5,0,0,0,0,231.5,231.5,231.5,104.7,104.7,215,275.60000000000002,314.2,275.60000000000002,226,226,194,194,194,187.4,0,0,0]
["103-BP",0,0,82.7,159.80000000000001,181.9,181.9,203.9,203.9,170,170,143.30000000000001,143.30000000000001,110.2,110.2,99.2,0,0,0,0,143.30000000000001,143.30000000000001,165.3,60.6,60.6,143.30000000000001,187.4,187.4,143.30000000000001,105.8,105.8,99.2,99.2,99.2,88.2,0,0,0]
["103-DL",0,0,170.9,325.2,325.2,352.7,358.3,358.3,336.2,336.2,319.7,314.2,281.10000000000002,281.10000000000002,281.10000000000002,0,0,0,0,275.60000000000002,275.60000000000002,292.10000000000002,159.80000000000001,159.80000000000001,270.10000000000002,332.9,402.3,325.2,264.60000000000002,264.60000000000002,264.60000000000002,264.60000000000002,264.60000000000002,264.60000000000002,0,0,0]
["103-TL",0,534.6,534.6,771.6,766.1,815.7,865.3,887.4,788.2,788.2,722,700,600.79999999999995,600.79999999999995,600.79999999999995,0,0,0,0,628.29999999999995,628.29999999999995,644.9,325.2,391.3,628.29999999999995,738.5,876.3,738.5,584.20000000000005,584.20000000000005,553.4,553.4,553.4,540.1,0,0,0]
["114-SQ",0,0,220.5,352.7,391.3,396.8,427.7,427.7,402.3,402.3,286.60000000000002,264.60000000000002,253.5,220.5,167.6,167.6,0,0,80,226,237,259,44.1,165.3,176.4,314.2,345,345,345,336.2,220.5,220.5,187.4,176.4,143.30000000000001,0,0]
["114-BP",0,0,115.7,226,226,226,292.10000000000002,292.10000000000002,242.5,203.9,170.9,165.3,165.3,112.4,112.4,112.4,0,0,50,154.30000000000001,154.30000000000001,176.4,44.1,99.2,104.7,181.9,215,215,177.5,177.5,143.30000000000001,143.30000000000001,115.7,115.7,93.7,0,0]
["114-DL",0,0,198.4,374.8,403.4,396.8,403.4,424.4,374.8,374.8,347.2,319.7,272.3,226,194,194,0,0,135,292.10000000000002,292.10000000000002,325,77.2,243.6,209.4,367.1,413.4,413.4,358.3,348.3,292.10000000000002,292.10000000000002,254.6,254.6,176.4,0,0]
["114-TL",0,0,534.6,876.3,937,964.5,1105.5999999999999,1105.5999999999999,975.5,970,771.6,744.1,644.79999999999995,551.20000000000005,465.2,465.2,0,0,265,650.4,661.4,722,165.3,508.2,463,801.4,948,948,868.6,862,650.4,650.4,545.6,497.1,413.4,0,0]
["125-SQ",0,0,0,363.8,440.9,451.9,451.9,451.9,341.7,330.7,330.7,270.10000000000002,226,165.3,165.3,165.3,0,0,0,286.60000000000002,315.3,315.3,0,170.9,226,336.2,384.7,314.2,292.10000000000002,276.7,198.4,192.9,187.4,154.30000000000001,137.80000000000001,0,0]
["125-BP",0,0,0,183,242.5,253.5,303.10000000000002,303.10000000000002,264.60000000000002,215,215,215,157.6,157.6,157.6,157.6,0,0,0,165.3,187.4,209.4,0,99.2,138.9,209.4,220.5,176.4,176.4,176.4,143.30000000000001,132.30000000000001,104.7,99.2,88.2,0,0]
["125-DL",0,0,0,385.8,404.5,424.4,424.4,435.4,402.3,391.3,391.3,325.2,292.10000000000002,209.4,203.9,198.4,0,0,0,303.10000000000002,369.3,374.8,0,203.9,249.1,407.9,425.5,358.3,358.3,332.9,275.60000000000002,264.60000000000002,253.5,215,170.9,0,0]
["125-TL",0,0,391.3,909.4,1048.3,1102.3,1151.9000000000001,1151.9000000000001,981.1,876.3,865.3,804.7,644.9,457.5,457.5,457.5,0,0,0,722,815.7,859.8,391.3,474,578.70000000000005,921.5,1020.7,816.8,766.1,739.7,617.29999999999995,589.70000000000005,545.6,468.5,396.8,0,0]
["138-SQ",0,82.7,0,363.8,402.3,446.4,446.4,474,440.9,413.4,385.8,358.3,242.5,242.5,198.4,148.80000000000001,0,0,0,321.89999999999998,321.89999999999998,336.2,0,149.9,237,352.7,396.8,341.7,341.7,292.10000000000002,288.8,226,198.4,181.9,71.7,0,0]
["138-BP",0,55.1,0,203.9,226,259,275.60000000000002,330.7,309.7,286.60000000000002,286.60000000000002,187.4,165.3,159.80000000000001,159.80000000000001,77.2,0,0,0,143.30000000000001,181.9,209.4,0,71.7,127.9,220.5,314.2,314.2,314.2,176.4,165.3,160.9,137.80000000000001,137.80000000000001,71.7,0,0]
["138-DL",0,115.7,0,400,451.9,474,474,501.6,435.4,418.9,403.4,396.8,303.10000000000002,286.60000000000002,286.60000000000002,176.4,0,0,0,362.7,366,429.9,0,210.5,308.60000000000002,435.4,487.2,446.4,446.4,386.9,352.7,298.7,275.60000000000002,275.60000000000002,132.30000000000001,0,0]
["138-TL",0,253.5,0,920.4,1052.7,1102.3,1102.3,1207,1118.8,1008.6,997.6,920.4,688.9,655.9,644.9,402.3,0,0,0,800.3,828.9,920.4,0,424.4,673.5,975.5,1101.2,1101.2,1101.2,778.2,777.1,685.6,595.20000000000005,589.70000000000005,275.60000000000002,0,0]
["158-SQ",0,0,0,385.8,440.9,479.5,490.5,562.20000000000005,540.1,529.1,374.8,358.3,336.2,314.2,308.60000000000002,85,0,0,0,275.60000000000002,371.5,396.8,0,170.9,249.1,396.8,414.5,385.8,325.2,320.8,320.8,265.7,231.5,231.5,99.2,0,0]
["158-BP",0,0,0,198.4,264.60000000000002,292.10000000000002,303.10000000000002,374.8,363.8,363.8,253.5,231.5,203.9,198.4,198.4,60,0,0,0,147.69999999999999,237,253.5,0,71.7,127.9,253.5,317.5,317.5,253.5,192.9,177.5,177.5,154.30000000000001,148.80000000000001,93.7,0,0]
["158-DL",0,0,0,374.8,485,485,485,556.70000000000005,549,549,396.8,396.8,347.2,347.2,330.7,135,0,0,0,325.2,442,451.9,0,237,292.10000000000002,451.9,542.29999999999995,451.9,429.9,429.9,429.9,331.8,286.60000000000002,275.60000000000002,203.9,0,0]
["158-TL",0,0,0,948,1102.3,1168.4000000000001,1196,1441.8,1441.8,1441.8,992.1,981.1,859.8,859.8,832.2,280,0,0,0,744.1,1050.5,1096.8,0,496,669.1,1096.8,1210.3,1074.8,997.6,922.6,922.6,733,672.4,655.9,396.8,0,0]
["185-SQ",0,82.7,121.3,396.8,464.1,501.6,530.20000000000005,603,545.6,540.1,396.8,319.7,231.5,231.5,231.5,215,0,0,0,286.60000000000002,396.8,490.5,0,137.80000000000001,275.60000000000002,496,490.5,440.9,440.9,319.7,314.2,254.6,220.5,181.9,181.9,0,0]
["185-BP",0,60.6,77.2,220.5,303.10000000000002,308.60000000000002,366,424.4,424.4,424.4,287.7,226,165.3,165.3,165.3,159.80000000000001,0,0,0,148.80000000000001,231.5,281.10000000000002,0,93.7,115.7,281.10000000000002,281.10000000000002,275.60000000000002,275.60000000000002,220.5,198.4,159.80000000000001,159.80000000000001,126.8,115.7,0,0]
["185-DL",0,0,192.9,440.9,440.9,496,518.1,518.1,502.7,502.7,463,336.2,297.60000000000002,297.60000000000002,297.60000000000002,270.10000000000002,0,0,0,400,451.9,501.6,0,205,303.10000000000002,501.6,518.1,501.6,501.6,374.8,336.2,336.2,292.10000000000002,275.60000000000002,275.60000000000002,0,0]
["185-TL",0,385.8,385.8,1047.2,1118.8,1223.5999999999999,1350.3,1479.3,1462.8,1462.8,1064.8,865.3,677.9,677.9,677.9,617.29999999999995,0,0,0,744.1,1080.3,1262.0999999999999,0,436.5,694.5,1262.0999999999999,1262.0999999999999,1129.9000000000001,1129.9000000000001,870.8,821.2,727.5,672.4,562.20000000000005,556.70000000000005,0,0]
["185+-SQ",0,0,358.3,446.4,578.70000000000005,639.29999999999995,644.9,694.5,562.20000000000005,562.20000000000005,562.20000000000005,562.20000000000005,523.6,330.7,0,0,0,0,0,402.3,578.70000000000005,578.70000000000005,0,99.2,242.5,578.70000000000005,601.9,429.9,402.3,385.8,305,253.5,221.6,198.4,198.4,115.7,0]
["185+-BP",0,0,104.7,248,370.4,392.4,418.9,463,407.9,347.2,347.2,347.2,270.10000000000002,148.80000000000001,0,0,0,0,0,143.30000000000001,264.60000000000002,264.60000000000002,0,93.7,110.2,264.60000000000002,334,266.8,264.60000000000002,254.6,205,176.4,176.4,176.4,121.3,88.2,0]
["185+-DL",0,0,297.60000000000002,468.5,507.1,507.1,507.1,574.29999999999995,501.6,501.6,501.6,485,474,336.2,0,0,0,0,0,281.10000000000002,524.70000000000005,524.70000000000005,0,226,292.10000000000002,524.70000000000005,544.5,468.5,440.9,440.9,347.2,325.2,270.10000000000002,264.60000000000002,264.60000000000002,253.5,0]
["185+-TL",0,760.6,760.6,1107.8,1330.5,1377.9,1377.9,1715.2,1350.3,1350.3,1350.3,1350.3,1267.7,815.7,0,0,0,0,0,981.1,1356.9,1356.9,0,418.9,644.9,1356.9,1480.4,1102.3,1058.2,1058.2,815,661.4,629.4,584.20000000000005,584.20000000000005,446.4,0]
["66-BPO",0,0,0,0,0,0,0,0,0,0,0,0,0,0,0,0,0,0,0,0,0,0,55.1,56.2,56.2,0,0,0,0,0,0,0,0,0,0,0,0]
["77-BPO",55.1,0,0,0,0,0,0,0,0,0,0,0,0,0,0,0,0,0,0,0,0,0,68.3,68.3,68.3,0,0,0,0,0,0,0,0,0,0,0,0]
["88-BPO",0,0,0,0,0,0,0,0,0,0,0,0,0,0,0,0,0,0,0,0,0,0,66.099999999999994,99.2,99.2,0,0,0,0,0,0,0,0,0,0,0,0]
["94-BPO",0,0,0,104.7,170.9,183,183,137.80000000000001,0,0,0,0,0,0,0,0,0,0,0,132.30000000000001,137.80000000000001,154.30000000000001,0,71.7,94.8,154.30000000000001,137.80000000000001,0,0,0,0,0,0,0,0,0,0]
["103-BPO",0,0,82.7,159.80000000000001,181.9,187.4,203.9,203.9,170,170,159.80000000000001,159.80000000000001,110.2,110.2,99.2,88.2,0,0,0,143.30000000000001,143.30000000000001,165.3,60.6,60.6,143.30000000000001,187.4,187.4,143.30000000000001,105.8,105.8,115.7,115.7,99.2,88.2,0,0,0]
["114-BPO",0,0,0,226,237,237,292.10000000000002,292.10000000000002,248,203.9,192.9,192.9,165.3,148.80000000000001,112.4,112.4,0,55.1,50,154.30000000000001,187.4,187.4,44.1,99.2,104.7,220.5,220.5,215,177.5,177.5,143.30000000000001,143.30000000000001,115.7,115.7,93.7,0,0]
["125-BPO",0,0,0,183,242.5,253.5,303.10000000000002,303.10000000000002,286.60000000000002,248,248,248,133.4,157.6,157.6,157.6,0,0,0,165.3,187.4,209.4,0,99.2,138.9,209.4,220.5,181.9,176.4,176.4,148.80000000000001,132.30000000000001,104.7,104.7,88.2,0,0]
["138-BPO",0,55.1,0,203.9,242.5,259,275.60000000000002,330.7,309.7,286.60000000000002,286.60000000000002,226,170.9,159.80000000000001,159.80000000000001,77.2,0,0,0,143.30000000000001,181.9,209.4,0,71.7,127.9,220.5,317.5,317.5,317.5,176.4,165.3,160.9,137.80000000000001,137.80000000000001,71.7,0,0]
["158-BPO",0,0,0,198.4,264.60000000000002,292.10000000000002,308.60000000000002,374.8,363.8,363.8,253.5,231.5,203.9,203.9,198.4,110.2,0,0,0,147.69999999999999,237,253.5,0,71.7,127.9,253.5,317.5,317.5,253.5,231.5,177.5,177.5,154.30000000000001,148.80000000000001,93.7,66.099999999999994,66.099999999999994]
["185-BPO",0,60.6,77.2,270.10000000000002,308.60000000000002,341.7,366,424.4,424.4,424.4,287.7,215,192.9,143.30000000000001,165.3,165.3,0,0,0,170.9,231.5,281.10000000000002,0,93.7,115.7,281.10000000000002,281.10000000000002,275.60000000000002,275.60000000000002,220.5,203.9,165.3,165.3,165.3,165.3,55.1,0]
["185+-BPO",0,0,0,248,370.4,392.4,418.9,463,420,402.3,380.3,352.7,270.10000000000002,187.4,176.4,0,0,0,0,209.4,264.60000000000002,264.60000000000002,0,93.7,110.2,264.60000000000002,334,270.10000000000002,264.60000000000002,264.60000000000002,205,187.4,176.4,176.4,157.6,88.2,0]
["66-DLO",0,0,0,0,0,0,0,0,0,0,0,0,0,0,0,0,0,0,0,0,0,0,132.30000000000001,143.30000000000001,143.30000000000001,0,0,0,0,0,0,0,0,0,0,0,0]
["77-DLO",126.8,0,0,0,0,0,0,0,0,0,0,0,0,0,0,0,0,0,0,0,0,0,167.6,167.6,167.6,0,0,0,0,0,0,0,0,0,0,0,0]
["88-DLO",0,0,0,0,0,0,0,0,0,0,0,0,0,0,0,0,0,0,0,0,0,0,159.80000000000001,192.9,200,0,0,0,0,0,0,0,0,0,0,0,0]
["94-DLO",0,0,0,203.9,314.2,314.2,314.2,314.2,0,0,0,0,0,0,0,0,0,0,0,231.5,275.60000000000002,275.60000000000002,0,165.3,203.9,275.60000000000002,275.60000000000002,0,0,0,0,0,0,0,0,0,0]
["103-DLO",0,0,170.9,325.2,325.2,352.7,358.3,358.3,336.2,336.2,319.7,314.2,281.10000000000002,281.10000000000002,281.10000000000002,0,0,0,0,275.60000000000002,275.60000000000002,292.10000000000002,159.80000000000001,159.80000000000001,270.10000000000002,332.9,402.3,325.2,264.60000000000002,264.60000000000002,264.60000000000002,264.60000000000002,264.60000000000002,264.60000000000002,0,0,0]
["114-DLO",0,0,0,374.8,403.4,396.8,402.3,424.4,374.8,374.8,347.2,319.7,272.3,226,194,194,0,0,135,292.10000000000002,292.10000000000002,325,77.2,243.6,226,367.1,413.4,413.4,358.3,348.3,292.10000000000002,292.10000000000002,254.6,254.6,176.4,143.30000000000001,0]
["125-DLO",0,0,0,385.8,405,424.4,424.4,435.4,402.3,391.3,391.3,325.2,292.10000000000002,209.4,203.9,198.4,0,0,0,303.10000000000002,369.3,374.8,0,203.9,249.1,407.9,425.5,358.3,358.3,332.9,275.60000000000002,264.60000000000002,253.5,215,170.9,0,0]
["138-DLO",0,115.7,0,400,451.9,474,474,501.6,435.4,418.9,403.4,396.8,303.10000000000002,286.60000000000002,286.60000000000002,176.4,0,0,0,362.7,366,429.9,0,210.5,308.60000000000002,435.4,487.2,446.4,446.4,386.9,352.7,298.7,275.60000000000002,275.60000000000002,132.30000000000001,0,0]
["158-DLO",0,0,0,374.8,485,485,485,567.70000000000005,549,549,396.8,396.8,347.2,347.2,330.7,135,0,0,0,325.2,442,451.9,0,237,292.10000000000002,451.9,542.29999999999995,451.9,429.9,429.9,429.9,331.8,286.60000000000002,275.60000000000002,203.9,93.7,93.7]
["185-DLO",0,121.3,192.9,440.9,450,496,518.1,556.70000000000005,502.7,502.7,463,336.2,253.5,253.5,297.60000000000002,270.10000000000002,0,0,0,400,451.9,501.6,0,205,303.10000000000002,501.6,518.1,501.6,501.6,374.8,336.2,336.2,292.10000000000002,253.5,275.60000000000002,132.30000000000001,0]
["185+-DLO",0,0,0,468.5,507.1,507.1,507.1,574.29999999999995,501.6,501.6,501.6,485,474,336.2,275.60000000000002,0,0,0,0,402.3,524.70000000000005,524.70000000000005,0,226,292.10000000000002,524.70000000000005,544.5,468.5,440.9,440.9,352.7,352.7,270.10000000000002,264.60000000000002,264.60000000000002,253.5,0]

{"sheet":"Quick-Reference","index":17,"n_rows":35,"n_cols":7,"rows_kept":35,"cut":false,"hidden":false,"merged":[]}
[null,null,null,null,null,null,"Quick Reference Sheet"]
[null,null,null,null,null,null,"video tutorial:  https://www.youtube.com/watch?v=o-PyI1n_EMI"]
[]
[null,"1.      Setup sheet"]
[null,"a.      Reset for New Contest"]
[null,"b.      Contest Name"]
[null,"c.       Select type of meet from the drop down menu."]
[null,"d.      Use drop downs to enter the actual weights on the platform"]
[null,"e.      Enter Divisions – Abbreviation, Description, Placing code "]
[null,"f.       Enter Teams & Abbreviations"]
[null,"g.      Enter Flights/Groups you will use in your contest"]
[null,"h.      Select the weight of bar & collars"]
[null,"2.      Before the contest, insert your Contest logo into the Awards sheet - change font, background and text colors."]
[null,"3.      Weigh-in sheet"]
[null,"a.      If you copy/paste data into the Weigh-in sheet, paste Values only to preserve formatting and validation.  Red Text indicates an error."]
[null,"b.      Print Speaker Cards"]
[null,"                                                     i.     Click Print Cards button on Weigh-in sheet to print cards with data"]
[null,"                                                   ii.     For blank cards, go to the SpeakersCard sheet and click Print Blank Cards"]
[null,"c.       Do not leave blank rows between Lifters"]
[null,"d.      Click the button at the top of the sheet to copy weighed-in athletes to the Lifting sheet"]
[null,"4.      Lifting sheet"]
[null,"a.      Select the 1st flight/group from the pulldown in cell A11"]
[null,"b.      Select Squat 1, Benchpress 1 or Deadlift 1 from the pulldown"]
[null,"c.       Select the an option to advance to the next lifter - Auto, Delay, Man"]
[null,"                                                     i.     Auto to advance without delay after a Good or NoLift"]
[null,"                                                   ii.     Delay for livestreamed contests – then select a Delay time (2-5 seconds)"]
[null,"                                                  iii.     Man for manual advance during 3rd attempts – then click Next to advance to the next lifter"]
[null,"d.      Click Good or NoLift"]
[null,"e.      Use Ctrl + G (good) or Ctrl + N (no-lift) to go back and fix an incorrect entry"]
[null,"f.       Add DQ to Events Entered column for disqualified lifters.  Add DT to the events for a drug tested lifter."]
[null,"g.      Re-attempts - type the weight in the cell when a re-attempt is granted"]
[null,"                                                     i.     Use the dropdown menu in the name block (cell A1) to select a lifter for a re-attempt "]
[null,"h.      Printouts - Use the dropdown menu next to the printer icon to select the type of printout desired – click the printer icon to print"]
[null,"i.        Select Sorted Results at the end of the lifting session for a sorted printout (this step is necessary to load data for the Awards sheet.  Have the referees sign a printout of this sheet."]
[null,"5.      Awards sheet.  Use the dropdown menu to select the awards to display (only the divisions, weight classes, and events actually used in the contest will be in the menu)"]

{"sheet":"IPF Formula","index":18,"n_rows":18,"n_cols":5,"rows_kept":18,"cut":false,"hidden":false,"merged":[[0,0,1,0],[0,1,0,2],[0,3,0,4]]}
[null,"Mean",null,"Standard Deviation"]
[null,"Parameter 1","Parameter 2","Parameter 1","Parameter 2"]
["Men CL 3-Lift",310.67,857.78499999999997,53.216000000000001,147.08349999999999]
["Men CL Squat",123.1,363.08499999999998,25.166699999999999,75.431100000000001]
["Men CL Bench",86.474500000000006,259.15499999999997,17.578499999999998,53.122]
["Men CL Deadlift",103.5355,244.76499999999999,15.37134,31.502199999999998]
["Men EQ 3-Lift",387.26499999999999,1121.28,80.632400000000004,222.4896]
["Men EQ Squat",150.48500000000001,446.44499999999999,36.515500000000003,103.70610000000001]
["Men EQ Bench",133.94,441.46499999999997,35.393799999999999,113.0057]
["Men EQ Deadlift",110.13500000000001,263.66000000000003,14.996,23.010999999999999]
["Women CL 3-Lift",125.1435,228.03,34.5246,86.830100000000002]
["Women CL Squat",50.478999999999999,105.63200000000001,19.1846,56.221499999999999]
["Women CL Bench",25.048500000000001,43.847999999999999,6.7172000000000001,13.952]
["Women CL Deadlift",47.136000000000003,67.349000000000004,9.1555,13.67]
["Women EQ 3-Lift",176.58,373.315,48.453400000000002,110.0103]
["Women EQ Squat",74.685500000000005,171.58500000000001,21.947500000000002,52.294800000000002]
["Women EQ Bench",49.106000000000002,124.209,23.199000000000002,67.492599999999996]
["Women EQ Deadlift",51.002000000000002,69.826499999999996,8.5801999999999996,5.7257999999999996]