{"text_format":"1","workbook":"xlsx","n_sheets":19,"sheets":["Setup","Lists","DATA","Weigh-In","最初の入力","Lifting","QuickPrint","集計用","集計１","表彰状","団体用","Awards","SpeakersCard","ContestResults","ContestLog","KG Records","LB Records","Quick-Reference","IPF Formula"],"not_rendered":{"charts":1,"images":34,"macros":1,"external_links":5,"defined_names":8,"comments":3,"pivot_tables":0},"unopened":[],"bounds":{"document_bytes":16777216,"sheet_cells":100000,"rows_first":2000,"rows_last":500,"rows_between":2000,"halvings":0,"cell_chars":16384,"cell_head_chars":4096},"cells_cut":0,"cells_raw":0,"read":"whole","date_system":"1900"}

{"sheet":"Setup","index":0,"n_rows":101,"n_cols":26,"rows_kept":101,"cut":false,"hidden":false,"merged":[[39,16,39,21],[37,21,37,26],[5,1,6,6],[8,1,9,6],[11,1,12,6],[14,1,15,3],[14,4,15,5],[14,6,15,6],[32,1,33,1],[32,2,33,3],[32,4,33,4],[32,5,33,6],[0,1,0,6],[2,16,3,16],[2,12,3,13],[2,1,3,6],[2,8,3,10],[0,8,0,9]]}
[null,"video tutorial:  https://www.youtube.com/watch?v=o-PyI1n_EMI",null,null,null,null,null,null,null,null,"2019-02-27",null,null,null,null,null,null,null,null,{"$f":"MATCH(B9,T2:T6,0)","v":1},null,null,null,null,null,{"$f":"MAX(K:K)","v":43523}]
[null,null,null,null,null,null,null,null,null,null,null,null,null,null,null,null,null,null,null,"Powerlifting (3 lift meet)"]
[null,"Reset for New Contest",null,null,null,null,null,null,"IPF Divisions",null,null,null,"Teams",null,null,null,"Grp",null,null,"Bench Press Only"]
[null,null,null,null,null,null,null,null,null,null,null,null,null,null,null,null,null,null,null,"Squat Only"]
[null,null,null,null,null,null,null,null,"Abbrev","Description","Pl Code",null,"Abrev","Team Name",null,{"$f":"CONCATENATE($Q$3,\" \",Q5)","v":"Grp A"},"A",{"$f":"IF(ROW(P5)<$S$5,ROW(P5)+$S$5+1,ROW(P5)-$S$5)","v":0},{"$f":"IFERROR(MATCH(Lifting!A11,Setup!P5:P20,0)+4,0)","v":5},"Deadlift Only"]
[null,"〇〇パワーリフティング選手権",null,null,null,null,null,null,"F-SJR-U","Raw Women (14-18)",1,null,null,null,null,"Grp B","B",{"$f":"IF(ROW(P6)<$S$5,ROW(P6)+$S$5+1,ROW(P6)-$S$5)","v":1},null,"Push Pull (Bench & Deadlift)"]
[null,null,null,null,null,null,null,null,"F-JR-U","Raw Women (19-23)",1,null,null,null,null,"Grp C","C",2]
[null,null,null,null,null,null,null,null,"F-O-U","Raw Women",1,null,null,null,null,"Grp D","D",3]
{"$rows_left_out":94}
{"sheet":"Lists","index":1,"n_rows":67,"n_cols":23,"rows_kept":67,"cut":false,"hidden":true,"merged":[]}
["Attempts",null,"col",null,{"$f":"MATCH(Setup!B9,Lists!F1:J1,0)","v":1},"Powerlifting (3 lift meet)","Squat Only","Bench Press Only","Deadlift Only","Push Pull (Bench & Deadlift)",null,"column #","column Ltr",null,"Barload for Next Lifter"]
["Squat 1","SQ-1",11,null,{"$f":"OFFSET(E2,0,$E$1)","v":"Squat 1"},"Squat 1","Squat 1","Bench Press 1","Deadlift 1","Bench Press 1",null,1,"A",null,null,{"$f":"Setup!G15","v":"Kg"},null,null,null,null,null,null,"Y1"]
["Squat 2","SQ-2",12,null,"Squat 2","Squat 2","Squat 2","Bench Press 2","Deadlift 2","Bench Press 2",null,2,"B",null,null,{"$f":"ABS(Lists!B41)","v":{"$error":"#N/A"}},{"$f":"2*(Q6*P6+Q7*P7+Q8*P8+Q9*P9+Q10*P10+Q11*P11+Q12*P12+Q13*P13+Q14*P14+Q15*P15+Q16*P16)+Q35","v":{"$error":"#N/A"}},null,null,null,null,null,"Y2"]
["Squat 3","SQ-3",13,null,"Squat 3","Squat 3","Squat 3","Bench Press 3","Deadlift 3","Bench Press 3",null,3,"C",null,"How","Pound","LOAD",null,null,null,null,null,"Y3"]
["Bench Press 1","BP-1",16,null,"Bench Press 1","Bench Press 1","------------","------------","------------","Deadlift 1",null,4,"D",null,"Many?","Plates","on Bar",null,null,null,null,null,"T1"]
["Bench Press 2","BP-2",17,null,"Bench Press 2","Bench Press 2","New Lifter","New Lifter","New Lifter","Deadlift 2",null,5,"E",null,{"$f":"Setup!B21","v":0},110,{"$f":"IF(OR(P3<Q35,P2=\"Kg\"),0,MIN(INT((P3-Q35)/(2*P6)),O6/2))","v":{"$error":"#N/A"}},{"$f":"IF(Q6=0,\"\",IF(Q6>1,CONCATENATE(Q6,\"/\",P6,\" \"),CONCATENATE(P6,\" \")))","v":{"$error":"#N/A"}},null,null,null,null,"T2"]
["Bench Press 3","BP-3",18,null,"Bench Press 3","Bench Press 3",null,null,null,"Deadlift 3",null,6,"F",null,{"$f":"Setup!B22","v":0},100,{"$f":"IF(OR(P3<Q35,P2=\"Kg\"),0,MIN(INT((P3-Q35-2*Q6*P6)/(2*P7)),O7/2))","v":{"$error":"#N/A"}},{"$f":"IF(Q7=0,\"\",IF(Q7>1,CONCATENATE(Q7,\"/\",P7,\" \"),CONCATENATE(P7,\" \")))","v":{"$error":"#N/A"}},null,null,null,null,"T3"]
["Deadlift 1","DL-1",21,null,"Deadlift 1","Deadlift 1",null,null,null,"------------",null,7,"G",null,{"$f":"Setup!B23","v":0},55,{"$f":"IF(OR(P3<Q35,P2=\"Kg\"),0,MIN(INT((P3-Q35-2*Q6*P6-2*Q7*P7)/(2*P8)),O8/2))","v":{"$error":"#N/A"}},{"$f":"IF(Q8=0,\"\",IF(Q8>1,CONCATENATE(Q8,\"/\",P8,\" \"),CONCATENATE(P8,\" \")))","v":{"$error":"#N/A"}},null,null,null,null,"JR"]
{"$rows_left_out":60}
{"sheet":"DATA","index":2,"n_rows":151,"n_cols":43,"rows_kept":151,"cut":false,"hidden":true,"merged":[[0,36,0,38],[0,40,0,42]]}
["Age","Coeff",null,null,"wt","IPF Men-kg","IPF women-kg",null,"wt class list","rank",null,"US State:","USAPL",null,"WT","HS Men-lb","HS Women-lb","WT","IPF Men-lb","IPF women-lb","wt","HS Men-kg","HS women-kg","wt","IPF Men-kg","IPF women-kg",null,"wt class rank kg","wt class rank lb","wt class rank kg",null,null,null,null,null,null,"USAPL Dvisions",null,null,null,"IPF Divisions"]
[14,1.23,"Foster",null,10,30,30,null,43,1,null,"Alabama","AL",null,88.186204599999996,114,97,22.045999999999999,66,66,10,52,44,10,30,30,null,30,66,30,null,"30-SQ","30-SQ","66-SQ",null,null,"FR-Y1","Raw Women (8-9)",1,null,"FR-SJr","Raw Women (14-18)",1]
[15,1.18,null,null,30.001000000000001,35,35,null,44,2,null,"Alaska","AK",null,97.004604599999993,114,105,66.140204600000004,77,77,44.000999999999998,52,48,30.001000000000001,35,35,null,35,77,35,null,"30-BP","30-BP","66-BP",null,null,"FR-Y2","Raw Women (10-11)",1,null,"FR-Jr","Raw Women (19-23)",1]
[16,1.1299999999999999,null,null,35.000999999999998,40,40,null,47,3,null,"Arizona","AZ",null,105.8230046,114,114,77.1632046,88,88,48.000999999999998,52,52,35.000999999999998,40,40,null,40,88,40,null,"30-DL","30-DL","66-DL",null,null,"FR-Y3","Raw Women (12-13)",1,null,"FR-O","Raw Women",1]
[17,1.08,null,null,40.000999999999998,44,43,null,48,4,null,"Arkansas","AR",null,114.6414046,123,123,88.186204599999996,97,94,52.000999999999998,56,56,40.000999999999998,44,43,null,43,94,43,null,"30-TL","30-TL","66-TL",null,null,"FR-T1","Raw Women (14-15)",1,null,"FR-M1","Raw Women (40-49)",1]
[18,1.06,null,null,43.000999999999998,44,47,null,52,5,null,"California","CA",null,123.4598046,132,132,94.800004599999994,97,103,56.000999999999998,60,60,43.000999999999998,44,47,null,44,97,44,null,"35-SQ","35-SQ","77-SQ",null,null,"FR-T2","Raw Women (16-17)",1,null,"FR-M2","Raw Women (50-59)",1]
[19,1.04,null,null,44.000999999999998,48,47,null,53,6,null,"Colorado","CO",null,132.27820460000001,148,148,97.004604599999993,105,103,60.000999999999998,67.5,67.5,44.000999999999998,48,47,null,47,103,47,null,"35-BP","35-BP","77-BP",null,null,"FR-T3","Raw Women (18-19)",1,null,"FR-M3","Raw Women (60-69)",1]
[20,1.03,null,null,47.000999999999998,48,52,null,56,7,null,"Connecticut","CT",null,148.81270460000002,165,165,103.61840460000001,105,114,67.501000000000005,75,75,47.000999999999998,48,52,null,48,105,48,null,"35-DL","35-DL","77-DL",null,null,"FR-JR","Raw Women (20-23)",1,null,"FR-M4","Raw Women (70+)-",1]
{"$rows_left_out":144}
{"sheet":"Weigh-In","index":3,"n_rows":908,"n_cols":64,"rows_kept":908,"cut":false,"hidden":false,"merged":[]}
[null,null,null,null,null,null,null,null,null,null,null,null,null,null,null,null,null,null,null,null,null,null,null,null,null,3]
[{"$f":"Setup!Q3","v":"Grp"},"Name","MemberID","Team","M/F-Div","Bwt - kg","lot#","Birth Year","SQ rack",{"$f":"CONCATENATE(\"SQ-1 (\",T2,\")\")","v":"SQ-1 (Kg)"},"BP rack",{"$f":"CONCATENATE(\"BP-1 (\",T2,\")\")","v":"BP-1 (Kg)"},{"$f":"CONCATENATE(\"DL-1 (\",T2,\")\")","v":"DL-1 (Kg)"},"Events Entered","State","Print Card","Nominated Wt Class",null,null,{"$f":"Setup!G15","v":"Kg"},{"$f":"COUNTA(F:F)+1","v":2},{"$f":"CONCATENATE(\"Setup!I6:I\",COUNTA(Setup!I:I)+3)","v":"Setup!I6:I37"},{"$f":"CONCATENATE(\"Setup!M6:M\",COUNTA(Setup!M:M)+3)","v":"Setup!M6:M5"},{"$f":"CONCATENATE(\"Setup!Q5:Q\",COUNTA(Setup!Q:Q)+4)","v":"Setup!Q5:Q14"},{"$f":"CONCATENATE(\"DATA!$M$2:$M$61\")","v":"DATA!$M$2:$M$61"},5,{"$f":"COUNTA(F:F)+1","v":2},null,null,null,null,null,null,null,null,null,null,null,null,"flight sort data","att sort data",null,null,null,null,null,null,null,null,null,"SQ-1","SQ-2","SQ-3","Best SQ Att","BP rack","BP-1","BP-2","BP-3","Best BP Att","Sub Total","DL-1","DL-2","DL-3","Best DL Att"]
[null,null,null," ","-"]
[null,null,null," ","-"]
[null,null,null," ","-"]
[null,null,null," ","-"]
[null,null,null," ","-"]
[null,null,null," ","-"]
{"$rows_left_out":901}
{"sheet":"最初の入力","index":4,"n_rows":944,"n_cols":13,"rows_kept":944,"cut":false,"hidden":false,"merged":[]}
[]
[]
[]
["GP","性別","カテゴリー",null,"種別",null,"選手名","都道府県","団体名","結合後","LOT","競技種別","生年"]
[null,null,null,{"$f":"B5&\"-\"&C5","v":"-"},null,{"$f":"D5&E5","v":"-"},null,null,null,{"$f":"H5&\" \"&I5","v":" "}]
[null,null,null,"-",null,"-",null,null,null,{"$f":"H6&\" \"&I6","v":" "}]
[null,null,null,"-",null,"-",null,null,null," "]
[null,null,null,"-",null,"-",null,null,null," "]
{"$rows_left_out":937}
{"sheet":"Lifting","index":5,"n_rows":12,"n_cols":83,"rows_kept":12,"cut":false,"hidden":false,"merged":[[4,4,4,5],[5,2,5,3],[5,4,5,5],[0,7,2,7],[9,35,9,37],[9,47,9,49],[2,2,2,3],[0,0,0,5],[1,3,1,4],[2,0,2,1],[1,0,1,2],[3,0,3,1],[4,0,4,1],[5,0,5,1],[3,2,3,3],[3,4,3,5],[4,2,4,3]]}
["大澤　充",null,null,null,null,null,null,null,null,null,null,null,null,null,null,null,null,null,null,null,null,null,null,null,null,null,null,null,null,null,null,null,null,null,null,"F-","WE",null,"Best BP","BP","B"]
[{"$f":"IFERROR(VLOOKUP(INDIRECT(ADDRESS(MATCH(A1,INDIRECT(CONCATENATE(\"B12:B50\")),0)+11,4)),Setup!I1:J199,2,FALSE),\"-\")","v":"-"},null,null,{"$f":"INDIRECT(CONCATENATE(\"F\",MATCH(A1,B:B,0)))","v":{"$error":"#N/A"}},null,{"$f":"CONCATENATE(RIGHT(E11,2),\" Cls\")","v":"kg Cls"},null,null,null,null,null,null,null,null,null,null,null,null,null,null,null,null,null,null,null,null,null,null,null,null,null,null,null,null,null,"FR","WC",null,"Best DL","DL","D"]
["Deadlift 1",null,{"$f":"Lists!B36","v":{"$error":"#N/A"}},null,{"$f":"Setup!G15","v":"Kg"},{"$f":"IF(E3=\"Kg\",C3*2.2046,C3/2.2046)","v":{"$error":"#N/A"}},{"$f":"IF(E3=\"Kg\",\"Lb\",\"Kg\")","v":"Lb"},null,null,null,null,null,null,null,null,null,null,null,null,null,null,null,null,null,null,null,null,null,null,null,null,null,null,null,null,"M-","ME",null,"Best SQ","SQ","S"]
[{"$f":"VLOOKUP(INDIRECT(ADDRESS(MATCH(A1,INDIRECT(CONCATENATE(\"B12:B50\")),0)+11,4)),Setup!I5:J92,2,FALSE)","v":{"$error":"#N/A"}},null,"Event",null,{"$f":"IF(Setup!B9=\"Powerlifting (3 lift meet)\",\"PL Total\",\"\")","v":"PL Total"},null,null,null,null,null,null,null,null,null,null,null,null,null,null,null,null,null,null,null,null,null,null,null,null,null,null,null,null,null,null,"MR","MC",null,"PL Total","PL","P"]
["Open",null,{"$f":"IFERROR(Lists!F51,10000)","v":""},null,{"$f":"IF(OR(E4=\"\",LEFT(A3,1)=\"S\",LEFT(A3,1)=\"B\"),10000,IFERROR(Lists!F53,10000))","v":""},null,null,null,null,null,null,null,null,null,null,null,null,null,null,null,null,null,null,null,null,null,null,null,null,null,null,null,null,null,null,null,null,null,"PP Total","PP"]
[{"$f":"IFERROR(IF(INDIRECT(ADDRESS(MATCH(A1,INDIRECT(CONCATENATE(\"B12:B40\")),0)+11,9))=\"\",\"O\",VLOOKUP(INDIRECT(ADDRESS(MATCH(A1,INDIRECT(CONCATENATE(\"B12:B40\")),0)+11,45)),DATA!E35:F53,2)),\"\")","v":""},null,{"$f":"IFERROR(IF(A6=\"O\",10000,Lists!E51),10000)","v":""},null,{"$f":"IF(OR(E4=\"\",LEFT(A3,1)=\"S\",LEFT(A3,1)=\"B\"),10000,IFERROR(IF(A6=\"O\",10000,Lists!E53),10000))","v":""},null,null,null,null,null,null,null,null,null,null,null,null,null,null,null,null,null,null,null,null,null,null,null,null,null,null,null,null,null,null,null,null,null,"DQ","DQ"]
[null,"Current Status","Good","NoLift","Next","Auto",1,null,null,null,null,null,null,null,null,null,null,null,null,null,null,null,null,null,null,null,null,null,null,null,null,null,null,null,null,null,null,null,"Drug Test","DT",null,null,null,"2019-07-22",null,null,null,null,null,null,null,null,null,null,null,null,null,null,null,null,null,null,null,null,null,null,"div","cls"]
[null,null,{"$f":"CONCATENATE(\"Setup!Q5:Q\",COUNTA(Setup!Q:Q)+4)","v":"Setup!Q5:Q14"},null,null,"Min Increment",{"$f":"IF(Setup!G15=\"Kg\",0.5,1)","v":0.5},"01:00:00"]
{"$rows_left_out":5}
{"sheet":"QuickPrint","index":6,"n_rows":0,"n_cols":0,"rows_kept":0,"cut":false,"hidden":false,"merged":[]}

{"sheet":"集計用","index":7,"n_rows":0,"n_cols":0,"rows_kept":0,"cut":false,"hidden":false,"merged":[]}

{"sheet":"集計１","index":8,"n_rows":0,"n_cols":0,"rows_kept":0,"cut":false,"hidden":false,"merged":[]}

{"sheet":"表彰状","index":9,"n_rows":22,"n_cols":14,"rows_kept":22,"cut":false,"hidden":false,"merged":[[16,5,17,5],[18,1,19,2],[18,5,19,6],[20,5,20,6],[21,1,21,5]]}
[1]
[]
[]
[]
[]
[]
[]
[null,null,null,null,null,null,null,null,null,null,null,null,"start行番号",3]
{"$rows_left_out":15}
{"sheet":"団体用","index":10,"n_rows":1025,"n_cols":16,"rows_kept":1025,"cut":false,"hidden":false,"merged":[]}
["性別","階級","年代","選手名","都道府県","団体名","順位","IPFポイント","点数","合計点"]
[null,null,null,null,null,null,null,null,{"$f":"VLOOKUP(G2,$O$3:$P$32,2,1)","v":{"$error":"#N/A"}},null,null,{"$f":"COUNTIF($E$2:$E$1025,E2)","v":0},{"$f":"COUNTIF($F$2:$F$1025,F2)","v":0},null,"順位","点数"]
[null,null,null,null,null,null,null,null,{"$error":"#N/A"},null,null,0,0,null,1,12]
[null,null,null,null,null,null,null,null,{"$error":"#N/A"},null,null,0,0,null,2,9]
[null,null,null,null,null,null,null,null,{"$error":"#N/A"},null,null,0,0,null,3,8]
[null,null,null,null,null,null,null,null,{"$error":"#N/A"},null,null,0,0,null,4,7]
[null,null,null,null,null,null,null,null,{"$error":"#N/A"},null,null,0,0,null,5,6]
[null,null,null,null,null,null,null,null,{"$error":"#N/A"},null,null,0,0,null,6,5]
{"$rows_left_out":1018}
{"sheet":"Awards","index":11,"n_rows":15,"n_cols":22,"rows_kept":15,"cut":false,"hidden":false,"merged":[[1,0,1,4]]}
[null,null,null,null,null,null,null,null,null,null,null,"FillRows",{"$f":"COUNTA(P:P)+1","v":15}]
["Raw Men 3-Lift 74-kg cls",null,null,null,null,null,null,null,null,{"$f":"OFFSET($V$1,MATCH(A2,$U:$U,0)-1,0)","v":{"$error":"#N/A"}},null,{"$f":"CONCATENATE(\"U3:U\",M1)","v":"U3:U15"},null,null,null,"Div","Cls","Event"]
["PLACE","NAME",{"$f":"Lifting!E3","v":"Kg"},"IPF Pts.","Team",null,null,null,"row",null,null,"PL","3-Lift",null,null,"F-M1-U",63,"PL",{"$f":"IF($P3=\"Wilks\",$P3,VLOOKUP($P3,Setup!$I:$J,2,FALSE))","v":"Raw Women (40-49)"},{"$f":"VLOOKUP(R3,$L$3:$M$7,2,FALSE)","v":"3-Lift"},{"$f":"CONCATENATE($S3,\" \",$T3,\" \",IF($Q3=\"\",\"\",CONCATENATE($Q3,\"-\",$M$10)))","v":"Raw Women (40-49) 3-Lift 63-kg cls"},{"$f":"CONCATENATE(P3,\"/\",Q3,\"/\",R3)","v":"F-M1-U/63/PL"}]
[1,{"$f":"IFERROR(INDIRECT(CONCATENATE(\"QuickPrint!B\",I4)),\"\")","v":""},{"$f":"IFERROR(INDIRECT(CONCATENATE(\"QuickPrint!Y\",I4)),\"\")","v":""},{"$f":"IFERROR(INDIRECT(CONCATENATE(\"QuickPrint!\",IF($J$10=3,\"AD\",\"AC\"),I4)),\"\")","v":""},{"$f":"IFERROR(VLOOKUP(INDIRECT(CONCATENATE(\"QuickPrint!c\",I4)),Setup!$M$6:$N$93,2,FALSE),\"\")","v":""},null,null,null,{"$f":"MATCH(J4,INDIRECT(CONCATENATE(\"QuickPrint!$Z:$Z\")),0)","v":{"$error":"#N/A"}},{"$f":"CONCATENATE(\"1/\",$J$2)","v":{"$error":"#N/A"}},null,"BP","Bench Press",null,null,"F-M1-U",72,"PL",{"$f":"IF($P4=\"Wilks\",$P4,VLOOKUP($P4,Setup!$I:$J,2,FALSE))","v":"Raw Women (40-49)"},{"$f":"VLOOKUP(R4,$L$3:$M$7,2,FALSE)","v":"3-Lift"},{"$f":"CONCATENATE($S4,\" \",$T4,\" \",IF($Q4=\"\",\"\",CONCATENATE($Q4,\"-\",$M$10)))","v":"Raw Women (40-49) 3-Lift 72-kg cls"},{"$f":"CONCATENATE(P4,\"/\",Q4,\"/\",R4)","v":"F-M1-U/72/PL"}]
[2,{"$f":"IFERROR(INDIRECT(CONCATENATE(\"QuickPrint!B\",I5)),\"\")","v":""},{"$f":"IFERROR(INDIRECT(CONCATENATE(\"QuickPrint!Y\",I5)),\"\")","v":""},{"$f":"IFERROR(INDIRECT(CONCATENATE(\"QuickPrint!\",IF($J$10=3,\"AD\",\"AC\"),I5)),\"\")","v":""},{"$f":"IFERROR(VLOOKUP(INDIRECT(CONCATENATE(\"QuickPrint!c\",I5)),Setup!$M$6:$N$93,2,FALSE),\"\")","v":""},null,null,null,{"$f":"MATCH(J5,INDIRECT(CONCATENATE(\"QuickPrint!$Z:$Z\")),0)","v":{"$error":"#N/A"}},{"$f":"CONCATENATE(\"2/\",$J$2)","v":{"$error":"#N/A"}},null,"SQ","Squat",null,null,"F-M2-U",63,"PL",{"$f":"IF($P5=\"Wilks\",$P5,VLOOKUP($P5,Setup!$I:$J,2,FALSE))","v":"Raw Women (50-59)"},"3-Lift","Raw Women (50-59) 3-Lift 63-kg cls","F-M2-U/63/PL"]
[3,{"$f":"IFERROR(INDIRECT(CONCATENATE(\"QuickPrint!B\",I6)),\"\")","v":""},{"$f":"IFERROR(INDIRECT(CONCATENATE(\"QuickPrint!Y\",I6)),\"\")","v":""},{"$f":"IFERROR(INDIRECT(CONCATENATE(\"QuickPrint!\",IF($J$10=3,\"AD\",\"AC\"),I6)),\"\")","v":""},{"$f":"IFERROR(VLOOKUP(INDIRECT(CONCATENATE(\"QuickPrint!c\",I6)),Setup!$M$6:$N$93,2,FALSE),\"\")","v":""},null,null,null,{"$f":"MATCH(J6,INDIRECT(CONCATENATE(\"QuickPrint!$Z:$Z\")),0)","v":{"$error":"#N/A"}},{"$f":"CONCATENATE(\"3/\",$J$2)","v":{"$error":"#N/A"}},null,"DL","Deadlift",null,null,"F-M2-U",72,"PL",{"$f":"IF($P6=\"Wilks\",$P6,VLOOKUP($P6,Setup!$I:$J,2,FALSE))","v":"Raw Women (50-59)"},"3-Lift","Raw Women (50-59) 3-Lift 72-kg cls","F-M2-U/72/PL"]
[4,{"$f":"IFERROR(INDIRECT(CONCATENATE(\"QuickPrint!B\",I7)),\"\")","v":""},{"$f":"IFERROR(INDIRECT(CONCATENATE(\"QuickPrint!Y\",I7)),\"\")","v":""},{"$f":"IFERROR(INDIRECT(CONCATENATE(\"QuickPrint!\",IF($J$10=3,\"AD\",\"AC\"),I7)),\"\")","v":""},{"$f":"IFERROR(VLOOKUP(INDIRECT(CONCATENATE(\"QuickPrint!c\",I7)),Setup!$M$6:$N$93,2,FALSE),\"\")","v":""},null,null,null,{"$f":"MATCH(J7,INDIRECT(CONCATENATE(\"QuickPrint!$Z:$Z\")),0)","v":{"$error":"#N/A"}},{"$f":"CONCATENATE(\"4/\",$J$2)","v":{"$error":"#N/A"}},null,"PP","Push Pull",null,null,"F-M3-U",63,"PL",{"$f":"IF($P7=\"Wilks\",$P7,VLOOKUP($P7,Setup!$I:$J,2,FALSE))","v":"Raw Women (60-69)"},"3-Lift","Raw Women (60-69) 3-Lift 63-kg cls","F-M3-U/63/PL"]
[5,{"$f":"IFERROR(INDIRECT(CONCATENATE(\"QuickPrint!B\",I8)),\"\")","v":""},{"$f":"IFERROR(INDIRECT(CONCATENATE(\"QuickPrint!Y\",I8)),\"\")","v":""},{"$f":"IFERROR(INDIRECT(CONCATENATE(\"QuickPrint!\",IF($J$10=3,\"AD\",\"AC\"),I8)),\"\")","v":""},{"$f":"IFERROR(VLOOKUP(INDIRECT(CONCATENATE(\"QuickPrint!c\",I8)),Setup!$M$6:$N$93,2,FALSE),\"\")","v":""},null,null,null,{"$f":"MATCH(J8,INDIRECT(CONCATENATE(\"QuickPrint!$Z:$Z\")),0)","v":{"$error":"#N/A"}},{"$f":"CONCATENATE(\"5/\",$J$2)","v":{"$error":"#N/A"}},null,null,null,null,null,"M-M1-U",74,"PL",{"$f":"IF($P8=\"Wilks\",$P8,VLOOKUP($P8,Setup!$I:$J,2,FALSE))","v":"Raw Men (40-49)"},"3-Lift","Raw Men (40-49) 3-Lift 74-kg cls","M-M1-U/74/PL"]
{"$rows_left_out":8}
{"sheet":"SpeakersCard","index":12,"n_rows":25,"n_cols":15,"rows_kept":25,"cut":false,"hidden":false,"merged":[[4,13,4,14],[5,8,5,9],[5,13,5,14],[16,3,16,4],[17,5,17,6],[16,11,16,12],[17,13,17,14],[11,2,11,3],[11,10,11,11],[4,11,4,12],[5,11,5,12],[15,1,15,3],[15,9,15,11],[10,0,10,1],[10,8,10,9],[11,0,11,1],[23,0,23,1],[23,8,23,9],[24,0,24,1],[24,8,24,9],[25,0,25,6],[25,8,25,14],[24,2,24,3],[24,10,24,11],[22,0,22,1],[17,3,17,4],[17,11,17,12],[12,0,12,6],[12,8,12,14],[14,0,14,4],[14,8,14,12],[18,13,18,14],[18,3,18,4],[18,11,18,12],[18,0,18,1],[18,5,18,6],[18,8,18,9],[22,8,22,9],[11,8,11,9],[3,3,3,4],[5,0,5,1],[9,0,9,1],[4,3,4,4],[9,8,9,9],[5,3,5,4],[4,5,4,6],[5,5,5,6],[1,0,1,4],[1,8,1,12],[3,11,3,12],[2,1,2,3],[2,9,2,11]]}
[]
[{"$f":"Setup!$B$6","v":"〇〇パワーリフティング選手権"},null,null,null,null,"Group:","A",null,{"$f":"Setup!$B$6","v":"〇〇パワーリフティング選手権"},null,null,null,null,"Group:","A"]
["Name &\nMbr #:","lifter5-5",null,null,null,"Lot number:",5,null,"Name &\nMbr #:","lifter2-2",null,null,null,"Lot number:",2]
["Birth Year:","1990-01-05","Team:","Abrev",null,"Weight\nClass:",72,null,"Birth Year:","1990-01-02","Team:","Abrev",null,"Weight\nClass:",72]
["Body Weight:",80,null,"Events Entered:",null,"Division(s)",null,null,"Body Weight:",65,null,"Events Entered:",null,"Division(s)"]
["Lifter/Coach\nInitials:",null,null,"pl",null,"FR-O",null,null,"Lifter/Coach\nInitials:",null,null,"pl",null,"FR-O"]
["Event","Rack Hts","1st\nAttempt","2nd Attempt","3rd\nAttempt","Best Attempt","Place",null,"Event","Rack Hts","1st\nAttempt","2nd Attempt","3rd\nAttempt","Best Attempt","Place"]
["Squat","14",null,null,null,null,null,null,"Squat","11"]
{"$rows_left_out":18}
{"sheet":"ContestResults","index":13,"n_rows":1,"n_cols":33,"rows_kept":1,"cut":false,"hidden":true,"merged":[]}
[null,null,null,null,null,null,null,null,null,null,null,null,null,null,null,null,null,null,null,null,null,null,null,null,null,null,null,null,null,null,null,null,{"$f":"3*COUNTA(C:C)","v":0}]

{"sheet":"ContestLog","index":14,"n_rows":256,"n_cols":10,"rows_kept":256,"cut":false,"hidden":false,"merged":[]}
["Time","Name",{"$f":"\"Weight Cls \"&IF(Setup!B39=\"Kilograms\",\"(Kg)\",\"(Lb)\")","v":"Weight Cls (Lb)"},"Lift",{"$f":"\"Weight (\"&Setup!G15&\")\"","v":"Weight (Kg)"},{"$f":"\"Total (\"&Setup!G15&\")\"","v":"Total (Kg)"},"Record?",null,null,{"$f":"COUNTA(B:B)+1","v":257}]
["15:49:23",1,53,"Squat 1",100]
["15:49:26",1,53,"Squat 1",100]
["15:49:32",1,53,"Squat 1",100]
["15:49:33",2,53,"Squat 1",100]
["15:49:38",2,53,"Bench Press 1",100]
["15:49:39",1,53,"Bench Press 1",100]
["15:49:46",2,53,"Deadlift 1",100,300]
{"$rows_left_out":249}
{"sheet":"KG Records","index":15,"n_rows":151,"n_cols":38,"rows_kept":151,"cut":false,"hidden":true,"merged":[]}
[null,"Y1","Y2","Y3","T1","T2","T3","JR","O","M1a","M1b","M2a","M2b","M3a","M3b","M4a","M4b","M5a","M5b","M6","R-T1","R-T2","R-T3","R-Y1","R-Y2","R-Y3","R-JR","R-O","R-M1A","R-M1B","R-M2A","R-M2B","R-M3A","R-M3B","R-M4A","R-M4B","R-M5A","R-M5B"]
["30-SQ",0,0,0,0,0,0,0,0,0,0,0,0,0,0,0,0,0,0,0,0,0,0,45,45,45,0,0,0,0,0,0,0,0,0,0,0,0]
["30-BP",0,0,0,0,0,0,0,0,0,0,0,0,0,0,0,0,0,0,0,0,0,0,26,26,26,0,0,0,0,0,0,0,0,0,0,0,0]
["30-DL",0,0,0,0,0,0,0,0,0,0,0,0,0,0,0,0,0,0,0,0,0,0,70,70,70,0,0,0,0,0,0,0,0,0,0,0,0]
["30-TL",0,0,0,0,0,0,0,0,0,0,0,0,0,0,0,0,0,0,0,0,0,0,141,141,141,0,0,0,0,0,0,0,0,0,0,0,0]
["35-SQ",0,0,0,0,0,0,0,0,0,0,0,0,0,0,0,0,0,0,0,0,0,0,55,55,55,0,0,0,0,0,0,0,0,0,0,0,0]
["35-BP",0,0,0,0,0,0,0,0,0,0,0,0,0,0,0,0,0,0,0,0,0,0,30,30,30,0,0,0,0,0,0,0,0,0,0,0,0]
["35-DL",0,0,0,0,0,0,0,0,0,0,0,0,0,0,0,0,0,0,0,0,0,0,75,75,75,0,0,0,0,0,0,0,0,0,0,0,0]
{"$rows_left_out":144}
{"sheet":"LB Records","index":16,"n_rows":151,"n_cols":38,"rows_kept":151,"cut":false,"hidden":true,"merged":[]}
[null,"Y1","Y2","Y3","T1","T2","T3","JR","O","M1a","M1b","M2a","M2b","M3a","M3b","M4a","M4b","M5a","M5b","M6","R-T1","R-T2","R-T3","R-Y1","R-Y2","R-Y3","R-JR","R-O","R-M1A","R-M1B","R-M2A","R-M2B","R-M3A","R-M3B","R-M4A","R-M4B","R-M5A","R-M5B"]
["66-SQ",0,0,0,0,0,0,0,0,0,0,0,0,0,0,0,0,0,0,0,0,0,0,99.2,99.2,99.2,0,0,0,0,0,0,0,0,0,0,0,0]
["66-BP",0,0,0,0,0,0,0,0,0,0,0,0,0,0,0,0,0,0,0,0,0,0,57.3,57.3,57.3,0,0,0,0,0,0,0,0,0,0,0,0]
["66-DL",0,0,0,0,0,0,0,0,0,0,0,0,0,0,0,0,0,0,0,0,0,0,154.30000000000001,154.30000000000001,154.30000000000001,0,0,0,0,0,0,0,0,0,0,0,0]
["66-TL",0,0,0,0,0,0,0,0,0,0,0,0,0,0,0,0,0,0,0,0,0,0,310.89999999999998,310.89999999999998,310.89999999999998,0,0,0,0,0,0,0,0,0,0,0,0]
["77-SQ",0,0,0,0,0,0,0,0,0,0,0,0,0,0,0,0,0,0,0,0,0,0,121.3,121.3,121.3,0,0,0,0,0,0,0,0,0,0,0,0]
["77-BP",0,0,0,0,0,0,0,0,0,0,0,0,0,0,0,0,0,0,0,0,0,0,66.099999999999994,66.099999999999994,66.099999999999994,0,0,0,0,0,0,0,0,0,0,0,0]
["77-DL",0,0,0,0,0,0,0,0,0,0,0,0,0,0,0,0,0,0,0,0,0,0,165.3,165.3,165.3,0,0,0,0,0,0,0,0,0,0,0,0]
{"$rows_left_out":144}
{"sheet":"Quick-Reference","index":17,"n_rows":35,"n_cols":7,"rows_kept":35,"cut":false,"hidden":false,"merged":[]}
[null,null,null,null,null,null,"Quick Reference Sheet"]
[null,null,null,null,null,null,"video tutorial:  https://www.youtube.com/watch?v=o-PyI1n_EMI"]
[]
[null,"1.      Setup sheet"]
[null,"a.      Reset for New Contest"]
[null,"b.      Contest Name"]
[null,"c.       Select type of meet from the drop down menu."]
[null,"d.      Use drop downs to enter the actual weights on the platform"]
{"$rows_left_out":28}
{"sheet":"IPF Formula","index":18,"n_rows":18,"n_cols":5,"rows_kept":18,"cut":false,"hidden":false,"merged":[[0,0,1,0],[0,1,0,2],[0,3,0,4]]}
[null,"Mean",null,"Standard Deviation"]
[null,"Parameter 1","Parameter 2","Parameter 1","Parameter 2"]
["Men CL 3-Lift",310.67,857.78499999999997,53.216000000000001,147.08349999999999]
["Men CL Squat",123.1,363.08499999999998,25.166699999999999,75.431100000000001]
["Men CL Bench",86.474500000000006,259.15499999999997,17.578499999999998,53.122]
["Men CL Deadlift",103.5355,244.76499999999999,15.37134,31.502199999999998]
["Men EQ 3-Lift",387.26499999999999,1121.28,80.632400000000004,222.4896]
["Men EQ Squat",150.48500000000001,446.44499999999999,36.515500000000003,103.70610000000001]
{"$rows_left_out":10}