{"text_format":"1","workbook":"xlsx","n_sheets":18,"sheets":["Setup","Lists","DATA","Weigh-In","Lifting","QuickPrint","表彰状","Awards","SpeakersCard","ContestResults","ContestLog","KG Records","LB Records","Quick-Reference","IPF Formula","Sheet1","Weigh-In (2)","エントリー表"],"not_rendered":{"charts":1,"images":32,"macros":1,"external_links":4,"defined_names":10,"comments":1,"pivot_tables":0},"unopened":[],"bounds":{"document_bytes":16777216,"sheet_cells":100000,"rows_first":2000,"rows_last":500,"rows_between":2000,"halvings":0,"cell_chars":16384,"cell_head_chars":4096},"cells_cut":0,"cells_raw":0,"read":"whole","date_system":"1900"}

{"sheet":"Setup","index":0,"n_rows":101,"n_cols":26,"rows_kept":101,"cut":false,"hidden":false,"merged":[[39,16,39,21],[37,21,37,26],[5,1,6,6],[8,1,9,6],[11,1,12,6],[14,1,15,3],[14,4,15,5],[14,6,15,6],[32,1,33,1],[32,2,33,3],[32,4,33,4],[32,5,33,6],[0,1,0,6],[2,16,3,16],[2,12,3,13],[2,1,3,6],[2,8,3,10],[0,8,0,9]]}
[null,"video tutorial:  https://www.youtube.com/watch?v=o-PyI1n_EMI",null,null,null,null,null,null,null,null,"2019-02-27",null,null,null,null,null,null,null,null,{"$f":"MATCH(B9,T2:T6,0)","v":2},null,null,null,null,null,{"$f":"MAX(K:K)","v":43523}]
[null,null,null,null,null,null,null,null,null,null,null,null,null,null,null,null,null,null,null,"Powerlifting (3 lift meet)"]
[null,"Reset for New Contest",null,null,null,null,null,null,"IPF Divisions",null,null,null,"Teams",null,null,null,"Grp",null,null,"Bench Press Only"]
[null,null,null,null,null,null,null,null,null,null,null,null,null,null,null,null,null,null,null,"Squat Only"]
[null,null,null,null,null,null,null,null,"Abbrev","Description","Pl Code",null,"Abrev","Team Name",null,{"$f":"CONCATENATE($Q$3,\" \",Q5)","v":"Grp A"},"A",{"$f":"IF(ROW(P5)<$S$5,ROW(P5)+$S$5+1,ROW(P5)-$S$5)","v":12},{"$f":"IFERROR(MATCH(Lifting!A11,Setup!P5:P20,0)+4,0)","v":6},"Deadlift Only"]
[null,"全日本ベンチプレス選手権",null,null,null,null,null,null,"F-SJR-U","Raw Women (14-18)",1,null,null,null,null,"Grp B","B",{"$f":"IF(ROW(P6)<$S$5,ROW(P6)+$S$5+1,ROW(P6)-$S$5)","v":0},null,"Push Pull (Bench & Deadlift)"]
{"$rows_left_out":96}
{"sheet":"Lists","index":1,"n_rows":67,"n_cols":23,"rows_kept":67,"cut":false,"hidden":true,"merged":[]}
["Attempts",null,"col",null,{"$f":"MATCH(Setup!B9,Lists!F1:J1,0)","v":3},"Powerlifting (3 lift meet)","Squat Only","Bench Press Only","Deadlift Only","Push Pull (Bench & Deadlift)",null,"column #","column Ltr",null,"Barload for Next Lifter"]
["Squat 1","SQ-1",11,null,{"$f":"OFFSET(E2,0,$E$1)","v":"Bench Press 1"},"Squat 1","Squat 1","Bench Press 1","Deadlift 1","Bench Press 1",null,1,"A",null,null,{"$f":"Setup!G15","v":"Kg"},null,null,null,null,null,null,"Y1"]
["Squat 2","SQ-2",12,null,"Bench Press 2","Squat 2","Squat 2","Bench Press 2","Deadlift 2","Bench Press 2",null,2,"B",null,null,{"$f":"ABS(Lists!B41)","v":260},{"$f":"2*(Q6*P6+Q7*P7+Q8*P8+Q9*P9+Q10*P10+Q11*P11+Q12*P12+Q13*P13+Q14*P14+Q15*P15+Q16*P16)+Q35","v":55},null,null,null,null,null,"Y2"]
["Squat 3","SQ-3",13,null,"Bench Press 3","Squat 3","Squat 3","Bench Press 3","Deadlift 3","Bench Press 3",null,3,"C",null,"How","Pound","LOAD",null,null,null,null,null,"Y3"]
["Bench Press 1","BP-1",16,null,"------------","Bench Press 1","------------","------------","------------","Deadlift 1",null,4,"D",null,"Many?","Plates","on Bar",null,null,null,null,null,"T1"]
["Bench Press 2","BP-2",17,null,"New Lifter","Bench Press 2","New Lifter","New Lifter","New Lifter","Deadlift 2",null,5,"E",null,{"$f":"Setup!B21","v":0},110,{"$f":"IF(OR(P3<Q35,P2=\"Kg\"),0,MIN(INT((P3-Q35)/(2*P6)),O6/2))","v":0},{"$f":"IF(Q6=0,\"\",IF(Q6>1,CONCATENATE(Q6,\"/\",P6,\" \"),CONCATENATE(P6,\" \")))","v":""},null,null,null,null,"T2"]
{"$rows_left_out":62}
{"sheet":"DATA","index":2,"n_rows":151,"n_cols":43,"rows_kept":151,"cut":false,"hidden":true,"merged":[[0,36,0,38],[0,40,0,42]]}
["Age","Coeff",null,null,"wt","IPF Men-kg","IPF women-kg",null,"wt class list","rank",null,"US State:","USAPL",null,"WT","HS Men-lb","HS Women-lb","WT","IPF Men-lb","IPF women-lb","wt","HS Men-kg","HS women-kg","wt","IPF Men-kg","IPF women-kg",null,"wt class rank kg","wt class rank lb","wt class rank kg",null,null,null,null,null,null,"USAPL Dvisions",null,null,null,"IPF Divisions"]
[14,1.23,"Foster",null,10,53,43,null,43,1,null,"Alabama","AL",null,88.186204599999996,114,97,22.045999999999999,66,66,10,52,44,10,30,30,null,30,66,30,null,"30-SQ","30-SQ","66-SQ",null,null,"FR-Y1","Raw Women (8-9)",1,null,"FR-SJr","Raw Women (14-18)",1]
[15,1.18,null,null,30.001000000000001,53,43,null,44,2,null,"Alaska","AK",null,97.004604599999993,114,105,66.140204600000004,77,77,44.000999999999998,52,48,30.001000000000001,35,35,null,35,77,35,null,"30-BP","30-BP","66-BP",null,null,"FR-Y2","Raw Women (10-11)",1,null,"FR-Jr","Raw Women (19-23)",1]
[16,1.1299999999999999,null,null,35.000999999999998,53,43,null,47,3,null,"Arizona","AZ",null,105.8230046,114,114,77.1632046,88,88,48.000999999999998,52,52,35.000999999999998,40,40,null,40,88,40,null,"30-DL","30-DL","66-DL",null,null,"FR-Y3","Raw Women (12-13)",1,null,"FR-O","Raw Women",1]
[17,1.08,null,null,40.000999999999998,53,43,null,48,4,null,"Arkansas","AR",null,114.6414046,123,123,88.186204599999996,97,94,52.000999999999998,56,56,40.000999999999998,44,43,null,43,94,43,null,"30-TL","30-TL","66-TL",null,null,"FR-T1","Raw Women (14-15)",1,null,"FR-M1","Raw Women (40-49)",1]
[18,1.06,null,null,43.000999999999998,53,47,null,52,5,null,"California","CA",null,123.4598046,132,132,94.800004599999994,97,103,56.000999999999998,60,60,43.000999999999998,44,47,null,44,97,44,null,"35-SQ","35-SQ","77-SQ",null,null,"FR-T2","Raw Women (16-17)",1,null,"FR-M2","Raw Women (50-59)",1]
{"$rows_left_out":146}
{"sheet":"Weigh-In","index":3,"n_rows":433,"n_cols":64,"rows_kept":433,"cut":false,"hidden":false,"merged":[]}
[null,null,null,"都道府県と団体名の間に、半角スペース","Fが女子　　　Ｍが男子　　　　-Uがクラシック","Oが一般　　Ｐがオープン",null,null,null,null,null,null,null,"PLを必ず入れる",null,null,null,null,null,null,null,null,null,null,null,10]
["グループ","選手名",null,"都道府県 団体名","M/F-Div","検量体重","lot#","生年","SQ　　ラック",{"$f":"CONCATENATE(\"SQ-1 (\",T2,\")\")","v":"SQ-1 (Kg)"},"BP 　ラック",{"$f":"CONCATENATE(\"BP-1 (\",T2,\")\")","v":"BP-1 (Kg)"},{"$f":"CONCATENATE(\"DL-1 (\",T2,\")\")","v":"DL-1 (Kg)"},"選択して　　ＰＬ","State","Print Card","Nominated Wt Class",null,null,{"$f":"Setup!G15","v":"Kg"},{"$f":"COUNTA(F:F)+1","v":3},{"$f":"CONCATENATE(\"Setup!I6:I\",COUNTA(Setup!I:I)+3)","v":"Setup!I6:I37"},{"$f":"CONCATENATE(\"Setup!M6:M\",COUNTA(Setup!M:M)+3)","v":"Setup!M6:M5"},{"$f":"CONCATENATE(\"Setup!Q5:Q\",COUNTA(Setup!Q:Q)+4)","v":"Setup!Q5:Q14"},{"$f":"CONCATENATE(\"DATA!$M$2:$M$61\")","v":"DATA!$M$2:$M$61"},5,{"$f":"COUNTA(F:F)+1","v":3},null,null,null,null,null,null,null,null,null,null,null,null,"flight sort data","att sort data",null,null,null,null,null,null,null,null,null,"SQ-1","SQ-2","SQ-3","Best SQ Att","BP rack","BP-1","BP-2","BP-3","Best BP Att","Sub Total","DL-1","DL-2","DL-3","Best DL Att"]
[null,null,null," ","-"]
[null,null,null," ","-"]
[null,null,null," ","-"]
[null,null,null," ","-"]
{"$rows_left_out":428}
{"sheet":"Lifting","index":4,"n_rows":31,"n_cols":83,"rows_kept":31,"cut":false,"hidden":false,"merged":[[4,4,4,5],[5,2,5,3],[5,4,5,5],[0,7,2,7],[9,35,9,37],[9,47,9,49],[2,2,2,3],[0,0,0,5],[1,3,1,4],[2,0,2,1],[1,0,1,2],[3,0,3,1],[4,0,4,1],[5,0,5,1],[3,2,3,3],[3,4,3,5],[4,2,4,3]]}
["堀 滋",null,null,null,null,null,null,null,null,null,null,null,null,null,null,null,null,null,null,null,null,null,null,null,null,null,null,"次の選手",null,null,null,null,null,null,null,"F-","WE",null,"Best BP","BP","B"]
[{"$f":"IFERROR(VLOOKUP(INDIRECT(ADDRESS(MATCH(A1,INDIRECT(CONCATENATE(\"B12:B50\")),0)+11,4)),Setup!I1:J199,2,FALSE),\"-\")","v":"Women"},null,null,{"$f":"INDIRECT(CONCATENATE(\"F\",MATCH(A1,B:B,0)))","v":"84+"},null,{"$f":"CONCATENATE(RIGHT(E11,2),\" Cls\")","v":"体重 Cls"},null,null,null,null,null,null,null,null,null,null,null,null,null,null,null,null,null,null,null,null,null,"氏名","芳村 晃",null,"Rack",null,null,null,null,"FR","WC",null,"Best DL","DL","D"]
["Deadlift 1",null,{"$f":"Lists!B36","v":270},null,{"$f":"Setup!G15","v":"Kg"},{"$f":"IF(E3=\"Kg\",C3*2.2046,C3/2.2046)","v":595.24200000000008},{"$f":"IF(E3=\"Kg\",\"Lb\",\"Kg\")","v":"Lb"},null,null,null,null,null,null,null,null,null,null,null,null,null,null,null,null,null,null,null,null,"重量",null,null,null,null,null,null,null,"M-","ME",null,"Best SQ","SQ","S"]
[{"$f":"VLOOKUP(INDIRECT(ADDRESS(MATCH(A1,INDIRECT(CONCATENATE(\"B12:B50\")),0)+11,4)),Setup!I5:J92,2,FALSE)","v":"Women"},null,"Event",null,{"$f":"IF(Setup!B9=\"Powerlifting (3 lift meet)\",\"PL Total\",\"\")","v":""},null,null,null,null,null,null,null,null,null,null,null,null,null,null,null,null,null,null,null,null,null,null,null,null,null,null,null,null,null,null,"MR","MC",null,"PL Total","PL","P"]
["Open",null,{"$f":"IFERROR(Lists!F51,10000)","v":260.5},null,{"$f":"IF(OR(E4=\"\",LEFT(A3,1)=\"S\",LEFT(A3,1)=\"B\"),10000,IFERROR(Lists!F53,10000))","v":10000},null,null,null,null,null,null,null,null,null,null,null,null,null,null,null,null,null,null,null,null,null,null,null,null,null,null,null,null,null,null,null,null,null,"PP Total","PP"]
[{"$f":"IFERROR(IF(INDIRECT(ADDRESS(MATCH(A1,INDIRECT(CONCATENATE(\"B12:B40\")),0)+11,9))=\"\",\"O\",VLOOKUP(INDIRECT(ADDRESS(MATCH(A1,INDIRECT(CONCATENATE(\"B12:B40\")),0)+11,45)),DATA!E35:F53,2)),\"\")","v":"M1b"},null,{"$f":"IFERROR(IF(A6=\"O\",10000,Lists!E51),10000)","v":227.5},null,{"$f":"IF(OR(E4=\"\",LEFT(A3,1)=\"S\",LEFT(A3,1)=\"B\"),10000,IFERROR(IF(A6=\"O\",10000,Lists!E53),10000))","v":10000},null,null,null,null,null,null,null,null,null,null,null,null,null,null,null,null,null,null,null,null,null,null,null,null,null,null,null,null,null,null,null,null,null,"DQ","DQ"]
{"$rows_left_out":26}
{"sheet":"QuickPrint","index":5,"n_rows":20,"n_cols":35,"rows_kept":20,"cut":false,"hidden":false,"merged":[]}
[null,"2020-06-01","全日本パワーリフティング選手権",null,null,null,null,null,null,null,null,null,null,null,null,null,null,"３行目からB-AEまでコピーして、グッドリフト集計用、B3に値のみ貼り付け（オレンジ）の行の部分"]
["Grp B","Name","Team","Div","検量体重","IPF Wt Cls","lot#","Birth Year","IPF Pts Code","SQ rack","SQ-1","SQ-2","SQ-3","Best SQ","BP rack","BP-1","BP-2","BP-3","Best BP","Sub Total","DL-1","DL-2","DL-3","Best DL","PL Total","Pl/Div/Cls/Event","Forecast\nScore","F'cast Place","IPF Points","Age & Points","Events Entered","MemberID","State","団体A","団体B"]
["B","堀 滋","8suki gym","F-O",150,"84+",18,1975,"FEP",270,270,null,null,270,270,270,null,null,270,540,270,null,null,270,810,"1/F-O/84+/PL",810,1,724.84935335398893,764.7160677884583,"PL"]
["B","石田 浩士","8suki gym","F-O",140,"84+",17,1970,"FEP",260,260,null,null,260,260,260,null,null,260,520,260,null,null,260,780,"2/F-O/84+/PL",780,2,716.89081588918998,810.08662195478462,"PL"]
["B","光安 隆史","8suki gym","F-O",85,"84+",16,1976,"FEP",250,250,null,null,250,250,250,null,null,250,500,250,null,null,250,750,"3/F-O/84+/PL",750,3,821.92645133939754,857.26928874699161,"PL"]
["B","田口 航大","8sukigym","F-O",120,"84+",15,2002,"FEP",240,240,null,null,240,240,240,null,null,240,480,240,null,null,240,720,"4/F-O/84+/PL",720,4,703.29600263093812,745.49376278879447,"PL"]
{"$rows_left_out":15}
{"sheet":"表彰状","index":6,"n_rows":22,"n_cols":14,"rows_kept":22,"cut":false,"hidden":false,"merged":[[16,1,17,2],[16,5,17,6],[18,5,18,6],[21,1,21,5]]}
[]
[]
[]
[]
[]
[]
{"$rows_left_out":17}
{"sheet":"Awards","index":7,"n_rows":10,"n_cols":22,"rows_kept":10,"cut":false,"hidden":false,"merged":[[1,0,1,4]]}
[null,null,null,null,null,null,null,null,null,null,null,"FillRows",{"$f":"COUNTA(P:P)+1","v":9}]
["Men (40 -49) 3-Lift 59-kg cls",null,null,null,null,null,null,null,null,{"$f":"OFFSET($V$1,MATCH(A2,$U:$U,0)-1,0)","v":{"$error":"#N/A"}},null,{"$f":"CONCATENATE(\"U3:U\",M1)","v":"U3:U9"},null,null,null,"Div","Cls","Event"]
["PLACE","NAME",{"$f":"Lifting!E3","v":"Kg"},"IPF Pts.","Team",null,null,null,"row",null,null,"PL","3-Lift",null,null,"F-O","84+","PL",{"$f":"IF($P3=\"Wilks\",$P3,VLOOKUP($P3,Setup!$I:$J,2,FALSE))","v":"Women"},{"$f":"VLOOKUP(R3,$L$3:$M$7,2,FALSE)","v":"3-Lift"},{"$f":"CONCATENATE($S3,\" \",$T3,\" \",IF($Q3=\"\",\"\",CONCATENATE($Q3,\"-\",$M$10)))","v":"Women 3-Lift 84+-kg cls"},{"$f":"CONCATENATE(P3,\"/\",Q3,\"/\",R3)","v":"F-O/84+/PL"}]
[1,{"$f":"IFERROR(INDIRECT(CONCATENATE(\"QuickPrint!B\",I4)),\"\")","v":""},{"$f":"IFERROR(INDIRECT(CONCATENATE(\"QuickPrint!Y\",I4)),\"\")","v":""},{"$f":"IFERROR(INDIRECT(CONCATENATE(\"QuickPrint!\",IF($J$10=3,\"AD\",\"AC\"),I4)),\"\")","v":""},{"$f":"IFERROR(VLOOKUP(INDIRECT(CONCATENATE(\"QuickPrint!c\",I4)),Setup!$M$6:$N$93,2,FALSE),\"\")","v":""},null,null,null,{"$f":"MATCH(J4,INDIRECT(CONCATENATE(\"QuickPrint!$Z:$Z\")),0)","v":{"$error":"#N/A"}},{"$f":"CONCATENATE(\"1/\",$J$2)","v":{"$error":"#N/A"}},null,"BP","Bench Press",null,null,"F-O",52,"PL",{"$f":"IF($P4=\"Wilks\",$P4,VLOOKUP($P4,Setup!$I:$J,2,FALSE))","v":"Women"},{"$f":"VLOOKUP(R4,$L$3:$M$7,2,FALSE)","v":"3-Lift"},{"$f":"CONCATENATE($S4,\" \",$T4,\" \",IF($Q4=\"\",\"\",CONCATENATE($Q4,\"-\",$M$10)))","v":"Women 3-Lift 52-kg cls"},{"$f":"CONCATENATE(P4,\"/\",Q4,\"/\",R4)","v":"F-O/52/PL"}]
[2,"","","",{"$f":"IFERROR(VLOOKUP(INDIRECT(CONCATENATE(\"QuickPrint!c\",I5)),Setup!$M$6:$N$93,2,FALSE),\"\")","v":""},null,null,null,{"$f":"MATCH(J5,INDIRECT(CONCATENATE(\"QuickPrint!$Z:$Z\")),0)","v":{"$error":"#N/A"}},{"$f":"CONCATENATE(\"2/\",$J$2)","v":{"$error":"#N/A"}},null,"SQ","Squat",null,null,"F-O",47,"PL",{"$f":"IF($P5=\"Wilks\",$P5,VLOOKUP($P5,Setup!$I:$J,2,FALSE))","v":"Women"},"3-Lift","Women 3-Lift 47-kg cls","F-O/47/PL"]
[3,"","","",{"$f":"IFERROR(VLOOKUP(INDIRECT(CONCATENATE(\"QuickPrint!c\",I6)),Setup!$M$6:$N$93,2,FALSE),\"\")","v":""},null,null,null,{"$f":"MATCH(J6,INDIRECT(CONCATENATE(\"QuickPrint!$Z:$Z\")),0)","v":{"$error":"#N/A"}},{"$f":"CONCATENATE(\"3/\",$J$2)","v":{"$error":"#N/A"}},null,"DL","Deadlift",null,null,"F-O",63,"PL",{"$f":"IF($P6=\"Wilks\",$P6,VLOOKUP($P6,Setup!$I:$J,2,FALSE))","v":"Women"},"3-Lift","Women 3-Lift 63-kg cls","F-O/63/PL"]
{"$rows_left_out":5}
{"sheet":"SpeakersCard","index":8,"n_rows":25,"n_cols":15,"rows_kept":25,"cut":false,"hidden":true,"merged":[[4,13,4,14],[5,8,5,9],[5,13,5,14],[16,3,16,4],[17,5,17,6],[16,11,16,12],[17,13,17,14],[11,2,11,3],[11,10,11,11],[4,11,4,12],[5,11,5,12],[15,1,15,3],[15,9,15,11],[10,0,10,1],[10,8,10,9],[11,0,11,1],[23,0,23,1],[23,8,23,9],[24,0,24,1],[24,8,24,9],[25,0,25,6],[25,8,25,14],[24,2,24,3],[24,10,24,11],[22,0,22,1],[17,3,17,4],[17,11,17,12],[12,0,12,6],[12,8,12,14],[14,0,14,4],[14,8,14,12],[18,13,18,14],[18,3,18,4],[18,11,18,12],[18,0,18,1],[18,5,18,6],[18,8,18,9],[22,8,22,9],[11,8,11,9],[3,3,3,4],[5,0,5,1],[9,0,9,1],[4,3,4,4],[9,8,9,9],[5,3,5,4],[4,5,4,6],[5,5,5,6],[1,0,1,4],[1,8,1,12],[3,11,3,12],[2,1,2,3],[2,9,2,11]]}
[]
[{"$f":"Setup!$B$6","v":"全日本ベンチプレス選手権"},null,null,null,null,"Group:","A",null,{"$f":"Setup!$B$6","v":"全日本ベンチプレス選手権"},null,null,null,null,"Group:","A"]
["Name &\nMbr #:","lifter5-5",null,null,null,"Lot number:",5,null,"Name &\nMbr #:","lifter2-2",null,null,null,"Lot number:",2]
["Birth Year:","1990-01-05","Team:","Abrev",null,"Weight\nClass:",72,null,"Birth Year:","1990-01-02","Team:","Abrev",null,"Weight\nClass:",72]
["Body Weight:",80,null,"Events Entered:",null,"Division(s)",null,null,"Body Weight:",65,null,"Events Entered:",null,"Division(s)"]
["Lifter/Coach\nInitials:",null,null,"pl",null,"FR-O",null,null,"Lifter/Coach\nInitials:",null,null,"pl",null,"FR-O"]
{"$rows_left_out":20}
{"sheet":"ContestResults","index":9,"n_rows":1,"n_cols":33,"rows_kept":1,"cut":false,"hidden":true,"merged":[]}
[null,null,null,null,null,null,null,null,null,null,null,null,null,null,null,null,null,null,null,null,null,null,null,null,null,null,null,null,null,null,null,null,{"$f":"3*COUNTA(C:C)","v":0}]

{"sheet":"ContestLog","index":10,"n_rows":1232,"n_cols":10,"rows_kept":1232,"cut":false,"hidden":true,"merged":[]}
["Time","Name",{"$f":"\"Weight Cls \"&IF(Setup!B39=\"Kilograms\",\"(Kg)\",\"(Lb)\")","v":"Weight Cls (Lb)"},"Lift",{"$f":"\"Weight (\"&Setup!G15&\")\"","v":"Weight (Kg)"},{"$f":"\"Total (\"&Setup!G15&\")\"","v":"Total (Kg)"},"Record?",null,null,{"$f":"COUNTA(B:B)+1","v":1233}]
["16:16:29","山下 彩",43,"Squat 1",100]
["16:16:31","高岡 美穂",47,"Squat 1",110]
["16:16:32","酒井 維吹",53,"Squat 1",120]
["16:16:33","野口 貴史",59,"Squat 1",130]
["16:16:35","安倉 明徳",66,"Squat 1",140]
{"$rows_left_out":1227}
{"sheet":"KG Records","index":11,"n_rows":151,"n_cols":38,"rows_kept":151,"cut":false,"hidden":true,"merged":[]}
[null,"Y1","Y2","Y3","T1","T2","T3","JR","O","M1a","M1b","M2a","M2b","M3a","M3b","M4a","M4b","M5a","M5b","M6","R-T1","R-T2","R-T3","R-Y1","R-Y2","R-Y3","R-JR","R-O","R-M1A","R-M1B","R-M2A","R-M2B","R-M3A","R-M3B","R-M4A","R-M4B","R-M5A","R-M5B"]
["30-SQ",0,0,0,0,0,0,0,0,0,0,0,0,0,0,0,0,0,0,0,0,0,0,45,45,45,0,0,0,0,0,0,0,0,0,0,0,0]
["30-BP",0,0,0,0,0,0,0,0,0,0,0,0,0,0,0,0,0,0,0,0,0,0,26,26,26,0,0,0,0,0,0,0,0,0,0,0,0]
["30-DL",0,0,0,0,0,0,0,0,0,0,0,0,0,0,0,0,0,0,0,0,0,0,70,70,70,0,0,0,0,0,0,0,0,0,0,0,0]
["30-TL",0,0,0,0,0,0,0,0,0,0,0,0,0,0,0,0,0,0,0,0,0,0,141,141,141,0,0,0,0,0,0,0,0,0,0,0,0]
["35-SQ",0,0,0,0,0,0,0,0,0,0,0,0,0,0,0,0,0,0,0,0,0,0,55,55,55,0,0,0,0,0,0,0,0,0,0,0,0]
{"$rows_left_out":146}
{"sheet":"LB Records","index":12,"n_rows":151,"n_cols":38,"rows_kept":151,"cut":false,"hidden":true,"merged":[]}
[null,"Y1","Y2","Y3","T1","T2","T3","JR","O","M1a","M1b","M2a","M2b","M3a","M3b","M4a","M4b","M5a","M5b","M6","R-T1","R-T2","R-T3","R-Y1","R-Y2","R-Y3","R-JR","R-O","R-M1A","R-M1B","R-M2A","R-M2B","R-M3A","R-M3B","R-M4A","R-M4B","R-M5A","R-M5B"]
["66-SQ",0,0,0,0,0,0,0,0,0,0,0,0,0,0,0,0,0,0,0,0,0,0,99.2,99.2,99.2,0,0,0,0,0,0,0,0,0,0,0,0]
["66-BP",0,0,0,0,0,0,0,0,0,0,0,0,0,0,0,0,0,0,0,0,0,0,57.3,57.3,57.3,0,0,0,0,0,0,0,0,0,0,0,0]
["66-DL",0,0,0,0,0,0,0,0,0,0,0,0,0,0,0,0,0,0,0,0,0,0,154.30000000000001,154.30000000000001,154.30000000000001,0,0,0,0,0,0,0,0,0,0,0,0]
["66-TL",0,0,0,0,0,0,0,0,0,0,0,0,0,0,0,0,0,0,0,0,0,0,310.89999999999998,310.89999999999998,310.89999999999998,0,0,0,0,0,0,0,0,0,0,0,0]
["77-SQ",0,0,0,0,0,0,0,0,0,0,0,0,0,0,0,0,0,0,0,0,0,0,121.3,121.3,121.3,0,0,0,0,0,0,0,0,0,0,0,0]
{"$rows_left_out":146}
{"sheet":"Quick-Reference","index":13,"n_rows":35,"n_cols":7,"rows_kept":35,"cut":false,"hidden":true,"merged":[]}
[null,null,null,null,null,null,"Quick Reference Sheet"]
[null,null,null,null,null,null,"video tutorial:  https://www.youtube.com/watch?v=o-PyI1n_EMI"]
[]
[null,"1.      Setup sheet"]
[null,"a.      Reset for New Contest"]
[null,"b.      Contest Name"]
{"$rows_left_out":30}
{"sheet":"IPF Formula","index":14,"n_rows":18,"n_cols":5,"rows_kept":18,"cut":false,"hidden":false,"merged":[[0,0,1,0],[0,1,0,2],[0,3,0,4]]}
[null,"Mean",null,"Standard Deviation"]
[null,"Parameter 1","Parameter 2","Parameter 1","Parameter 2"]
["Men CL 3-Lift",310.67,857.78499999999997,53.216000000000001,147.08349999999999]
["Men CL Squat",123.1,363.08499999999998,25.166699999999999,75.431100000000001]
["Men CL Bench",86.474500000000006,259.15499999999997,17.578499999999998,53.122]
["Men CL Deadlift",103.5355,244.76499999999999,15.37134,31.502199999999998]
{"$rows_left_out":13}
{"sheet":"Sheet1","index":15,"n_rows":818,"n_cols":64,"rows_kept":818,"cut":false,"hidden":true,"merged":[]}
[null,null,null,null,null,null,null,null,null,null,null,null,null,null,null,null,null,null,null,null,null,null,null,null,null,1]
[{"$f":"Setup!Q3","v":"Grp"},"Name","MemberID","Team","M/F-Div","Bwt - kg","lot#","Birth Year","SQ rack",{"$f":"CONCATENATE(\"SQ-1 (\",T2,\")\")","v":"SQ-1 (Kg)"},"BP rack",{"$f":"CONCATENATE(\"BP-1 (\",T2,\")\")","v":"BP-1 (Kg)"},{"$f":"CONCATENATE(\"DL-1 (\",T2,\")\")","v":"DL-1 (Kg)"},"Events Entered","State","Print Card","Nominated Wt Class",null,null,{"$f":"Setup!G15","v":"Kg"},{"$f":"COUNTA(F:F)+1","v":20},{"$f":"CONCATENATE(\"Setup!I6:I\",COUNTA(Setup!I:I)+3)","v":"Setup!I6:I37"},{"$f":"CONCATENATE(\"Setup!M6:M\",COUNTA(Setup!M:M)+3)","v":"Setup!M6:M5"},{"$f":"CONCATENATE(\"Setup!Q5:Q\",COUNTA(Setup!Q:Q)+4)","v":"Setup!Q5:Q14"},{"$f":"CONCATENATE(\"DATA!$M$2:$M$61\")","v":"DATA!$M$2:$M$61"},1,{"$f":"COUNTA(F:F)+1","v":20},null,null,null,null,null,null,null,null,null,null,null,null,"flight sort data","att sort data",null,null,null,null,null,null,null,null,null,"SQ-1","SQ-2","SQ-3","Best SQ Att","BP rack","BP-1","BP-2","BP-3","Best BP Att","Sub Total","DL-1","DL-2","DL-3","Best DL Att"]
[null,null,null,null,null,42,1,100,100,100,100,100,100,"PL"]
[null,null,null,null,null,46,2,110,110,110,110,110,110,"PL"]
[null,null,null,null,null,50,3,120,120,120,120,120,120,"PL"]
[null,null,null,null,null,55,4,130,130,130,130,130,130,"PL"]
{"$rows_left_out":813}
{"sheet":"Weigh-In (2)","index":16,"n_rows":818,"n_cols":64,"rows_kept":818,"cut":false,"hidden":false,"merged":[]}
[null,null,null,null,null,null,null,null,null,null,null,null,null,null,null,null,null,null,null,null,null,null,null,null,null,3]
[{"$f":"Setup!Q3","v":"Grp"},"Name","MemberID","Team","M/F-Div","Bwt - kg","lot#","Birth Year","SQ rack",{"$f":"CONCATENATE(\"SQ-1 (\",T2,\")\")","v":"SQ-1 (Kg)"},"BP rack",{"$f":"CONCATENATE(\"BP-1 (\",T2,\")\")","v":"BP-1 (Kg)"},{"$f":"CONCATENATE(\"DL-1 (\",T2,\")\")","v":"DL-1 (Kg)"},"Events Entered","State","Print Card","Nominated Wt Class",null,null,{"$f":"Setup!G15","v":"Kg"},{"$f":"COUNTA(F:F)+1","v":51},{"$f":"CONCATENATE(\"Setup!I6:I\",COUNTA(Setup!I:I)+3)","v":"Setup!I6:I37"},{"$f":"CONCATENATE(\"Setup!M6:M\",COUNTA(Setup!M:M)+3)","v":"Setup!M6:M5"},{"$f":"CONCATENATE(\"Setup!Q5:Q\",COUNTA(Setup!Q:Q)+4)","v":"Setup!Q5:Q14"},{"$f":"CONCATENATE(\"DATA!$M$2:$M$61\")","v":"DATA!$M$2:$M$61"},1,{"$f":"COUNTA(F:F)+1","v":51},null,null,null,null,null,null,null,null,null,null,null,null,"flight sort data","att sort data",null,null,null,null,null,null,null,null,null,"SQ-1","SQ-2","SQ-3","Best SQ Att","BP rack","BP-1","BP-2","BP-3","Best BP Att","Sub Total","DL-1","DL-2","DL-3","Best DL Att"]
["A","中川 貴美子",null,"8suki gym","F-O",42,1,1982,100,100,100,100,100,"PL"]
["A","伊藤 由実子",null,"8suki gym","F-O",46,2,1976,110,110,110,110,110,"PL"]
["A","丸山 武",null,"8suki gym","F-O",50,3,1981,120,120,120,120,120,"PL"]
["A","立脇 和弥",null,"8suki gym","F-O",55,4,1986,130,130,130,130,130,"PL"]
{"$rows_left_out":813}
{"sheet":"エントリー表","index":17,"n_rows":57,"n_cols":11,"rows_kept":57,"cut":false,"hidden":true,"merged":[[38,0,54,0],[55,0,55,8],[56,0,56,8],[0,0,0,8],[2,0,2,8],[3,0,20,0],[21,0,21,8],[22,0,37,0]]}
["　第２１回兵庫県ベンチプレス選手権"]
["セクション","№","種別","階級","カテゴリー","選手名","年齢","都道府県","所属"]
["第１セッション　検量　７：３０－９：００　　　試技開始　９：３０"]
[1,1,"フルギア","63㎏級","県外","山下 彩",1986,"大阪府","8suki gym"]
[null,2,"フルギア","72㎏級","県外","高岡 美穂",1992,"大阪府","8suki gym"]
[null,3,"フルギア","53㎏級","県外","酒井 維吹",2000,"大阪府","8suki gym"]
{"$rows_left_out":51}