{"text_format":"1","workbook":"xlsx","n_sheets":18,"sheets":["Setup","Lists","DATA","Weigh-In","Lifting","QuickPrint","表彰状","Awards","SpeakersCard","ContestResults","ContestLog","KG Records","LB Records","Quick-Reference","IPF Formula","Sheet1","Weigh-In (2)","エントリー表"],"not_rendered":{"charts":1,"images":32,"macros":1,"external_links":4,"defined_names":10,"comments":1,"pivot_tables":0},"unopened":[],"bounds":{"document_bytes":16777216,"sheet_cells":100000,"rows_first":2000,"rows_last":500,"rows_between":2000,"halvings":0,"cell_chars":16384,"cell_head_chars":4096},"cells_cut":0,"cells_raw":0,"read":"whole","date_system":"1900"}

{"sheet":"Setup","index":0,"n_rows":101,"n_cols":26,"rows_kept":101,"cut":false,"hidden":false,"merged":[[39,16,39,21],[37,21,37,26],[5,1,6,6],[8,1,9,6],[11,1,12,6],[14,1,15,3],[14,4,15,5],[14,6,15,6],[32,1,33,1],[32,2,33,3],[32,4,33,4],[32,5,33,6],[0,1,0,6],[2,16,3,16],[2,12,3,13],[2,1,3,6],[2,8,3,10],[0,8,0,9]]}
[null,"video tutorial:  https://www.youtube.com/watch?v=o-PyI1n_EMI",null,null,null,null,null,null,null,null,"2019-02-27",null,null,null,null,null,null,null,null,{"$f":"MATCH(B9,T2:T6,0)","v":2},null,null,null,null,null,{"$f":"MAX(K:K)","v":43523}]
[null,null,null,null,null,null,null,null,null,null,null,null,null,null,null,null,null,null,null,"Powerlifting (3 lift meet)"]
[null,"Reset for New Contest",null,null,null,null,null,null,"IPF Divisions",null,null,null,"Teams",null,null,null,"Grp",null,null,"Bench Press Only"]
[null,null,null,null,null,null,null,null,null,null,null,null,null,null,null,null,null,null,null,"Squat Only"]
[null,null,null,null,null,null,null,null,"Abbrev","Description","Pl Code",null,"Abrev","Team Name",null,{"$f":"CONCATENATE($Q$3,\" \",Q5)","v":"Grp A"},"A",{"$f":"IF(ROW(P5)<$S$5,ROW(P5)+$S$5+1,ROW(P5)-$S$5)","v":12},{"$f":"IFERROR(MATCH(Lifting!A11,Setup!P5:P20,0)+4,0)","v":6},"Deadlift Only"]
[null,"全日本ベンチプレス選手権",null,null,null,null,null,null,"F-SJR-U","Raw Women (14-18)",1,null,null,null,null,"Grp B","B",{"$f":"IF(ROW(P6)<$S$5,ROW(P6)+$S$5+1,ROW(P6)-$S$5)","v":0},null,"Push Pull (Bench & Deadlift)"]
[null,null,null,null,null,null,null,null,"F-JR-U","Raw Women (19-23)",1,null,null,null,null,"Grp C","C",1]
[null,null,null,null,null,null,null,null,"F-O-U","Raw Women",1,null,null,null,null,"Grp D","D",2]
[null,"Bench Press Only",null,null,null,null,null,null,"F-M1-U","Raw Women (40-49)",1,null,null,null,null,"Grp E","E",3,null,"Data!M1:M51"]
[null,null,null,null,null,null,null,null,"F-M2-U","Raw Women (50-59)",1,null,null,null,null,"Grp F","F",4]
[null,null,null,null,null,null,null,null,"F-M3-U","Raw Women (60-69)",1,null,null,null,null,"Grp G","G",5]
[null,"2020-06-01",null,null,null,null,null,null,"F-M4-U","Raw Women (70+)-",1,null,null,null,null,"Grp H","H",6]
[null,null,null,null,null,null,null,null,"M-SJR-U","Raw Men (14-18)",1,null,null,null,null,"Grp I","I",7]
[null,null,null,null,null,null,null,null,"M-JR-U","Raw Men (19-23)",1,null,null,null,null,"Grp ",null,8]
[null,"Platform Weights",null,null,"Platform Weight Set",null,"Kg",null,"M-O-U","Raw Men",1,null,null,null,null,"Grp ",null,9]
[null,null,null,null,null,null,null,null,"M-M1-U","Raw Men (40-49)",1,null,null,null,null,"Grp ",null,10]
[null,null,{"$f":"G15","v":"Kg"},null,"Eleiko",{"$f":"G15","v":"Kg"},null,null,"M-M2-U","Raw Men (50-59)",1,null,null,null,null,"Grp ",null,11]
[null,null,{"$f":"Lists!B36","v":270},{"$f":"2*(D21*C21+D22*C22+D23*C23+D24*C24+D25*C25+D26*C26+D27*C27+D28*C28+D29*C29+D30*C30+D31*C31)+D32","v":55},null,{"$f":"C18","v":270},{"$f":"2*(G21*F21+G22*F22+G23*F23+G24*F24+G25*F25+G26*F26+F27*G27+G28*F28+G29*F29+G30*F30+G31*F31)+G32","v":270},null,"M-M3-U","Raw Men (60-69)",1,null,null,null,null,"Grp ",null,12]
[null,"How","Pound","LOAD","How","Kilo","LOAD",null,"M-M4-U","Raw Men (70+)-",1,null,null,null,null,"Grp ",null,13]
[null,"Many?","Plates","on Bar","Many?","Plates","on Bar",null,"F-SJR","Women (14 -18)",1,null,null,null,null,"Grp ",null,14]
[null,0,110,{"$f":"IF(OR(C18<D32,C17=\"Kg\"),0,MIN(INT((C18-D32)/(2*C21)),B21/2))","v":0},0,50,{"$f":"IF(OR(C18<G32,F17=\"Lb\"),0,MIN(INT((F18-G32)/(2*F21)),E21/2))","v":0},null,"F-JR","Women (19 -23)",1]
[null,0,100,{"$f":"IF(OR(C18<D32,C17=\"Kg\"),0,MIN(INT((C18-D32-2*D21*C21)/(2*C22)),B22/2))","v":0},0,45,{"$f":"IF(OR(C18<G32,F17=\"Lb\"),0,MIN(INT((F18-G32-2*G21*F21)/(2*F22)),E22/2))","v":0},null,"F-O","Women",1]
[null,0,55,{"$f":"IF(OR(C18<D32,C17=\"Kg\"),0,MIN(INT((C18-D32-2*D21*C21-2*D22*C22)/(2*C23)),B23/2))","v":0},14,25,{"$f":"IF(OR(C18<G32,F17=\"Lb\"),0,MIN(INT((F18-G32-2*G21*F21-2*G22*F22)/(2*F23)),E23/2))","v":4},null,"F-M1","Women (40 -49)",1]
[null,16,45,{"$f":"IF(OR(C18<D32,C17=\"Kg\"),0,MIN(INT((C18-D32-2*D21*C21-2*D22*C22-2*D23*C23)/(2*C24)),B24/2))","v":0},2,20,{"$f":"IF(OR(C18<G32,F17=\"Lb\"),0,MIN(INT((F18-G32-2*G21*F21-2*G22*F22-2*G23*F23)/(2*F24)),E24/2))","v":1},null,"F-M2","Women (50 -59)",1]
[null,2,35,{"$f":"IF(OR(C18<D32,C17=\"Kg\"),0,MIN(INT((C18-D32-2*D21*C21-2*D22*C22-2*D23*C23-2*D24*C24)/(2*C25)),B25/2))","v":0},2,15,{"$f":"IF(OR(C18<G32,F17=\"Lb\"),0,MIN(INT((F18-G32-2*G21*F21-2*G22*F22-2*G23*F23-2*G24*F24)/(2*F25)),E25/2))","v":0},null,"F-M3","Women (60 -69)",1]
[null,2,25,{"$f":"IF(OR(C18<D32,C17=\"Kg\"),0,MIN(INT((C18-D32-2*D21*C21-2*D22*C22-2*D23*C23-2*D24*C24-2*D25*C25)/(2*C26)),B26/2))","v":0},2,10,{"$f":"IF(OR(C18<G32,F17=\"Lb\"),0,MIN(INT((F18-G32-2*G21*F21-2*G22*F22-2*G23*F23-2*G24*F24-2*G25*F25)/(2*F26)),E26/2))","v":0},null,"F-M4","Women (70+) -",1]
[null,4,10,{"$f":"IF(OR(C18<D32,C17=\"Kg\"),0,MIN(INT((C18-D32-2*D21*C21-2*D22*C22-2*D23*C23-2*D24*C24-2*D25*C25-2*D26*C26)/(2*C27)),B27/2))","v":0},2,5,{"$f":"IF(OR(C18<G32,F17=\"Lb\"),0,MIN(INT((F18-G32-2*G21*F21-2*G22*F22-2*G23*F23-2*G24*F24-2*G25*F25-2*F26*G26)/(2*F27)),E27/2))","v":0},null,"M-SJR","Men (14 -18)",1]
[null,2,5,{"$f":"IF(OR(C18<D32,C17=\"Kg\"),0,MIN(INT((C18-D32-2*D21*C21-2*D22*C22-2*D23*C23-2*D24*C24-2*D25*C25-2*D26*C26-2*D27*C27)/(2*C28)),B28/2))","v":0},2,2.5,{"$f":"IF(OR(C18<G32,F17=\"Lb\"),0,MIN(INT((F18-G32-2*G21*F21-2*G22*F22-2*G23*F23-2*G24*F24-2*G25*F25-2*F26*G26-2*F27*G27)/(2*F28)),E28/2))","v":1},null,"M-JR","Men (19 -23)",1]
[null,2,2.5,{"$f":"IF(OR(C18<D32,C17=\"Kg\"),0,MIN(INT((C18-D32-2*D21*C21-2*D22*C22-2*D23*C23-2*D24*C24-2*D25*C25-2*D26*C26-2*D27*C27-2*D28*C28)/(2*C29)),B29/2))","v":0},2,1.25,{"$f":"IF(OR(C18<G32,F17=\"Lb\"),0,MIN(INT((F18-G32-2*G21*F21-2*G22*F22-2*G23*F23-2*G24*F24-2*G25*F25-2*F26*G26-2*F27*G27-2*G28*F28)/(2*F29)),E29/2))","v":0},null,"M-O","Men",1]
[null,4,1.25,{"$f":"IF(OR(C18<D32,C17=\"Kg\"),0,MIN(INT((C18-D32-2*D21*C21-2*D22*C22-2*D23*C23-2*D24*C24-2*D25*C25-2*D26*C26-2*D27*C27-2*D28*C28-2*D29*C29)/(2*C30)),B30/2))","v":0},2,0.5,{"$f":"IF(OR(C18<G32,F17=\"Lb\"),0,MIN(INT((F18-G32-2*G21*F21-2*G22*F22-2*G23*F23-2*G24*F24-2*G25*F25-2*F26*G26-2*G27*F27-2*G28*F28-2*G29*F29)/(2*F30)),E30/2))","v":0},null,"M-M1","Men (40 -49)",1]
[null,2,0.5,{"$f":"IF(OR(C18<D32,C17=\"Kg\"),0,MIN(INT((C18-D32-2*D21*C21-2*D22*C22-2*D23*C23-2*D24*C24-2*D25*C25-2*D26*C26-2*D27*C27-2*D28*C28-2*D29*C29-2*D30*C30)/(2*C31)),B31/2))","v":0},2,0.25,{"$f":"IF(OR(C18<G32,F17=\"Lb\"),0,MIN(INT((F18-G32-2*G21*F21-2*G22*F22-2*G23*F23-2*G24*F24-2*G25*F25-2*G26*F26-2*G27*F27-2*G28*F28-2*G29*F29-2*G30*F30)/(2*F31)),E31/2))","v":0},null,"M-M2","Men (50 -59)",1]
[null,"bar & collars",null,55,"bar & collars",null,25,null,"M-M3","Men (60 -69)",1]
[null,{"$f":"B21*C21+B22*C22+B23*C23+B24*C24+B25*C25+B26*C26+B27*C27+B28*C28+B29*C29+B30*C30+B31*C31+D32","v":956},"Lbs Available on the Platform",null,{"$f":"E21*F21+E22*F22+E23*F23+E24*F24+E25*F25+E26*F26+E27*F27+E28*F28+E29*F29+E30*F30+E31*F31+G32","v":484},"Kilos Available on the Platform",null,null,"M-M4","Men (70+) -",1]
[null,null,null,null,null,null,null,null,"F-P-U","Raw Women",1]
[null,null,null,null,null,null,null,null,"F-P","Women",1]
[null,null,null,null,null,null,null,null,"M-P-U","Raw Men",1]
[null,null,null,null,null,null,null,null,"M-P","Men",1]
[]
[]
[]
[]
[]
[]
[]
[]
[]
[]
[]
[]
[]
[]
[]
[]
[]
[]
[]
[]
[]
[]
[]
[]
[]
[]
[]
[]
[]
[]
[]
[]
[]
[]
[]
[]
[]
[]
[]
[]
[]
[]
[]
[]
[]
[]
[]
[]
[]
[]
[]
[]
[]
[]
[]
[]
[]
[null,null,null,null,"Eleiko","Ivanko","Titex"]
[null,null,null,10,{"$f":"IF(E17=E95,G26,0)","v":0},{"$f":"IF(F95=E17,G26,0)","v":0},{"$f":"IF(G95=E17,G26,0)","v":0}]
[null,null,null,5,{"$f":"IF(E95=E17,G27,0)","v":0},{"$f":"IF(F95=E17,G27,0)","v":0},{"$f":"IF(G95=E17,G27,0)","v":0}]
[null,null,null,2.5,{"$f":"IF(E95=E17,G28,0)","v":1},{"$f":"IF(F95=E17,G28,0)","v":0},{"$f":"IF(G95=E17,G28,0)","v":0}]
[]
[]
[null,null,"2015_Nextlifter_R102 Scoreboard.xlsx"]

{"sheet":"Lists","index":1,"n_rows":67,"n_cols":23,"rows_kept":67,"cut":false,"hidden":true,"merged":[]}
["Attempts",null,"col",null,{"$f":"MATCH(Setup!B9,Lists!F1:J1,0)","v":3},"Powerlifting (3 lift meet)","Squat Only","Bench Press Only","Deadlift Only","Push Pull (Bench & Deadlift)",null,"column #","column Ltr",null,"Barload for Next Lifter"]
["Squat 1","SQ-1",11,null,{"$f":"OFFSET(E2,0,$E$1)","v":"Bench Press 1"},"Squat 1","Squat 1","Bench Press 1","Deadlift 1","Bench Press 1",null,1,"A",null,null,{"$f":"Setup!G15","v":"Kg"},null,null,null,null,null,null,"Y1"]
["Squat 2","SQ-2",12,null,"Bench Press 2","Squat 2","Squat 2","Bench Press 2","Deadlift 2","Bench Press 2",null,2,"B",null,null,{"$f":"ABS(Lists!B41)","v":260},{"$f":"2*(Q6*P6+Q7*P7+Q8*P8+Q9*P9+Q10*P10+Q11*P11+Q12*P12+Q13*P13+Q14*P14+Q15*P15+Q16*P16)+Q35","v":55},null,null,null,null,null,"Y2"]
["Squat 3","SQ-3",13,null,"Bench Press 3","Squat 3","Squat 3","Bench Press 3","Deadlift 3","Bench Press 3",null,3,"C",null,"How","Pound","LOAD",null,null,null,null,null,"Y3"]
["Bench Press 1","BP-1",16,null,"------------","Bench Press 1","------------","------------","------------","Deadlift 1",null,4,"D",null,"Many?","Plates","on Bar",null,null,null,null,null,"T1"]
["Bench Press 2","BP-2",17,null,"New Lifter","Bench Press 2","New Lifter","New Lifter","New Lifter","Deadlift 2",null,5,"E",null,{"$f":"Setup!B21","v":0},110,{"$f":"IF(OR(P3<Q35,P2=\"Kg\"),0,MIN(INT((P3-Q35)/(2*P6)),O6/2))","v":0},{"$f":"IF(Q6=0,\"\",IF(Q6>1,CONCATENATE(Q6,\"/\",P6,\" \"),CONCATENATE(P6,\" \")))","v":""},null,null,null,null,"T2"]
["Bench Press 3","BP-3",18,null,0,"Bench Press 3",null,null,null,"Deadlift 3",null,6,"F",null,{"$f":"Setup!B22","v":0},100,{"$f":"IF(OR(P3<Q35,P2=\"Kg\"),0,MIN(INT((P3-Q35-2*Q6*P6)/(2*P7)),O7/2))","v":0},{"$f":"IF(Q7=0,\"\",IF(Q7>1,CONCATENATE(Q7,\"/\",P7,\" \"),CONCATENATE(P7,\" \")))","v":""},null,null,null,null,"T3"]
["Deadlift 1","DL-1",21,null,0,"Deadlift 1",null,null,null,"------------",null,7,"G",null,{"$f":"Setup!B23","v":0},55,{"$f":"IF(OR(P3<Q35,P2=\"Kg\"),0,MIN(INT((P3-Q35-2*Q6*P6-2*Q7*P7)/(2*P8)),O8/2))","v":0},{"$f":"IF(Q8=0,\"\",IF(Q8>1,CONCATENATE(Q8,\"/\",P8,\" \"),CONCATENATE(P8,\" \")))","v":""},null,null,null,null,"JR"]
["Deadlift 2","DL-2",22,null,0,"Deadlift 2",null,null,null,"New Lifter",null,8,"H",null,{"$f":"Setup!B24","v":16},45,{"$f":"IF(OR(P3<Q35,P2=\"Kg\"),0,MIN(INT((P3-Q35-2*Q6*P6-2*Q7*P7-2*Q8*P8)/(2*P9)),O9/2))","v":0},{"$f":"IF(Q9=0,\"\",IF(Q9>1,CONCATENATE(Q9,\"/\",P9,\" \"),CONCATENATE(P9,\" \")))","v":""},null,null,null,null,"O"]
["Deadlift 3","DL-3",23,null,0,"Deadlift 3",null,null,null,null,null,9,"I",null,{"$f":"Setup!B25","v":2},35,{"$f":"IF(OR(P3<Q35,P2=\"Kg\"),0,MIN(INT((P3-Q35-2*Q6*P6-2*Q7*P7-2*Q8*P8-2*Q9*P9)/(2*P10)),O10/2))","v":0},{"$f":"IF(Q10=0,\"\",IF(Q10>1,CONCATENATE(P10,\"/\",Q10,\" \"),CONCATENATE(P10,\" \")))","v":""},null,null,null,null,"M1a"]
["------------",null,null,null,"------------","------------",null,null,null,null,null,10,"J",null,{"$f":"Setup!B26","v":2},25,{"$f":"IF(OR(P3<Q35,P2=\"Kg\"),0,MIN(INT((P3-Q35-2*Q6*P6-2*Q7*P7-2*Q8*P8-2*Q9*P9-2*Q10*P10)/(2*P11)),O11/2))","v":0},"",null,null,null,null,"M1b"]
["New Lifter",null,null,null,{"$f":"OFFSET(E12,0,$E$1)","v":0},"New Lifter",null,null,null,null,null,11,"K",null,{"$f":"Setup!B27","v":4},10,{"$f":"IF(OR(P3<Q35,P2=\"Kg\"),0,MIN(INT((P3-Q35-2*Q6*P6-2*Q7*P7-2*Q8*P8-2*Q9*P9-2*Q10*P10-2*Q11*P11)/(2*P12)),O12/2))","v":0},"",null,null,null,null,"M2a"]
["Deadlift 1",null,null,null,null,null,null,null,null,null,null,12,"L",null,{"$f":"Setup!B28","v":2},5,{"$f":"IF(OR(P3<Q35,P2=\"Kg\"),0,MIN(INT((P3-Q35-2*Q6*P6-2*Q7*P7-2*Q8*P8-2*Q9*P9-2*Q10*P10-2*Q11*P11-2*Q12*P12)/(2*P13)),O13/2))","v":0},"",null,null,null,null,"M2b"]
["Weigh-in Macro values",null,null,null,null,null,null,null,null,null,null,13,"M",null,{"$f":"Setup!B29","v":2},2.5,{"$f":"IF(OR(P3<Q35,P2=\"Kg\"),0,MIN(INT((P3-Q35-2*Q6*P6-2*Q7*P7-2*Q8*P8-2*Q9*P9-2*Q10*P10-2*Q11*P11-2*Q12*P12-2*Q13*P13)/(2*P14)),O14/2))","v":0},"",null,null,null,null,"M3a"]
["Endrow (RowSort, EndSort for SQ1 BP1 DL1)",{"$f":"COUNTA(INDIRECT(\"Lifting!B13:B500\"))+12","v":30},null,null,null,null,null,null,null,null,null,14,"N",null,{"$f":"Setup!B30","v":4},1.25,{"$f":"IF(OR(P3<Q35,P2=\"Kg\"),0,MIN(INT((P3-Q35-2*Q6*P6-2*Q7*P7-2*Q8*P8-2*Q9*P9-2*Q10*P10-2*Q11*P11-2*Q12*P12-2*Q13*P13-2*Q14*P14)/(2*P15)),O15/2))","v":0},"",null,null,null,null,"M3b"]
["CopyRows",{"$f":"COUNTA(INDIRECT(\"'Weigh-In'!F1:F500\"))+1","v":3},null,null,null,null,null,null,null,null,null,15,"O",null,{"$f":"Setup!B31","v":2},0.5,{"$f":"IF(OR(P3<Q35,P2=\"Kg\"),0,MIN(INT((P3-Q35-2*Q6*P6-2*Q7*P7-2*Q8*P8-2*Q9*P9-2*Q10*P10-2*Q11*P11-2*Q12*P12-2*Q13*P13-2*Q14*P14-2*Q15*P15)/(2*P16)),O16/2))","v":0},"",null,null,null,null,"M4a"]
[null,null,null,null,null,null,null,null,null,null,null,16,"P",null,null,{"$f":"Setup!G15","v":"Kg"},null,null,null,null,null,null,"M4b"]
["Lifting Sheet Macro Values",null,null,null,null,null,null,null,null,null,null,17,"Q",null,null,{"$f":"P3","v":260},{"$f":"2*(Q21*P21+Q22*P22+Q23*P23+Q24*P24+Q25*P25+Q26*P26+Q27*P27+Q28*P28+Q29*P29+Q30*P30+Q31*P31)+Q36","v":260},null,null,null,null,null,"M5a"]
["Lifting Sheet Sort","on",null,null,null,null,null,null,null,null,null,18,"R",null,"How","Kilo","LOAD",null,null,null,null,null,"M5b"]
["Lifting sheet row",39,null,null,null,null,null,null,null,null,null,19,"S",null,"Many?","Plates","on Bar",null,null,null,null,null,"M6"]
["Lifting sheet column",3,null,null,null,null,null,null,null,null,null,20,"T",null,{"$f":"Setup!E21","v":0},50,{"$f":"IF(OR(P3<Q36,P17=\"Lb\"),0,MIN(INT((P18-Q36)/(2*P21)),O21/2))","v":0},{"$f":"IF(Q21=0,\"\",IF(Q21>1,CONCATENATE(Q21,\"/\",P21,\" \"),CONCATENATE(P21,\" \")))","v":""},null,null,null,null,"R-T1"]
["Lifting Sheet Cell",{"$f":"ADDRESS(B20,B21,,1,\"Lifting\")","v":"Lifting!$C$39"},null,null,null,null,null,null,null,null,null,21,"U",null,{"$f":"Setup!E22","v":0},45,{"$f":"IF(OR(P3<Q36,P17=\"Lb\"),0,MIN(INT((P18-Q36-2*Q21*P21)/(2*P22)),O22/2))","v":0},{"$f":"IF(Q22=0,\"\",IF(Q22>1,CONCATENATE(Q22,\"/\",P22,\" \"),CONCATENATE(P22,\" \")))","v":""},null,null,null,null,"R-T2"]
["Attempt",{"$f":"VLOOKUP(Lifting!A3,Lists!A2:C10,2,FALSE)","v":"DL-1"},null,null,null,null,null,null,null,null,null,22,"V",null,{"$f":"Setup!E23","v":14},25,{"$f":"IF(OR(P3<Q36,P17=\"Lb\"),0,MIN(INT((P18-Q36-2*Q21*P21-2*Q22*P22)/(2*P23)),O23/2))","v":4},{"$f":"IF(Q23=0,\"\",IF(Q23>1,CONCATENATE(Q23,\"/\",P23,\" \"),CONCATENATE(P23,\" \")))","v":"4/25 "},null,null,null,null,"R-T3"]
["Attempt column",{"$f":"MATCH(B23,INDIRECT(\"Lifting!A11:AZ11\"),0)","v":21},null,null,null,null,null,null,null,null,null,23,"W",null,{"$f":"Setup!E24","v":2},20,{"$f":"IF(OR(P3<Q36,P17=\"Lb\"),0,MIN(INT((P18-Q36-2*Q21*P21-2*Q22*P22-2*Q23*P23)/(2*P24)),O24/2))","v":0},{"$f":"IF(Q24=0,\"\",IF(Q24>1,CONCATENATE(P24,\"/\",Q24,\" \"),CONCATENATE(P24,\" \")))","v":""},null,null,null,null,"R-Y1"]
["Active lifter row",{"$f":"MATCH(Lifting!A1,INDIRECT(\"Lifting!B1:B500\"),0)","v":13},null,null,null,null,null,null,null,null,null,24,"X",null,{"$f":"Setup!E25","v":2},15,{"$f":"IF(OR(P3<Q36,P17=\"Lb\"),0,MIN(INT((P18-Q36-2*Q21*P21-2*Q22*P22-2*Q23*P23-2*Q24*P24)/(2*P25)),O25/2))","v":1},"15 ",null,null,null,null,"R-Y2"]
["Last Row",{"$f":"COUNTA(INDIRECT(\"Lifting!B12:B500\"))+12","v":30},null,null,null,null,null,null,null,null,null,25,"Y",null,{"$f":"Setup!E26","v":2},10,{"$f":"IF(OR(P3<Q36,P17=\"Lb\"),0,MIN(INT((P18-Q36-2*Q21*P21-2*Q22*P22-2*Q23*P23-2*Q24*P24-2*Q25*P25)/(2*P26)),O26/2))","v":0},"",null,null,null,null,"R-Y3"]
["Event Flight","B",{"$f":"VLOOKUP(Lifting!A11,Setup!P5:Q20,2,FALSE)","v":"B"},null,null,null,null,null,null,null,null,26,"Z",null,{"$f":"Setup!E27","v":2},5,{"$f":"IF(OR(P3<Q36,P17=\"Lb\"),0,MIN(INT((P18-Q36-2*Q21*P21-2*Q22*P22-2*Q23*P23-2*Q24*P24-2*Q25*P25-2*Q26*P26)/(2*P27)),O27/2))","v":0},"",null,null,null,null,"R-JR"]
["event flight 1st row (RowSort, StartSort)",{"$f":"MATCH(B27,INDIRECT(\"Lifting!A1:A500\"),0)","v":13},null,null,null,null,null,null,null,null,null,null,null,null,{"$f":"Setup!E28","v":2},2.5,{"$f":"IF(OR(P3<Q36,P17=\"Lb\"),0,MIN(INT((P18-Q36-2*Q21*P21-2*Q22*P22-2*Q23*P23-2*Q24*P24-2*Q25*P25-2*Q26*P26-2*Q27*P27)/(2*P28)),O28/2))","v":1},"2.5 ",null,null,null,null,"R-O"]
["event flight last row (RowSort, EndSort)",{"$f":"COUNTIF(INDIRECT(\"Lifting!A1:A500\"),B27)+B28-1","v":19},null,null,null,null,null,null,null,null,null,null,null,null,{"$f":"Setup!E29","v":2},1.25,{"$f":"IF(OR(P3<Q36,P17=\"Lb\"),0,MIN(INT((P18-Q36-2*Q21*P21-2*Q22*P22-2*Q23*P23-2*Q24*P24-2*Q25*P25-2*Q26*P26-2*Q27*P27-2*Q28*P28)/(2*P29)),O29/2))","v":0},"",null,null,null,null,"R-M1A"]
["Sort Column #",21,null,null,null,null,null,null,null,null,null,null,null,null,{"$f":"Setup!E30","v":2},0.5,{"$f":"IF(OR(P3<Q36,P17=\"Lb\"),0,MIN(INT((P18-Q36-2*Q21*P21-2*Q22*P22-2*Q23*P23-2*Q24*P24-2*Q25*P25-2*Q26*P26-2*Q27*P27-2*Q28*P28-2*Q29*P29)/(2*P30)),O30/2))","v":0},"",null,null,null,null,"R-M1B"]
["Sort Column Ltr",{"$f":"VLOOKUP(B30,L2:M27,2,FALSE)","v":"U"},null,null,null,null,null,null,null,null,null,null,null,null,{"$f":"Setup!E31","v":2},0.25,{"$f":"IF(OR(P3<Q36,P17=\"Lb\"),0,MIN(INT((P18-Q36-2*Q21*P21-2*Q22*P22-2*Q23*P23-2*Q24*P24-2*Q25*P25-2*Q26*P26-2*Q27*P27-2*Q28*P28-2*Q29*P29-2*Q30*P30)/(2*P31)),O31/2))","v":0},"",null,null,null,null,"R-M2A"]
["Active Flt Last Row",{"$f":"COUNTIF(INDIRECT(\"Lifting!A1:A500\"),B27)+12","v":19},null,null,null,null,null,null,null,null,null,null,null,null,null,null,null,null,null,null,null,null,"R-M2B"]
["Max index SQ",{"$f":"MAX(INDIRECT(\"Lifting!AJ1:AJ500\"))","v":26},null,null,null,null,null,null,null,null,null,null,null,null,null,null,null,null,null,null,null,null,"R-M3A"]
["Max index BP",{"$f":"MAX(INDIRECT(\"Lifting!AK1:AK500\"))","v":19},null,null,null,null,null,null,null,null,null,null,null,null,null,null,null,null,null,null,null,null,"R-M3B"]
["Max index DL",{"$f":"MAX(INDIRECT(\"Lifting!AL1:AL500\"))","v":21},null,"Total?",null,null,null,null,null,null,null,null,null,null,"bar & collars - lbs",null,{"$f":"Setup!D32","v":55},null,null,null,null,null,"R-M4A"]
["Wt on Bar",{"$f":"ABS(INDIRECT(CONCATENATE(\"Lifting!\",VLOOKUP(B24,L2:M27,2,FALSE),B25)))","v":270},null,{"$f":"INDIRECT(ADDRESS(B25,25,1,1,\"Lifting\"))","v":0},null,null,null,null,null,null,null,null,null,null,"bar & collars - kg",null,{"$f":"Setup!G32","v":25},null,null,null,null,null,"R-M4B"]
["Rack Height",{"$f":"IF(LEFT(B23,1)=\"D\",\"\",CONCATENATE(\"Rack \",INDIRECT(CONCATENATE(\"Lifting!\",IF(LEFT(B23,1)=\"S\",\"J\",IF(LEFT(B23,1)=\"B\",\"O\",\"Z\")),B25))))","v":""},null,null,null,null,null,null,null,null,null,null,null,null,null,null,null,null,null,null,null,null,"R-M5A"]
["Placing Code Max",{"$f":"MAX(INDIRECT(\"Setup!K6:K500\"))","v":1},null,null,null,null,null,null,null,null,null,null,null,"on deck barload",{"$f":"IF(AND(RIGHT(B23,1)=\"3\",B25=B32),\"\",IF(B36=B41,\"On Deck Barload - No Change\",CONCATENATE(\"On Deck Barload \",R6,R7,R8,R9,R10,R11,R12,R13,R14,R15,R16,R21,R22,R23,R24,R25,R26,R27,R28,R29,R30,R31)))","v":"On Deck Barload 4/25 15 2.5 "},null,null,null,null,null,null,null,"R-M5B"]
["Lifter Wt Cls",{"$f":"Lifting!D2","v":"84+"}]
["Lifter Div",{"$f":"INDIRECT(CONCATENATE(\"Lifting!D\",B25))","v":"F-O"},null,null,"Lifter Lot#","Repeats"]
["Next Barload",{"$f":"INDIRECT(ADDRESS(IF(B25+F41>B29,13,B25+F41),IF(B25+F41>B29,B24+1,B24),1,1,\"Lifting\"))","v":260},null,{"$f":"AND(B32=B25,RIGHT(B23,1)=3)","v":false},{"$f":"INDIRECT(ADDRESS(Lists!B25,7,1,1,\"Lifting\"))","v":18},{"$f":"COUNTIF(INDIRECT(\"Lifting!B13:B100\"),Lifting!A1)","v":1}]
["QuickPrint PasteCol",{"$f":"COUNTA(INDIRECT(\"QuickPrint!A2:A500\"))+1","v":20}]
["QuickPrint RowClear",{"$f":"COUNTA(INDIRECT(\"QuickPrint!B1:B500\"))+6","v":26}]
["Entered in Event",{"$f":"COUNTIF(INDIRECT(\"Lifting!AM1:AM500\"),1)","v":1}]
["PasteRow on QuickPrint",{"$f":"C45+D45","v":22},{"$f":"COUNTA(INDIRECT(\"QuickPrint!B1:B200\"))+1","v":21},{"$f":"COUNTIF(QuickPrint!B:B,\"Name\")","v":1}]
["Next Flt Sort Value",{"$f":"INDIRECT(CONCATENATE(\"Lifting!\",IF(B23=\"SQ-3\",\"AK\",\"AL\"),B32+1))","v":2},"sorts next flt if = 0"]
["Next Flt sort Col",{"$f":"IF(B23=\"SQ-3\",\"P\",\"U\")","v":"U"}]
["Next flt Start",{"$f":"IFERROR(MATCH(1,INDIRECT(\"Lifting!AH1:AH500\"),0),0)","v":0}]
["Next flt end",{"$f":"COUNTIF(INDIRECT(\"Lifting!$A$1:$A$100\"),INDIRECT(ADDRESS(B32+1,1,1,1,\"Lifting\")))+B32","v":30},null,null,"Wt Class-Event-Div","BP only","DL only",{"$f":"IF(IFERROR(SEARCH(\"PL\",INDIRECT(CONCATENATE(\"Lifting!AE\",B25))),0)>0,\"PL\",\"\")","v":"PL"},"div","lookup Event"]
["Concatenated Record Data",null,null,null,{"$f":"CONCATENATE(Lists!B39,\"-\",J50)","v":"84+-DL"},{"$f":"IFERROR(IF(AND(SEARCH(\"BP\",INDIRECT(CONCATENATE(\"Lifting!AE\",B25))),LEFT(B23,2)=\"BP\"),\"BPO\",\"\"),\"\")","v":""},{"$f":"IFERROR(IF(AND(SEARCH(\"DL\",INDIRECT(CONCATENATE(\"Lifting!AE\",B25))),LEFT(B23,2)=\"DL\"),\"DLO\",\"\"),\"\")","v":""},{"$f":"LEFT(B23,2)","v":"DL"},{"$f":"CONCATENATE(IF(MID(B40,2,1)=\"R\",\"R-\",\"\"),VLOOKUP(INDIRECT(CONCATENATE(\"Lifting!AS\",B25)),DATA!E35:F52,2,TRUE))","v":"M1b"},{"$f":"IF(IFERROR(SEARCH(\"PL\",INDIRECT(CONCATENATE(\"Lifting!AE\",B25))),0)+IFERROR(SEARCH(\"PP\",INDIRECT(CONCATENATE(\"Lifting!AE\",B25))),0)>0,H50,CONCATENATE(F50,G50))","v":"DL"}]
["Number of lifter in Event",{"$f":"SUM(INDIRECT(\"Lifting!AM1:AM500\"))","v":1},null,null,{"$f":"IFERROR(OFFSET(INDIRECT(B56),MATCH(E50,DATA!AF1:AF150,0)-1,I51-1),\"\")","v":227.5},{"$f":"IFERROR(OFFSET(INDIRECT(B56),MATCH(E50,DATA!AF1:AF150,0)-1,I53-1),\"\")","v":260.5},null,null,{"$f":"IFERROR(MATCH(I50,INDIRECT(\"'KG Records'!1:1\"),0),\"\")","v":11}]
[null,null,null,null,{"$f":"CONCATENATE(Lists!B39,\"-TL\")","v":"84+-TL"},null,null,null,{"$f":"CONCATENATE(IF(LEFT(I50,1)=\"R\",\"R-\",\"\"),\"O\")","v":"O"}]
[null,null,null,null,{"$f":"IFERROR(IF(H49=\"PL\",OFFSET(INDIRECT(B56),MATCH(E52,DATA!AF1:AF150,0)-1,I51-1),\"\"),\"\")","v":612.5},{"$f":"IFERROR(IF(H49=\"PL\",OFFSET(INDIRECT(B56),MATCH(E52,DATA!AF1:AF150,0)-1,I53-1),\"\"),\"\")","v":778},null,null,{"$f":"IFERROR(MATCH(I52,INDIRECT(\"'KG Records'!1:1\"),0),\"\")","v":9}]
[]
["Record Lookups LB or Kilos",{"$f":"Setup!G15","v":"Kg"}]
[null,{"$f":"IF(B55=\"Kg\",\"'KG Records'!$A$1\",\"'LB Records'!$A$1\")","v":"'KG Records'!$A$1"}]
[null,{"$f":"IF(B55=\"Kg\",\"'KG Records'!$A1:$AO1\",\"'LB Records'!$A1:$AO1\")","v":"'KG Records'!$A1:$AO1"}]
[null,{"$f":"IF(B55=\"Kg\",\"'KG Records'!$A1:$A110\",\"'LB Records'!$A1:$A110\")","v":"'KG Records'!$A1:$A110"}]
[]
[]
["Record Lookups"]
["body weights in",{"$f":"Setup!B39","v":0},null,null,null,null,null,null,{"$f":"VLOOKUP(INDIRECT(CONCATENATE(\"Lifting!AS\",B25)),DATA!E35:F52,2,TRUE)","v":"M1b"}]
["Weight classes ",{"$f":"Setup!E39","v":0}]
["bodyweight",{"$f":"INDIRECT(CONCATENATE(\"Lifting!E\",B25))","v":150},null,{"$f":"VLOOKUP(B64,INDIRECT(E64),IF(LEFT(B40,1)=\"M\",2,3),TRUE)","v":158},{"$f":"IF(AND(B62=\"Kilograms\",B63=\"High School Wt Classes\"),\"DATA!X2:Z22\",IF(AND(B62=\"Pounds\",B63=\"High School Wt Classes\"),\"DATA!R2:T22\",IF(AND(B62=\"Kilograms\",B63=\"IPF Wt Classes\"),\"DATA!X2:Z22\",\"DATA!R2:T22\")))","v":"DATA!R2:T22"}]
[]
[]
["pasterow on Results sheet",{"$f":"COUNTA(ContestResults!#REF!)+1","v":2}]

{"sheet":"DATA","index":2,"n_rows":151,"n_cols":43,"rows_kept":151,"cut":false,"hidden":true,"merged":[[0,36,0,38],[0,40,0,42]]}
["Age","Coeff",null,null,"wt","IPF Men-kg","IPF women-kg",null,"wt class list","rank",null,"US State:","USAPL",null,"WT","HS Men-lb","HS Women-lb","WT","IPF Men-lb","IPF women-lb","wt","HS Men-kg","HS women-kg","wt","IPF Men-kg","IPF women-kg",null,"wt class rank kg","wt class rank lb","wt class rank kg",null,null,null,null,null,null,"USAPL Dvisions",null,null,null,"IPF Divisions"]
[14,1.23,"Foster",null,10,53,43,null,43,1,null,"Alabama","AL",null,88.186204599999996,114,97,22.045999999999999,66,66,10,52,44,10,30,30,null,30,66,30,null,"30-SQ","30-SQ","66-SQ",null,null,"FR-Y1","Raw Women (8-9)",1,null,"FR-SJr","Raw Women (14-18)",1]
[15,1.18,null,null,30.001000000000001,53,43,null,44,2,null,"Alaska","AK",null,97.004604599999993,114,105,66.140204600000004,77,77,44.000999999999998,52,48,30.001000000000001,35,35,null,35,77,35,null,"30-BP","30-BP","66-BP",null,null,"FR-Y2","Raw Women (10-11)",1,null,"FR-Jr","Raw Women (19-23)",1]
[16,1.1299999999999999,null,null,35.000999999999998,53,43,null,47,3,null,"Arizona","AZ",null,105.8230046,114,114,77.1632046,88,88,48.000999999999998,52,52,35.000999999999998,40,40,null,40,88,40,null,"30-DL","30-DL","66-DL",null,null,"FR-Y3","Raw Women (12-13)",1,null,"FR-O","Raw Women",1]
[17,1.08,null,null,40.000999999999998,53,43,null,48,4,null,"Arkansas","AR",null,114.6414046,123,123,88.186204599999996,97,94,52.000999999999998,56,56,40.000999999999998,44,43,null,43,94,43,null,"30-TL","30-TL","66-TL",null,null,"FR-T1","Raw Women (14-15)",1,null,"FR-M1","Raw Women (40-49)",1]
[18,1.06,null,null,43.000999999999998,53,47,null,52,5,null,"California","CA",null,123.4598046,132,132,94.800004599999994,97,103,56.000999999999998,60,60,43.000999999999998,44,47,null,44,97,44,null,"35-SQ","35-SQ","77-SQ",null,null,"FR-T2","Raw Women (16-17)",1,null,"FR-M2","Raw Women (50-59)",1]
[19,1.04,null,null,44.000999999999998,53,47,null,53,6,null,"Colorado","CO",null,132.27820460000001,148,148,97.004604599999993,105,103,60.000999999999998,67.5,67.5,44.000999999999998,48,47,null,47,103,47,null,"35-BP","35-BP","77-BP",null,null,"FR-T3","Raw Women (18-19)",1,null,"FR-M3","Raw Women (60-69)",1]
[20,1.03,null,null,47.000999999999998,53,52,null,56,7,null,"Connecticut","CT",null,148.81270460000002,165,165,103.61840460000001,105,114,67.501000000000005,75,75,47.000999999999998,48,52,null,48,105,48,null,"35-DL","35-DL","77-DL",null,null,"FR-JR","Raw Women (20-23)",1,null,"FR-M4","Raw Women (70+)-",1]
[21,1.02,null,null,48.000999999999998,53,52,null,57,8,null,"Delaware","DE",null,165.34720460000003,181,181,105.8230046,116,114,75.001000000000005,82.5,82.5,48.000999999999998,53,52,null,52,114,52,null,"35-TL","35-TL","77-TL",null,null,"FR-O","Raw Women",1,null,"MR-SJr","Raw Men (14-18)",1]
[22,1.01,null,null,52.000999999999998,53,57,null,59,9,null,"Florida","FL",null,181.88170460000001,198,198,114.6414046,116,125,82.501000000000005,90,90,52.000999999999998,53,57,null,53,116,53,null,"40-SQ","40-SQ","88-SQ",null,null,"FR-M1a","Raw Women (40-44)",1,null,"MR-Jr","Raw Men (19-23)",1]
[23,1,null,null,53.000999999999998,59,57,null,60,10,null,"Georgia","GA",null,198.41620460000001,220,"198+",116.8460046,130,125,90.001000000000005,100,"90+",53.000999999999998,59,57,null,56,123,56,null,"40-BP","40-BP","88-BP",null,null,"FR-M1b","Raw Women (45-49)",1,null,"MR-O","Raw Men",1]
[30,1,null,null,57.000999999999998,59,63,null,63,11,null,"Hawaii","HI",null,220.46220460000004,242,"198+",125.6644046,130,138,100.001,110,"90+",57.000999999999998,59,63,null,57,125,57,null,"40-DL","40-DL","88-DL",null,null,"FR-M2a","Raw Women (50-54)",1,null,"MR-M1","Raw Men (40-49)",1]
[40,1,"McCulloch",null,59.000999999999998,66,63,null,66,12,null,"Idaho","ID",null,242.50820460000003,275,"198+",130.07360460000001,130,138,110.001,125,"90+",59.000999999999998,66,63,null,59,130,59,null,"40-TL","40-TL","88-TL",null,null,"FR-M2b","Raw Women (55-59)",1,null,"MR-M2","Raw Men (50-59)",1]
[41,1.01,null,null,63.000999999999998,66,72,null,67.5,13,null,"Illinois","IL",null,275.57720460000002,"275+","198+",138.89200460000001,145,158,125.001,"125+","90+",63.000999999999998,66,72,null,60,132,60,null,"44-SQ","44-SQ","97-SQ",null,null,"FR-M3a","Raw Women (60-64)",1,null,"MR-M3","Raw Men (60-69)",1]
[42,1.02,null,null,66.001000000000005,74,72,null,72,14,null,"Indiana","IN",null,null,null,null,145.5058046,163,158,null,null,null,66.001000000000005,74,72,null,63,138,63,null,"44-BP","44-BP","97-BP",null,null,"FR-M3b","Raw Women (65-69)",1,null,"MR-M4","Raw Men (70+)-",1]
[43,1.0309999999999999,null,null,72.001000000000005,74,84,null,74,15,null,"Iowa","IA",null,null,null,null,158.73340460000003,163,185,null,null,null,72.001000000000005,74,84,null,66,145,66,null,"44-DL","44-DL","97-DL",null,null,"FR-M4a","Raw Women (70-74)",1,null,"F-SJr"," Women (14 -18)",1]
[44,1.0429999999999999,null,null,74.001000000000005,83,84,null,75,16,null,"Kansas","KS",null,null,null,null,163.14260460000003,183,185,null,null,null,74.001000000000005,83,84,null,67.5,148,67.5,null,"44-TL","44-TL","97-TL",null,null,"FR-M4b","Raw Women (75-79)",1,null,"F-Jr"," Women (19 -23)",1]
[45,1.0549999999999999,null,null,83.001000000000005,93,84,null,82.5,17,null,"Kentucky","KY",null,null,null,null,183.00384600000001,183,185,null,null,null,83.01,93,84,null,72,158,72,null,"48-SQ","48-SQ","105-SQ",null,null,"FR-M5a","Raw Women (80-84)",1,null,"F-O"," Women",1]
[46,1.0680000000000001,null,null,84.001000000000005,93,"84+",null,83,18,null,"Louisiana","LA",null,null,null,null,185.18860460000002,205,"185+",null,null,null,84.001000000000005,93,"84+",null,74,163,74,null,"48-BP","48-BP","105-BP",null,null,"FR-M5b","Raw Women (85-89)",1,null,"F-M1"," Women (40 -49)",1]
[47,1.0820000000000001,null,null,93.001000000000005,105,"84+",null,84,19,null,"Maine","ME",null,null,null,null,205.03000460000001,231,"185+",null,null,null,93.001000000000005,105,"84+",null,75,165,75,null,"48-DL","48-DL","105-DL",null,null,"FR-M6","Raw Women (90+)-",1,null,"F-M2"," Women (50 -59)",1]
[48,1.097,null,null,105.001,120,"84+",null,"84+",20,null,"Maryland","MD",null,null,null,null,231.48520460000003,264,"185+",null,null,null,105.001,120,"84+",null,82.5,181,82.5,null,"48-TL","48-TL","105-TL",null,null,"MR-Y1","Raw Men (8-9)",1,null,"F-M3"," Women (60 -69)",1]
[49,1.113,null,null,120.001,"120+","84+",null,90,21,null,"Massachusetts","MA",null,null,null,null,264.55420460000005,"264+","185+",null,null,null,120.001,"120+","84+",null,83,183,83,null,"53-SQ","53-SQ","116-SQ",null,null,"MR-Y2","Raw Men (10-11)",1,null,"F-M4"," Women (70+) -",1]
[50,1.1299999999999999,null,null,null,null,null,null,"90+",22,null,"Michigan","MI",null,null,null,null,null,null,null,null,null,null,null,null,null,null,84,185,84,null,"53-BP","53-BP","116-BP",null,null,"MR-Y3","Raw Men (12-13)",1,null,"M-SJr"," Men (14 -18)",1]
[51,1.147,null,null,null,null,null,null,93,23,null,"Minnesota","MN",null,null,null,null,null,null,null,null,null,null,null,null,null,null,"84+","185+","84+",null,"53-DL","53-DL","116-DL",null,null,"MR-T1","Raw Men (14-15)",1,null,"M-Jr"," Men (19 -23)",1]
[52,1.165,null,null,null,null,null,null,100,24,null,"Mississippi","MS",null,null,null,null,null,null,null,null,null,null,null,null,null,null,90,198,90,null,"53-TL","53-TL","116-TL",null,null,"MR-T2","Raw Men (16-17)",1,null,"M-O"," Men",1]
[53,1.1839999999999999,null,null,null,null,null,null,105,25,null,"Missouri","MO",null,null,null,null,null,null,null,null,null,null,null,null,null,null,"90+","198+","90+",null,"59-SQ","59-SQ","130-SQ",null,null,"MR-T3","Raw Men (18-19)",1,null,"M-M1"," Men (40 -49)",1]
[54,1.204,null,null,null,null,null,null,110,26,null,"Montana","MT",null,null,null,null,null,null,null,null,null,null,null,null,null,null,93,205,93,null,"59-BP","59-BP","130-BP",null,null,"MR-JR","Raw Men (20-23)",1,null,"M-M2"," Men (50 -59)",1]
[55,1.2250000000000001,null,null,null,null,null,null,120,27,null,"Nebraska","NE",null,null,null,null,null,null,null,null,null,null,null,null,null,null,100,220,100,null,"59-DL","59-DL","130-DL",null,null,"MR-O","Raw Men",1,null,"M-M3"," Men (60 -69)",1]
[56,1.246,null,null,null,null,null,null,"120+",28,null,"Nevada","NV",null,null,null,null,null,null,null,null,null,null,null,null,null,null,105,231,105,null,"59-TL","59-TL","130-TL",null,null,"MR-M1a","Raw Men (40-44)",1,null,"M-M4"," Men (70+) -",1]
[57,1.258,null,null,null,null,null,null,125,29,null,"New Hampshire","NH",null,null,null,null,null,null,null,null,null,null,null,null,null,null,110,242,110,null,"66-SQ","66-SQ","145-SQ",null,null,"MR-M1b","Raw Men (45-49)",1]
[58,1.292,null,null,null,null,null,null,"125+",30,null,"New Jersey","NJ",null,null,null,null,null,null,null,null,null,null,null,null,null,null,120,264,120,null,"66-BP","66-BP","145-BP",null,null,"MR-M2a","Raw Men (50-54)",1]
[59,1.3149999999999999,null,null,null,null,null,null,94,31,null,"New Mexico","NM",null,null,null,null,null,null,null,null,null,null,null,null,null,null,125,275,125,null,"66-DL","66-DL","145-DL",null,null,"MR-M2b","Raw Men (55-59)",1]
[60,1.34,null,null,null,null,null,null,97,32,null,"New York","NY",null,null,null,null,null,null,null,null,null,null,null,null,null,null,"120+","264+","120+",null,"66-TL","66-TL","145-TL",null,null,"MR-M3a","Raw Men (60-64)",1]
[61,1.3660000000000001,null,null,"Age","USAPL Age Div",null,null,103,33,null,"North Carolina","NC",null,null,null,null,null,null,null,null,null,null,null,null,null,null,"125+","275+","125+",null,"74-SQ","74-SQ","163-SQ",null,null,"MR-M3b","Raw Men (65-69)",1]
[62,1.393,null,null,8,"Y1",null,null,105,34,null,"North Dakota","ND",null,null,null,null,null,null,null,null,null,null,null,null,null,null,null,null,null,null,"74-BP","74-BP","163-BP",null,null,"MR-M4a","Raw Men (70-74)",1]
[63,1.421,null,null,10,"Y2",null,null,114,35,null,"Ohio","OH",null,null,null,null,null,null,null,null,null,null,null,null,null,null,null,null,null,null,"74-DL","74-DL","163-DL",null,null,"MR-M4b","Raw Men (75-79)",1]
[64,1.45,null,null,12,"Y3",null,null,116,36,null,"Oklahoma","OK",null,null,null,null,null,null,null,null,null,null,null,null,null,null,null,null,null,null,"74-TL","74-TL","163-TL",null,null,"MR-M5a","Raw Men (80-84)",1]
[65,1.48,null,null,14,"T1",null,null,123,37,null,"Oregon","OR",null,null,null,null,null,null,null,null,null,null,null,null,null,null,null,null,null,null,"83-SQ","83-SQ","183-SQ",null,null,"MR-M5b","Raw Men (85-89)",1]
[66,1.5109999999999999,null,null,16,"T2",null,null,125,38,null,"Pennsylvania","PA",null,null,null,null,null,null,null,null,null,null,null,null,null,null,null,null,null,null,"83-BP","83-BP","183-BP",null,null,"MR-M6","Raw Men (90+)-",1]
[67,1.5429999999999999,null,null,18,"T3",null,null,130,39,null,"Rhode Island","RI",null,null,null,null,null,null,null,null,null,null,null,null,null,null,null,null,null,null,"83-DL","83-DL","183-DL",null,null,"F-T1","Women (14-15)",1]
[68,1.5780000000000001,null,null,20,"Jr",null,null,132,40,null,"South Carolina","SC",null,null,null,null,null,null,null,null,null,null,null,null,null,null,null,null,null,null,"83-TL","83-TL","183-TL",null,null,"F-T2","Women (16-17)",1]
[69,1.61,null,null,24,"O",null,null,138,41,null,"South Dakota","SD",null,null,null,null,null,null,null,null,null,null,null,null,null,null,null,null,null,null,"93-SQ","93-SQ","205-SQ",null,null,"F-T3","Women (18-19)",1]
[70,1.645,null,null,40,"M1a",null,null,145,42,null,"Tennessee","TN",null,null,null,null,null,null,null,null,null,null,null,null,null,null,null,null,null,null,"93-BP","93-BP","205-BP",null,null,"F-JR","Women (20-23)",1]
[71,1.681,null,null,45,"M1b",null,null,148,43,null,"Texas","TX",null,null,null,null,null,null,null,null,null,null,null,null,null,null,null,null,null,null,"93-DL","93-DL","205-DL",null,null,"F-O","Women",1]
[72,1.718,null,null,50,"M2a",null,null,158,44,null,"Utah","UT",null,null,null,null,null,null,null,null,null,null,null,null,null,null,null,null,null,null,"93-TL","93-TL","205-TL",null,null,"F-M1a","Women (40-44)",1]
[73,1.756,null,null,55,"M2b",null,null,163,45,null,"Vermont","VT",null,null,null,null,null,null,null,null,null,null,null,null,null,null,null,null,null,null,"105-SQ","105-SQ","231-SQ",null,null,"F-M1b","Women (45-49)",1]
[74,1.7949999999999999,null,null,60,"M3a",null,null,165,46,null,"Virginia","VA",null,null,null,null,null,null,null,null,null,null,null,null,null,null,null,null,null,null,"105-BP","105-BP","231-BP",null,null,"F-M2a","Women (50-54)",1]
[75,1.835,null,null,65,"M3b",null,null,181,47,null,"Washington","WA",null,null,null,null,null,null,null,null,null,null,null,null,null,null,null,null,null,null,"105-DL","105-DL","231-DL",null,null,"F-M2b","Women (55-59)",1]
[76,1.8759999999999999,null,null,70,"M4a",null,null,182,48,null,"West Virginia","WV",null,null,null,null,null,null,null,null,null,null,null,null,null,null,null,null,null,null,"105-TL","105-TL","231-TL",null,null,"F-M3a","Women (60-64)",1]
[77,1.9179999999999999,null,null,75,"M4b",null,null,185,49,null,"Wisconsin","WI",null,null,null,null,null,null,null,null,null,null,null,null,null,null,null,null,null,null,"120-SQ","120-SQ","264-SQ",null,null,"F-M3b","Women (65-69)",1]
[78,1.9610000000000001,null,null,80,"M5a",null,null,"185+",50,null,"Wyoming","WY",null,null,null,null,null,null,null,null,null,null,null,null,null,null,null,null,null,null,"120-BP","120-BP","264-BP",null,null,"F-M4a","Women (70-74)",1]
[79,2.0049999999999999,null,null,85,"M5b","",null,198,51,null,"American Samoa","AS",null,null,null,null,null,null,null,null,null,null,null,null,null,null,null,null,null,null,"120-DL","120-DL","264-DL",null,null,"F-M4b","Women (75-79)",1]
[80,2.0499999999999998,null,null,90,"M6","",null,"198+",52,null,"District of Columbia","DC",null,null,null,null,null,null,null,null,null,null,null,null,null,null,null,null,null,null,"120-TL","120-TL","264-TL",null,null,"F-M5a","Women (80-84)",1]
[81,2.0960000000000001,null,null,null,null,"",null,205,53,null,"Federated States of Micronesia","FM",null,null,null,null,null,null,null,null,null,null,null,null,null,null,null,null,null,null,"120+-SQ","120+-SQ","264+-SQ",null,null,"F-M5b","Women (85-89)",1]
[82,2.1429999999999998,null,null,null,null,"",null,220,54,null,"Guam","GU",null,null,null,null,null,null,null,null,null,null,null,null,null,null,null,null,null,null,"120+-BP","120+-BP","264+-BP",null,null,"F-M6","Women (90+)-",1]
[83,2.19,null,null,null,null,"",null,231,55,null,"Marshall Islands","MH",null,null,null,null,null,null,null,null,null,null,null,null,null,null,null,null,null,null,"120+-DL","120+-DL","264+-DL",null,null,"M-T1","Men (14-15)",1]
[84,2.238,null,null,null,null,"",null,242,56,null,"Northern Mariana Islands","MP",null,null,null,null,null,null,null,null,null,null,null,null,null,null,null,null,null,null,"120+-TL","120+-TL","264+-TL",null,null,"M-T2","Men (16-17)",1]
[85,2.2869999999999999,null,null,null,null,"",null,264,57,null,"Palau","PW",null,null,null,null,null,null,null,null,null,null,null,null,null,null,null,null,null,null,"30-BPO","30-BPO","66-BPO",null,null,"M-T3","Men (18-19)",1]
[86,2.3370000000000002,null,null,null,null,"",null,"264+",58,null,"Puerto Rico","PR",null,null,null,null,null,null,null,null,null,null,null,null,null,null,null,null,null,null,"35-BPO","35-BPO","77-BPO",null,null,"M-JR","Men (20-23)",1]
[87,2.3879999999999999,null,null,null,null,"",null,275,59,null,"Virgin Islands","VI",null,null,null,null,null,null,null,null,null,null,null,null,null,null,null,null,null,null,"40-BPO","40-BPO","88-BPO",null,null,"M-O","Men",1]
[88,2.44,null,null,null,null,"",null,"275+",60,null,null,"OOS",null,null,null,null,null,null,null,null,null,null,null,null,null,null,null,null,null,null,"44-BPO","44-BPO","97-BPO",null,null,"M-M1a","Men (40-44)",1]
[89,2.4940000000000002,null,null,null,null,null,null,null,null,null,null,null,null,null,null,null,null,null,null,null,null,null,null,null,null,null,null,null,null,null,"48-BPO","48-BPO","105-BPO",null,null,"M-M1b","Men (45-49)",1]
[90,2.5489999999999999,null,null,null,null,null,null,null,null,null,null,null,null,null,null,null,null,null,null,null,null,null,null,null,null,null,null,null,null,null,"53-BPO","53-BPO","116-BPO",null,null,"M-M2a","Men (50-54)",1]
[null,null,null,null,null,null,null,null,null,null,null,null,null,null,null,null,null,null,null,null,null,null,null,null,null,null,null,null,null,null,null,"59-BPO","59-BPO","130-BPO",null,null,"M-M2b","Men (55-59)",1]
[null,null,null,null,null,null,null,null,null,null,null,null,null,null,null,null,null,null,null,null,null,null,null,null,null,null,null,null,null,null,null,"66-BPO","66-BPO","145-BPO",null,null,"M-M3a","Men (60-64)",1]
[null,null,null,null,null,null,null,null,null,null,null,null,null,null,null,null,null,null,null,null,null,null,null,null,null,null,null,null,null,null,null,"74-BPO","74-BPO","163-BPO",null,null,"M-M3b","Men (65-69)",1]
[null,null,null,null,null,null,null,null,null,null,null,null,null,null,null,null,null,null,null,null,null,null,null,null,null,null,null,null,null,null,null,"83-BPO","83-BPO","183-BPO",null,null,"M-M4a","Men (70-74)",1]
[null,null,null,null,null,null,null,null,null,null,null,null,null,null,null,null,null,null,null,null,null,null,null,null,null,null,null,null,null,null,null,"93-BPO","93-BPO","205-BPO",null,null,"M-M4b","Men (75-79)",1]
[null,null,null,null,null,null,null,null,null,null,null,null,null,null,null,null,null,null,null,null,null,null,null,null,null,null,null,null,null,null,null,"105-BPO","105-BPO","231-BPO",null,null,"M-M5a","Men (80-84)",1]
[null,null,null,null,null,null,null,null,null,null,null,null,null,null,null,null,null,null,null,null,null,null,null,null,null,null,null,null,null,null,null,"120-BPO","120-BPO","264-BPO",null,null,"M-M5b","Men (85-89)",1]
[null,null,null,null,null,null,null,null,null,null,null,null,null,null,null,null,null,null,null,null,null,null,null,null,null,null,null,null,null,null,null,"120+-BPO","120+-BPO","264+-BPO",null,null,"M-M6","Men (90+)-",1]
[null,null,null,null,null,null,null,null,null,null,null,null,null,null,null,null,null,null,null,null,null,null,null,null,null,null,null,null,null,null,null,"30-DLO","30-DLO","66-DLO"]
[null,null,null,null,null,null,null,null,null,null,null,null,null,null,null,null,null,null,null,null,null,null,null,null,null,null,null,null,null,null,null,"35-DLO","35-DLO","77-DLO"]
[null,null,null,null,null,null,null,null,null,null,null,null,null,null,null,null,null,null,null,null,null,null,null,null,null,null,null,null,null,null,null,"40-DLO","40-DLO","88-DLO"]
[null,null,null,null,null,null,null,null,null,null,null,null,null,null,null,null,null,null,null,null,null,null,null,null,null,null,null,null,null,null,null,"44-DLO","44-DLO","97-DLO"]
[null,null,null,null,null,null,null,null,null,null,null,null,null,null,null,null,null,null,null,null,null,null,null,null,null,null,null,null,null,null,null,"48-DLO","48-DLO","105-DLO"]
[null,null,null,null,null,null,null,null,null,null,null,null,null,null,null,null,null,null,null,null,null,null,null,null,null,null,null,null,null,null,null,"53-DLO","53-DLO","116-DLO"]
[null,null,null,null,null,null,null,null,null,null,null,null,null,null,null,null,null,null,null,null,null,null,null,null,null,null,null,null,null,null,null,"59-DLO","59-DLO","130-DLO"]
[null,null,null,null,null,null,null,null,null,null,null,null,null,null,null,null,null,null,null,null,null,null,null,null,null,null,null,null,null,null,null,"66-DLO","66-DLO","145-DLO"]
[null,null,null,null,null,null,null,null,null,null,null,null,null,null,null,null,null,null,null,null,null,null,null,null,null,null,null,null,null,null,null,"74-DLO","74-DLO","163-DLO"]
[null,null,null,null,null,null,null,null,null,null,null,null,null,null,null,null,null,null,null,null,null,null,null,null,null,null,null,null,null,null,null,"83-DLO","83-DLO","183-DLO"]
[null,null,null,null,null,null,null,null,null,null,null,null,null,null,null,null,null,null,null,null,null,null,null,null,null,null,null,null,null,null,null,"93-DLO","93-DLO","205-DLO"]
[null,null,null,null,null,null,null,null,null,null,null,null,null,null,null,null,null,null,null,null,null,null,null,null,null,null,null,null,null,null,null,"105-DLO","105-DLO","231-DLO"]
[null,null,null,null,null,null,null,null,null,null,null,null,null,null,null,null,null,null,null,null,null,null,null,null,null,null,null,null,null,null,null,"120-DLO","120-DLO","264-DLO"]
[null,null,null,null,null,null,null,null,null,null,null,null,null,null,null,null,null,null,null,null,null,null,null,null,null,null,null,null,null,null,null,"120+-DLO","120+-DLO","264+-DLO"]
[null,null,null,null,null,null,null,null,null,null,null,null,null,null,null,null,null,null,null,null,null,null,null,null,null,null,null,null,null,null,null,"30-SQ","30-SQ","66-SQ"]
[null,null,null,null,null,null,null,null,null,null,null,null,null,null,null,null,null,null,null,null,null,null,null,null,null,null,null,null,null,null,null,"30-BP","30-BP","66-BP"]
[null,null,null,null,null,null,null,null,null,null,null,null,null,null,null,null,null,null,null,null,null,null,null,null,null,null,null,null,null,null,null,"30-DL","30-DL","66-DL"]
[null,null,null,null,null,null,null,null,null,null,null,null,null,null,null,null,null,null,null,null,null,null,null,null,null,null,null,null,null,null,null,"30-TL","30-TL","66-TL"]
[null,null,null,null,null,null,null,null,null,null,null,null,null,null,null,null,null,null,null,null,null,null,null,null,null,null,null,null,null,null,null,"35-SQ","35-SQ","77-SQ"]
[null,null,null,null,null,null,null,null,null,null,null,null,null,null,null,null,null,null,null,null,null,null,null,null,null,null,null,null,null,null,null,"35-BP","35-BP","77-BP"]
[null,null,null,null,null,null,null,null,null,null,null,null,null,null,null,null,null,null,null,null,null,null,null,null,null,null,null,null,null,null,null,"35-DL","35-DL","77-DL"]
[null,null,null,null,null,null,null,null,null,null,null,null,null,null,null,null,null,null,null,null,null,null,null,null,null,null,null,null,null,null,null,"35-TL","35-TL","77-TL"]
[null,null,null,null,null,null,null,null,null,null,null,null,null,null,null,null,null,null,null,null,null,null,null,null,null,null,null,null,null,null,null,"40-SQ","40-SQ","88-SQ"]
[null,null,null,null,null,null,null,null,null,null,null,null,null,null,null,null,null,null,null,null,null,null,null,null,null,null,null,null,null,null,null,"40-BP","40-BP","88-BP"]
[null,null,null,null,null,null,null,null,null,null,null,null,null,null,null,null,null,null,null,null,null,null,null,null,null,null,null,null,null,null,null,"40-DL","40-DL","88-DL"]
[null,null,null,null,null,null,null,null,null,null,null,null,null,null,null,null,null,null,null,null,null,null,null,null,null,null,null,null,null,null,null,"40-TL","40-TL","88-TL"]
[null,null,null,null,null,null,null,null,null,null,null,null,null,null,null,null,null,null,null,null,null,null,null,null,null,null,null,null,null,null,null,"43-SQ","43-SQ","94-SQ"]
[null,null,null,null,null,null,null,null,null,null,null,null,null,null,null,null,null,null,null,null,null,null,null,null,null,null,null,null,null,null,null,"43-BP","43-BP","94-BP"]
[null,null,null,null,null,null,null,null,null,null,null,null,null,null,null,null,null,null,null,null,null,null,null,null,null,null,null,null,null,null,null,"43-DL","43-DL","94-DL"]
[null,null,null,null,null,null,null,null,null,null,null,null,null,null,null,null,null,null,null,null,null,null,null,null,null,null,null,null,null,null,null,"43-TL","43-TL","94-TL"]
[null,null,null,null,null,null,null,null,null,null,null,null,null,null,null,null,null,null,null,null,null,null,null,null,null,null,null,null,null,null,null,"47-SQ","47-SQ","103-SQ"]
[null,null,null,null,null,null,null,null,null,null,null,null,null,null,null,null,null,null,null,null,null,null,null,null,null,null,null,null,null,null,null,"47-BP","47-BP","103-BP"]
[null,null,null,null,null,null,null,null,null,null,null,null,null,null,null,null,null,null,null,null,null,null,null,null,null,null,null,null,null,null,null,"47-DL","47-DL","103-DL"]
[null,null,null,null,null,null,null,null,null,null,null,null,null,null,null,null,null,null,null,null,null,null,null,null,null,null,null,null,null,null,null,"47-TL","47-TL","103-TL"]
[null,null,null,null,null,null,null,null,null,null,null,null,null,null,null,null,null,null,null,null,null,null,null,null,null,null,null,null,null,null,null,"52-SQ","52-SQ","114-SQ"]
[null,null,null,null,null,null,null,null,null,null,null,null,null,null,null,null,null,null,null,null,null,null,null,null,null,null,null,null,null,null,null,"52-BP","52-BP","114-BP"]
[null,null,null,null,null,null,null,null,null,null,null,null,null,null,null,null,null,null,null,null,null,null,null,null,null,null,null,null,null,null,null,"52-DL","52-DL","114-DL"]
[null,null,null,null,null,null,null,null,null,null,null,null,null,null,null,null,null,null,null,null,null,null,null,null,null,null,null,null,null,null,null,"52-TL","52-TL","114-TL"]
[null,null,null,null,null,null,null,null,null,null,null,null,null,null,null,null,null,null,null,null,null,null,null,null,null,null,null,null,null,null,null,"57-SQ","57-SQ","125-SQ"]
[null,null,null,null,null,null,null,null,null,null,null,null,null,null,null,null,null,null,null,null,null,null,null,null,null,null,null,null,null,null,null,"57-BP","57-BP","125-BP"]
[null,null,null,null,null,null,null,null,null,null,null,null,null,null,null,null,null,null,null,null,null,null,null,null,null,null,null,null,null,null,null,"57-DL","57-DL","125-DL"]
[null,null,null,null,null,null,null,null,null,null,null,null,null,null,null,null,null,null,null,null,null,null,null,null,null,null,null,null,null,null,null,"57-TL","57-TL","125-TL"]
[null,null,null,null,null,null,null,null,null,null,null,null,null,null,null,null,null,null,null,null,null,null,null,null,null,null,null,null,null,null,null,"63-SQ","63-SQ","138-SQ"]
[null,null,null,null,null,null,null,null,null,null,null,null,null,null,null,null,null,null,null,null,null,null,null,null,null,null,null,null,null,null,null,"63-BP","63-BP","138-BP"]
[null,null,null,null,null,null,null,null,null,null,null,null,null,null,null,null,null,null,null,null,null,null,null,null,null,null,null,null,null,null,null,"63-DL","63-DL","138-DL"]
[null,null,null,null,null,null,null,null,null,null,null,null,null,null,null,null,null,null,null,null,null,null,null,null,null,null,null,null,null,null,null,"63-TL","63-TL","138-TL"]
[null,null,null,null,null,null,null,null,null,null,null,null,null,null,null,null,null,null,null,null,null,null,null,null,null,null,null,null,null,null,null,"72-SQ","72-SQ","158-SQ"]
[null,null,null,null,null,null,null,null,null,null,null,null,null,null,null,null,null,null,null,null,null,null,null,null,null,null,null,null,null,null,null,"72-BP","72-BP","158-BP"]
[null,null,null,null,null,null,null,null,null,null,null,null,null,null,null,null,null,null,null,null,null,null,null,null,null,null,null,null,null,null,null,"72-DL","72-DL","158-DL"]
[null,null,null,null,null,null,null,null,null,null,null,null,null,null,null,null,null,null,null,null,null,null,null,null,null,null,null,null,null,null,null,"72-TL","72-TL","158-TL"]
[null,null,null,null,null,null,null,null,null,null,null,null,null,null,null,null,null,null,null,null,null,null,null,null,null,null,null,null,null,null,null,"84-SQ","84-SQ","185-SQ"]
[null,null,null,null,null,null,null,null,null,null,null,null,null,null,null,null,null,null,null,null,null,null,null,null,null,null,null,null,null,null,null,"84-BP","84-BP","185-BP"]
[null,null,null,null,null,null,null,null,null,null,null,null,null,null,null,null,null,null,null,null,null,null,null,null,null,null,null,null,null,null,null,"84-DL","84-DL","185-DL"]
[null,null,null,null,null,null,null,null,null,null,null,null,null,null,null,null,null,null,null,null,null,null,null,null,null,null,null,null,null,null,null,"84-TL","84-TL","185-TL"]
[null,null,null,null,null,null,null,null,null,null,null,null,null,null,null,null,null,null,null,null,null,null,null,null,null,null,null,null,null,null,null,"84+-SQ","84+-SQ","185+-SQ"]
[null,null,null,null,null,null,null,null,null,null,null,null,null,null,null,null,null,null,null,null,null,null,null,null,null,null,null,null,null,null,null,"84+-BP","84+-BP","185+-BP"]
[null,null,null,null,null,null,null,null,null,null,null,null,null,null,null,null,null,null,null,null,null,null,null,null,null,null,null,null,null,null,null,"84+-DL","84+-DL","185+-DL"]
[null,null,null,null,null,null,null,null,null,null,null,null,null,null,null,null,null,null,null,null,null,null,null,null,null,null,null,null,null,null,null,"84+-TL","84+-TL","185+-TL"]
[null,null,null,null,null,null,null,null,null,null,null,null,null,null,null,null,null,null,null,null,null,null,null,null,null,null,null,null,null,null,null,"30-BPO","30-BPO","66-BPO"]
[null,null,null,null,null,null,null,null,null,null,null,null,null,null,null,null,null,null,null,null,null,null,null,null,null,null,null,null,null,null,null,"35-BPO","35-BPO","77-BPO"]
[null,null,null,null,null,null,null,null,null,null,null,null,null,null,null,null,null,null,null,null,null,null,null,null,null,null,null,null,null,null,null,"40-BPO","40-BPO","88-BPO"]
[null,null,null,null,null,null,null,null,null,null,null,null,null,null,null,null,null,null,null,null,null,null,null,null,null,null,null,null,null,null,null,"43-BPO","43-BPO","94-BPO"]
[null,null,null,null,null,null,null,null,null,null,null,null,null,null,null,null,null,null,null,null,null,null,null,null,null,null,null,null,null,null,null,"47-BPO","47-BPO","103-BPO"]
[null,null,null,null,null,null,null,null,null,null,null,null,null,null,null,null,null,null,null,null,null,null,null,null,null,null,null,null,null,null,null,"52-BPO","52-BPO","114-BPO"]
[null,null,null,null,null,null,null,null,null,null,null,null,null,null,null,null,null,null,null,null,null,null,null,null,null,null,null,null,null,null,null,"57-BPO","57-BPO","125-BPO"]
[null,null,null,null,null,null,null,null,null,null,null,null,null,null,null,null,null,null,null,null,null,null,null,null,null,null,null,null,null,null,null,"63-BPO","63-BPO","138-BPO"]
[null,null,null,null,null,null,null,null,null,null,null,null,null,null,null,null,null,null,null,null,null,null,null,null,null,null,null,null,null,null,null,"72-BPO","72-BPO","158-BPO"]
[null,null,null,null,null,null,null,null,null,null,null,null,null,null,null,null,null,null,null,null,null,null,null,null,null,null,null,null,null,null,null,"84-BPO","84-BPO","185-BPO"]
[null,null,null,null,null,null,null,null,null,null,null,null,null,null,null,null,null,null,null,null,null,null,null,null,null,null,null,null,null,null,null,"84+-BPO","84+-BPO","185+-BPO"]
[null,null,null,null,null,null,null,null,null,null,null,null,null,null,null,null,null,null,null,null,null,null,null,null,null,null,null,null,null,null,null,"30-DLO","30-DLO","66-DLO"]
[null,null,null,null,null,null,null,null,null,null,null,null,null,null,null,null,null,null,null,null,null,null,null,null,null,null,null,null,null,null,null,"35-DLO","35-DLO","77-DLO"]
[null,null,null,null,null,null,null,null,null,null,null,null,null,null,null,null,null,null,null,null,null,null,null,null,null,null,null,null,null,null,null,"40-DLO","40-DLO","88-DLO"]
[null,null,null,null,null,null,null,null,null,null,null,null,null,null,null,null,null,null,null,null,null,null,null,null,null,null,null,null,null,null,null,"43-DLO","43-DLO","94-DLO"]
[null,null,null,null,null,null,null,null,null,null,null,null,null,null,null,null,null,null,null,null,null,null,null,null,null,null,null,null,null,null,null,"47-DLO","47-DLO","103-DLO"]
[null,null,null,null,null,null,null,null,null,null,null,null,null,null,null,null,null,null,null,null,null,null,null,null,null,null,null,null,null,null,null,"52-DLO","52-DLO","114-DLO"]
[null,null,null,null,null,null,null,null,null,null,null,null,null,null,null,null,null,null,null,null,null,null,null,null,null,null,null,null,null,null,null,"57-DLO","57-DLO","125-DLO"]
[null,null,null,null,null,null,null,null,null,null,null,null,null,null,null,null,null,null,null,null,null,null,null,null,null,null,null,null,null,null,null,"63-DLO","63-DLO","138-DLO"]
[null,null,null,null,null,null,null,null,null,null,null,null,null,null,null,null,null,null,null,null,null,null,null,null,null,null,null,null,null,null,null,"72-DLO","72-DLO","158-DLO"]
[null,null,null,null,null,null,null,null,null,null,null,null,null,null,null,null,null,null,null,null,null,null,null,null,null,null,null,null,null,null,null,"84-DLO","84-DLO","185-DLO"]
[null,null,null,null,null,null,null,null,null,null,null,null,null,null,null,null,null,null,null,null,null,null,null,null,null,null,null,null,null,null,null,"84+-DLO","84+-DLO","185+-DLO"]

{"sheet":"Weigh-In","index":3,"n_rows":433,"n_cols":64,"rows_kept":433,"cut":false,"hidden":false,"merged":[]}
[null,null,null,"都道府県と団体名の間に、半角スペース","Fが女子　　　Ｍが男子　　　　-Uがクラシック","Oが一般　　Ｐがオープン",null,null,null,null,null,null,null,"PLを必ず入れる",null,null,null,null,null,null,null,null,null,null,null,10]
["グループ","選手名",null,"都道府県 団体名","M/F-Div","検量体重","lot#","生年","SQ　　ラック",{"$f":"CONCATENATE(\"SQ-1 (\",T2,\")\")","v":"SQ-1 (Kg)"},"BP 　ラック",{"$f":"CONCATENATE(\"BP-1 (\",T2,\")\")","v":"BP-1 (Kg)"},{"$f":"CONCATENATE(\"DL-1 (\",T2,\")\")","v":"DL-1 (Kg)"},"選択して　　ＰＬ","State","Print Card","Nominated Wt Class",null,null,{"$f":"Setup!G15","v":"Kg"},{"$f":"COUNTA(F:F)+1","v":3},{"$f":"CONCATENATE(\"Setup!I6:I\",COUNTA(Setup!I:I)+3)","v":"Setup!I6:I37"},{"$f":"CONCATENATE(\"Setup!M6:M\",COUNTA(Setup!M:M)+3)","v":"Setup!M6:M5"},{"$f":"CONCATENATE(\"Setup!Q5:Q\",COUNTA(Setup!Q:Q)+4)","v":"Setup!Q5:Q14"},{"$f":"CONCATENATE(\"DATA!$M$2:$M$61\")","v":"DATA!$M$2:$M$61"},5,{"$f":"COUNTA(F:F)+1","v":3},null,null,null,null,null,null,null,null,null,null,null,null,"flight sort data","att sort data",null,null,null,null,null,null,null,null,null,"SQ-1","SQ-2","SQ-3","Best SQ Att","BP rack","BP-1","BP-2","BP-3","Best BP Att","Sub Total","DL-1","DL-2","DL-3","Best DL Att"]
[null,null,null," ","-"]
[null,null,null," ","-"]
[null,null,null," ","-"]
[null,null,null," ","-"]
[null,null,null," ","-"]
[null,null,null," ","-"]
[null,null,null," ","-"]
[null,null,null," ","-"]
[null,null,null," ","-"]
[null,null,null," ","-"]
[null,null,null," ","-"]
[null,null,null," ","-"]
[null,null,null," ","-"]
[null,null,null," ","-"]
[null,null,null," ","-"]
[null,null,null," ","-"]
[null,null,null," ","-"]
[null,null,null," ","-"]
[null,null,null," ","-"]
[null,null,null," ","-"]
[null,null,null," ","-"]
[null,null,null," ","-"]
[null,null,null," ","-"]
[null,null,null," ","-"]
[null,null,null," ","-"]
[null,null,null," ","-"]
[null,null,null," ","-"]
[null,null,null," ","-"]
[null,null,null," ","-"]
[null,null,null," ","-"]
[null,null,null," ","-"]
[null,null,null," ","-"]
[null,null,null," ","-"]
[null,null,null," ","-"]
[null,null,null," ","-"]
[null,null,null," ","-"]
[null,null,null," ","-"]
[null,null,null," ","-"]
[null,null,null," ","-"]
[null,null,null," ","-"]
[null,null,null," ","-"]
[null,null,null," ","-"]
[null,null,null," ","-"]
[null,null,null," ","-"]
[null,null,null," ","-"]
[null,null,null," ","-"]
[null,null,null," ","-"]
[null,null,null," ","-"]
[null,null,null," ","-"]
[null,null,null," ","-"]
[null,null,null," ","-"]
[null,null,null," ","-"]
[null,null,null," ","-"]
[null,null,null," ","-"]
[null,null,null," ","-"]
[null,null,null," ","-"]
[null,null,null," ","-"]
[null,null,null," ","-"]
[null,null,null," ","-"]
[null,null,null," ","-"]
[null,null,null," ","-"]
[null,null,null," ","-"]
[null,null,null," ","-"]
[null,null,null," ","-"]
[null,null,null," ","-"]
[null,null,null," ","-"]
[null,null,null," ","-"]
[null,null,null," ","-"]
[null,null,null," ","-"]
[null,null,null," ","-"]
[null,null,null," ","-"]
[null,null,null," ","-"]
[null,null,null," ","-"]
[null,null,null," ","-"]
[null,null,null," ","-"]
[null,null,null," ","-"]
[null,null,null," ","-"]
[null,null,null," ","-"]
[null,null,null," ","-"]
[null,null,null," ","-"]
[null,null,null," ","-"]
[null,null,null," ","-"]
[null,null,null," ","-"]
[null,null,null," ","-"]
[null,null,null," ","-"]
[null,null,null," ","-"]
[null,null,null," ","-"]
[null,null,null," ","-"]
[null,null,null," ","-"]
[null,null,null," ","-"]
[null,null,null," ","-"]
[null,null,null," ","-"]
[null,null,null," ","-"]
[null,null,null," ","-"]
[null,null,null," ","-"]
[null,null,null," ","-"]
[null,null,null," ","-"]
[null,null,null," ","-"]
[null,null,null," ","-"]
[null,null,null," ","-"]
[null,null,null," ","-"]
[null,null,null," ","-"]
[null,null,null," ","-"]
[null,null,null," ","-"]
[null,null,null," ","-"]
[null,null,null," ","-"]
[null,null,null," ","-"]
[null,null,null," ","-"]
[null,null,null," ","-"]
[null,null,null," ","-"]
[null,null,null," ","-"]
[null,null,null," ","-"]
[null,null,null," ","-"]
[null,null,null," ","-"]
[null,null,null," ","-"]
[null,null,null," ","-"]
[null,null,null," ","-"]
[null,null,null," ","-"]
[null,null,null," ","-"]
[null,null,null," ","-"]
[null,null,null," ","-"]
[null,null,null," ","-"]
[null,null,null," ","-"]
[null,null,null," ","-"]
[null,null,null," ","-"]
[null,null,null," ","-"]
[null,null,null," ","-"]
[null,null,null," ","-"]
[null,null,null," ","-"]
[null,null,null," ","-"]
[null,null,null," ","-"]
[null,null,null," ","-"]
[null,null,null," ","-"]
[null,null,null," ","-"]
[null,null,null," ","-"]
[null,null,null," ","-"]
[null,null,null," ","-"]
[null,null,null," ","-"]
[null,null,null," ","-"]
[null,null,null," ","-"]
[null,null,null," ","-"]
[null,null,null," ","-"]
[null,null,null," ","-"]
[null,null,null," ","-"]
[null,null,null," ","-"]
[null,null,null," ","-"]
[null,null,null," ","-"]
[null,null,null," ","-"]
[null,null,null," ","-"]
[null,null,null," ","-"]
[null,null,null," ","-"]
[null,null,null," ","-"]
[null,null,null," ","-"]
[null,null,null," ","-"]
[null,null,null," ","-"]
[null,null,null," ","-"]
[null,null,null," ","-"]
[null,null,null," ","-"]
[null,null,null," ","-"]
[null,null,null," ","-"]
[null,null,null," ","-"]
[null,null,null," ","-"]
[null,null,null," ","-"]
[null,null,null," ","-"]
[null,null,null," ","-"]
[null,null,null," ","-"]
[null,null,null," ","-"]
[null,null,null," ","-"]
[null,null,null," ","-"]
[null,null,null," ","-"]
[null,null,null," ","-"]
[null,null,null," ","-"]
[null,null,null," ","-"]
[null,null,null," ","-"]
[null,null,null," ","-"]
[null,null,null," ","-"]
[null,null,null," ","-"]
[null,null,null," ","-"]
[null,null,null," ","-"]
[null,null,null," ","-"]
[null,null,null," ","-"]
[null,null,null," ","-"]
[null,null,null," ","-"]
[null,null,null," ","-"]
[null,null,null," ","-"]
[null,null,null," ","-"]
[null,null,null," ","-"]
[null,null,null," ","-"]
[null,null,null," ","-"]
[null,null,null," ","-"]
[null,null,null," ","-"]
[null,null,null," ","-"]
[null,null,null," ","-"]
[null,null,null," ","-"]
[null,null,null," ","-"]
[null,null,null," ","-"]
[null,null,null," ","-"]
[null,null,null," ","-"]
[null,null,null," ","-"]
[null,null,null," ","-"]
[null,null,null," ","-"]
[null,null,null," ","-"]
[null,null,null," ","-"]
[null,null,null," ","-"]
[null,null,null," ","-"]
[null,null,null," ","-"]
[null,null,null," ","-"]
[null,null,null," ","-"]
[null,null,null," ","-"]
[null,null,null," ","-"]
[null,null,null," ","-"]
[null,null,null," ","-"]
[null,null,null," ","-"]
[null,null,null," ","-"]
[null,null,null," ","-"]
[null,null,null," ","-"]
[null,null,null," ","-"]
[null,null,null," ","-"]
[null,null,null," ","-"]
[null,null,null," ","-"]
[null,null,null," ","-"]
[null,null,null," ","-"]
[null,null,null," ","-"]
[null,null,null," ","-"]
[null,null,null," ","-"]
[null,null,null," ","-"]
[null,null,null," ","-"]
[null,null,null," ","-"]
[null,null,null," ","-"]
[null,null,null," ","-"]
[null,null,null," ","-"]
[null,null,null," ","-"]
[null,null,null," ","-"]
[null,null,null," ","-"]
[null,null,null," ","-"]
[null,null,null," ","-"]
[null,null,null," ","-"]
[null,null,null," ","-"]
[null,null,null," ","-"]
[null,null,null," ","-"]
[null,null,null," ","-"]
[null,null,null," ","-"]
[null,null,null," ","-"]
[null,null,null," ","-"]
[null,null,null," ","-"]
[null,null,null," ","-"]
[null,null,null," ","-"]
[null,null,null," ","-"]
[null,null,null," ","-"]
[null,null,null," ","-"]
[null,null,null," ","-"]
[null,null,null," ","-"]
[null,null,null," ","-"]
[null,null,null," ","-"]
[null,null,null," ","-"]
[null,null,null," ","-"]
[null,null,null," ","-"]
[null,null,null," ","-"]
[null,null,null," ","-"]
[null,null,null," ","-"]
[null,null,null," ","-"]
[null,null,null," ","-"]
[null,null,null," ","-"]
[null,null,null," ","-"]
[null,null,null," ","-"]
[null,null,null," ","-"]
[null,null,null," ","-"]
[null,null,null," ","-"]
[null,null,null," ","-"]
[null,null,null," ","-"]
[null,null,null," ","-"]
[null,null,null," ","-"]
[null,null,null," ","-"]
[null,null,null," ","-"]
[null,null,null," ","-"]
[null,null,null," ","-"]
[null,null,null," ","-"]
[null,null,null," ","-"]
[null,null,null," ","-"]
[null,null,null," ","-"]
[null,null,null," ","-"]
[null,null,null," ","-"]
[null,null,null," ","-"]
[null,null,null," ","-"]
[null,null,null," ","-"]
[null,null,null," ","-"]
[null,null,null," ","-"]
[null,null,null," ","-"]
[null,null,null," ","-"]
[null,null,null," ","-"]
[null,null,null," ","-"]
[null,null,null," ","-"]
[null,null,null," ","-"]
[null,null,null," ","-"]
[null,null,null," ","-"]
[null,null,null," ","-"]
[null,null,null," ","-"]
[null,null,null," ","-"]
[null,null,null," ","-"]
[null,null,null," ","-"]
[null,null,null," ","-"]
[null,null,null," ","-"]
[null,null,null," ","-"]
[null,null,null," ","-"]
[null,null,null," ","-"]
[null,null,null," ","-"]
[null,null,null," ","-"]
[null,null,null," ","-"]
[null,null,null," ","-"]
[null,null,null," ","-"]
[null,null,null," ","-"]
[null,null,null," ","-"]
[null,null,null," ","-"]
[null,null,null," ","-"]
[null,null,null," ","-"]
[null,null,null," ","-"]
[null,null,null," ","-"]
[null,null,null," ","-"]
[null,null,null," ","-"]
[null,null,null," ","-"]
[null,null,null," ","-"]
[null,null,null," ","-"]
[null,null,null," ","-"]
[null,null,null," ","-"]
[null,null,null," ","-"]
[null,null,null," ","-"]
[null,null,null," ","-"]
[null,null,null," ","-"]
[null,null,null," ","-"]
[null,null,null," ","-"]
[null,null,null," ","-"]
[null,null,null," ","-"]
[null,null,null," ","-"]
[null,null,null," ","-"]
[null,null,null," ","-"]
[null,null,null," ","-"]
[null,null,null," ","-"]
[null,null,null," ","-"]
[null,null,null," ","-"]
[null,null,null," ","-"]
[null,null,null," ","-"]
[null,null,null," ","-"]
[null,null,null," ","-"]
[null,null,null," ","-"]
[null,null,null," ","-"]
[null,null,null," ","-"]
[null,null,null," ","-"]
[null,null,null," ","-"]
[null,null,null," ","-"]
[null,null,null," ","-"]
[null,null,null," ","-"]
[null,null,null," ","-"]
[null,null,null," ","-"]
[null,null,null," ","-"]
[null,null,null," ","-"]
[null,null,null," ","-"]
[null,null,null," ","-"]
[null,null,null," ","-"]
[null,null,null," ","-"]
[null,null,null," ","-"]
[null,null,null," ","-"]
[null,null,null," ","-"]
[null,null,null," ","-"]
[null,null,null," ","-"]
[null,null,null," ","-"]
[null,null,null," ","-"]
[null,null,null," ","-"]
[null,null,null," ","-"]
[null,null,null," ","-"]
[null,null,null," ","-"]
[null,null,null," ","-"]
[null,null,null," ","-"]
[null,null,null," ","-"]
[null,null,null," ","-"]
[null,null,null," ","-"]
[null,null,null," ","-"]
[null,null,null," ","-"]
[null,null,null," ","-"]
[null,null,null," ","-"]
[null,null,null," ","-"]
[null,null,null," ","-"]
[null,null,null," ","-"]
[null,null,null," ","-"]
[null,null,null," ","-"]
[null,null,null," ","-"]
[null,null,null," ","-"]
[null,null,null," ","-"]
[null,null,null," ","-"]
[null,null,null," ","-"]
[null,null,null," ","-"]
[null,null,null," ","-"]
[null,null,null," ","-"]
[null,null,null," ","-"]
[null,null,null," ","-"]
[null,null,null," ","-"]
[null,null,null," ","-"]
[null,null,null," ","-"]
[null,null,null," ","-"]
[null,null,null," ","-"]
[null,null,null," ","-"]
[null,null,null," ","-"]
[null,null,null," ","-"]
[null,null,null," ","-"]
[null,null,null," ","-"]
[null,null,null," ","-"]
[null,null,null," ","-"]
[null,null,null," ","-"]
[null,null,null," ","-"]
[null,null,null," ","-"]
[null,null,null," ","-"]
[null,null,null," ","-"]
[null,null,null," ","-"]
[null,null,null," ","-"]
[null,null,null," ","-"]
[null,null,null," ","-"]
[null,null,null," ","-"]
[null,null,null," ","-"]
[null,null,null," ","-"]
[null,null,null," ","-"]
[null,null,null," ","-"]
[null,null,null," ","-"]
[null,null,null," ","-"]
[null,null,null," ","-"]
[null,null,null," ","-"]
[null,null,null," ","-"]
[null,null,null," ","-"]
[null,null,null," ","-"]
[null,null,null," "]
[null,null,null," "]
[null,null,null," "]
[null,null,null," "]

{"sheet":"Lifting","index":4,"n_rows":31,"n_cols":83,"rows_kept":31,"cut":false,"hidden":false,"merged":[[4,4,4,5],[5,2,5,3],[5,4,5,5],[0,7,2,7],[9,35,9,37],[9,47,9,49],[2,2,2,3],[0,0,0,5],[1,3,1,4],[2,0,2,1],[1,0,1,2],[3,0,3,1],[4,0,4,1],[5,0,5,1],[3,2,3,3],[3,4,3,5],[4,2,4,3]]}
["堀 滋",null,null,null,null,null,null,null,null,null,null,null,null,null,null,null,null,null,null,null,null,null,null,null,null,null,null,"次の選手",null,null,null,null,null,null,null,"F-","WE",null,"Best BP","BP","B"]
[{"$f":"IFERROR(VLOOKUP(INDIRECT(ADDRESS(MATCH(A1,INDIRECT(CONCATENATE(\"B12:B50\")),0)+11,4)),Setup!I1:J199,2,FALSE),\"-\")","v":"Women"},null,null,{"$f":"INDIRECT(CONCATENATE(\"F\",MATCH(A1,B:B,0)))","v":"84+"},null,{"$f":"CONCATENATE(RIGHT(E11,2),\" Cls\")","v":"体重 Cls"},null,null,null,null,null,null,null,null,null,null,null,null,null,null,null,null,null,null,null,null,null,"氏名","芳村 晃",null,"Rack",null,null,null,null,"FR","WC",null,"Best DL","DL","D"]
["Deadlift 1",null,{"$f":"Lists!B36","v":270},null,{"$f":"Setup!G15","v":"Kg"},{"$f":"IF(E3=\"Kg\",C3*2.2046,C3/2.2046)","v":595.24200000000008},{"$f":"IF(E3=\"Kg\",\"Lb\",\"Kg\")","v":"Lb"},null,null,null,null,null,null,null,null,null,null,null,null,null,null,null,null,null,null,null,null,"重量",null,null,null,null,null,null,null,"M-","ME",null,"Best SQ","SQ","S"]
[{"$f":"VLOOKUP(INDIRECT(ADDRESS(MATCH(A1,INDIRECT(CONCATENATE(\"B12:B50\")),0)+11,4)),Setup!I5:J92,2,FALSE)","v":"Women"},null,"Event",null,{"$f":"IF(Setup!B9=\"Powerlifting (3 lift meet)\",\"PL Total\",\"\")","v":""},null,null,null,null,null,null,null,null,null,null,null,null,null,null,null,null,null,null,null,null,null,null,null,null,null,null,null,null,null,null,"MR","MC",null,"PL Total","PL","P"]
["Open",null,{"$f":"IFERROR(Lists!F51,10000)","v":260.5},null,{"$f":"IF(OR(E4=\"\",LEFT(A3,1)=\"S\",LEFT(A3,1)=\"B\"),10000,IFERROR(Lists!F53,10000))","v":10000},null,null,null,null,null,null,null,null,null,null,null,null,null,null,null,null,null,null,null,null,null,null,null,null,null,null,null,null,null,null,null,null,null,"PP Total","PP"]
[{"$f":"IFERROR(IF(INDIRECT(ADDRESS(MATCH(A1,INDIRECT(CONCATENATE(\"B12:B40\")),0)+11,9))=\"\",\"O\",VLOOKUP(INDIRECT(ADDRESS(MATCH(A1,INDIRECT(CONCATENATE(\"B12:B40\")),0)+11,45)),DATA!E35:F53,2)),\"\")","v":"M1b"},null,{"$f":"IFERROR(IF(A6=\"O\",10000,Lists!E51),10000)","v":227.5},null,{"$f":"IF(OR(E4=\"\",LEFT(A3,1)=\"S\",LEFT(A3,1)=\"B\"),10000,IFERROR(IF(A6=\"O\",10000,Lists!E53),10000))","v":10000},null,null,null,null,null,null,null,null,null,null,null,null,null,null,null,null,null,null,null,null,null,null,null,null,null,null,null,null,null,null,null,null,null,"DQ","DQ"]
[null,"Current Status","Good","NoLift","Next","Auto",1,null,null,null,null,null,null,null,null,null,null,null,null,null,null,null,null,null,null,null,null,null,null,null,null,null,null,null,null,null,null,null,"Drug Test","DT",null,null,null,"2020-04-23",null,null,null,null,null,null,null,null,null,null,null,null,null,null,null,null,null,null,null,null,null,null,"div","cls"]
[null,null,{"$f":"CONCATENATE(\"Setup!Q5:Q\",COUNTA(Setup!Q:Q)+4)","v":"Setup!Q5:Q14"},null,null,"Min Increment",{"$f":"IF(Setup!G15=\"Kg\",0.5,1)","v":0.5},"01:00:00"]
[null,null,{"$f":"CONCATENATE(\"Lists!E2:E\",COUNTIF(Lists!E1:E12,\"<>\"\"\"))","v":"Lists!E2:E12"},null,null,"Forecast total",{"$f":"INDIRECT(ADDRESS(Lists!B25,51,,,\"Lifting\"))","v":0},null,null,null,null,null,null,null,null,null,null,null,null,null,null,null,null,null,null,null,null,null,null,null,null,null,null,null,"sort",null,null,null,null,null,null,null,null,null,null,null,null,null,null,null,null,null,null,null,null,null,null,null,null,{"$f":"NOW()-TODAY()","v":"16:52:19.880"}]
[{"$f":"CONCATENATE(\"Setup!P5:P\",COUNTA(Setup!Q:Q)+3)","v":"Setup!P5:P13"},{"$f":"CONCATENATE(\"B13:B\",12+COUNTIF(A:A,RIGHT(A11,LEN(A11)-FIND(\" \",A11))))","v":"B13:B19"},{"$f":"CONCATENATE(\"Setup!M6:M\",COUNTA(Setup!M:M)+3)","v":"Setup!M6:M5"},{"$f":"CONCATENATE(\"Setup!I6:I\",COUNTA(Setup!I:I)+3)","v":"Setup!I6:I37"},null,null,{"$f":"INDIRECT(ADDRESS(Lists!B25,26,,,\"Lifting\"))","v":""},null,null,null,null,null,null,null,null,null,null,null,null,null,null,null,null,null,null,null,null,null,null,null,null,null,null,null,"on","Assigned Macro values",null,null,null,null,null,null,null,null,null,null,null,"Forecasts"]
["Grp B","Name","Team","Div",{"$f":"'Weigh-In'!F2","v":"検量体重"},"IPF Wt Cls","lot#","Birth Year","IPF Pts Code","SQ rack","SQ-1","SQ-2","SQ-3","Best SQ","BP rack","BP-1","BP-2","BP-3","Best BP","Sub Total","DL-1","DL-2","DL-3","Best DL","Best BP","Pl/Div/Cls/Event","Forecast\nScore","F'cast Place","IPF Points","Age & Points","Events Entered","MemberID","State","Flight Sorting",{"$f":"Lists!B31","v":"U"},"SQ time rank","BP time rank","DL/TL rank",{"$f":"VLOOKUP(Y11,AM1:AN7,2,FALSE)","v":"BP"},"Pl Code","tl or coef score",null,"Div Order","DB Div",null,"Wt Cls order",null,"SQ","BP","DL","tl or event","wilks score","wilks & age","score value",null,null,null,null,null,null,null,"Active Lifter Row",{"$f":"Lists!B25","v":13},"Active Lifter Col",{"$f":"Lists!B24","v":21},{"$f":"Lists!B23","v":"DL-1"},{"$f":"Lists!B40","v":"F-O"},{"$f":"Lists!B39","v":"84+"},null,null,null,null,null,null,null,null,null,"Drug tested",null,"Div-Cls","event time","Place","Forecast Place"]
[null,null,null,null,null,{"$f":"一般判定(IFERROR(VLOOKUP(E12,DATA!$E$2:$G$22,IF(LEFT(D12,1)=\"M\",2,3)),\"\"),D12)","v":""},null,null,{"$f":"CONCATENATE(LEFT(D12,1),IF(RIGHT(D12,1)=\"U\",\"C\",\"E\"),VLOOKUP($Y$11,$AM$1:$AO$4,3,FALSE))","v":"EB"},null,null,null,null,{"$f":"IF(MAX(K12:M12)<=0,0,MAX(CELL(\"color\",K12)*K12,CELL(\"color\",L12)*L12,CELL(\"color\",M12)*M12))","v":0},null,null,null,null,{"$f":"IF(MAX(P12:R12)<=0,0,MAX(CELL(\"color\",P12)*P12,CELL(\"color\",Q12)*Q12,CELL(\"color\",R12)*R12))","v":0},{"$f":"IF(OR(N12=0,S12=0),0,N12+S12)","v":0},null,null,null,{"$f":"IF(MAX(U12:W12)<=0,0,MAX(CELL(\"color\",U12)*U12,CELL(\"color\",V12)*V12,CELL(\"color\",W12)*W12))","v":0},{"$f":"AM12*IF($AM$11=\"SQ\",N12,IF($AM$11=\"BP\",S12,IF($AM$11=\"DL\",X12,IF($AM$11=\"PP\",IF(OR(S12=0,X12=0),0,S12+X12),IF(OR(T12=0,X12=0),0,T12+X12)))))","v":0},{"$f":"IF(Y12=0,\"\",CONCATENATE(CD12,\"/\",IF(AN12=4,\"Wilks\",D12),\"/\",IF(AN12>1,\"\",F12),\"/\",$AM$11))","v":""},{"$f":"BB12","v":0},{"$f":"IF(AA12=0,\"\",CE12)","v":""},{"$f":"IFERROR(IPF_Formula(E12,I12,Y12),0)","v":0},{"$f":"IFERROR(VLOOKUP(AS12,DATA!$A$2:$B$63,2,TRUE),0)*AC12","v":0},"BP",null,null,{"$f":"IFERROR(VLOOKUP(A12,Setup!$Q$5:$R$20,2,FALSE),\"\")","v":""},{"$f":"IF(VALUE(INDIRECT(CONCATENATE($AI$11,ROW())))=0,\"\",ABS(INDIRECT(CONCATENATE($AI$11,ROW())))+0.000001*G12)","v":""},0,0,0,{"$f":"IF(ISERROR(SEARCH($AM$11,AE12)),0,1)","v":1},{"$f":"VLOOKUP(D12,Setup!$I$6:$K$92,3,FALSE)","v":{"$error":"#N/A"}},{"$f":"ROUND(IFERROR(IF(AN12=1,Y12,IF(AN12=2,AC12,IF(AN12=3,AD12,AC12))),0),5)","v":0},null,{"$f":"IFERROR(MATCH(D12,Setup!$I$6:$I$92,0),\"\")","v":""},{"$f":"IFERROR(CONCATENATE(LEFT(D12,FIND(\"-\",D12)),IF(AS12=\"\",\"O\",VLOOKUP(AS12,DATA!$E$35:$F$53,2,TRUE))),\"\")","v":""},{"$f":"YEAR(TODAY())-H12","v":2020},{"$f":"IF(AN12=1,MATCH(F12,DATA!$AB$2:$AB$34,0),0)","v":{"$error":"#N/A"}},null,{"$f":"IF(MAX(K12:M12)>0,MAX(K12:M12),0)","v":0},{"$f":"IF(MAX(P12:R12)>0,MAX(P12:R12),0)","v":0},{"$f":"IF(MAX(U12:W12)>0,MAX(U12:W12),0)","v":0},{"$f":"AM12*IF($AM$11=\"PL\",IF(MIN(AV12:AX12)=0,0,AV12+AW12+AX12),IF($AM$11=\"PP\",IF(MIN(AW12:AX12)=0,0,AW12+AX12),IF($AM$11=\"BP\",AW12,IF($AM$11=\"DL\",AX12,AV12))))","v":0},{"$f":"IFERROR(IPF_Formula(E12,I12,AY12),0)","v":0},{"$f":"ROUND(IFERROR(VLOOKUP(AS12,DATA!$A$2:$B$63,2,FALSE),1)*AZ12,5)","v":0},{"$f":"IFERROR(IF(AN12=1,AY12,IF(AN12=2,AZ12,IF(AN12=3,BA12,AZ12))),0)","v":0},null,null,null,null,null,null,null,null,null,null,null,null,null,null,null,null,null,null,null,null,null,null,null,{"$f":"IFERROR(IF(FIND(\"DT\",AE12),\"Y\",\"\"),\"\")","v":""},null,{"$f":"CONCATENATE(IF(AN12=4,\"\",D12),IF(AN12=1,F12,\"\"))","v":{"$error":"#N/A"}},{"$f":"IF($AM$11=\"SQ\",AJ12,IF($AM$11=\"BP\",AK12,AL12))","v":0},{"$f":"1+COUNTIFS(INDIRECT(\"AN12:AN500\"),AN12,INDIRECT(\"CB12:CB500\"),CB12,INDIRECT(\"AO12:AO500\"),\">\"&AO12)\n+COUNTIFS(INDIRECT(\"AO12:AO500\"),AO12,INDIRECT(\"AN12:AN500\"),1,INDIRECT(\"CB12:CB500\"),CB12,INDIRECT(\"E12:E500\"),\"<\"&E12)\n+COUNTIFS(INDIRECT(\"AO12:AO500\"),AO12,INDIRECT(\"AN12:AN500\"),1,INDIRECT(\"CB12:CB500\"),CB12,INDIRECT(\"E12:E500\"),E12,INDIRECT(\"CC12:CC500\"),\"<\"&CC12)","v":1},{"$f":"1+COUNTIFS(INDIRECT(\"AN12:AN500\"),AN12,INDIRECT(\"CB12:CB500\"),CB12,INDIRECT(\"BB12:BB500\"),\">\"&BB12)\n+COUNTIFS(INDIRECT(\"BB12:BB500\"),BB12,INDIRECT(\"AN12:AN500\"),1,INDIRECT(\"CB12:CB500\"),CB12,INDIRECT(\"E12:E500\"),\"<\"&E12)","v":1}]
["B","堀 滋","8suki gym","F-O",150,{"$f":"一般判定(IFERROR(VLOOKUP(E13,DATA!$E$2:$G$22,IF(LEFT(D13,1)=\"M\",2,3)),\"\"),D13)","v":"84+"},18,1975,{"$f":"CONCATENATE(LEFT(D13,1),IF(RIGHT(D13,1)=\"U\",\"C\",\"E\"),VLOOKUP($Y$11,$AM$1:$AO$4,3,FALSE))","v":"FEB"},270,270,null,null,{"$f":"IF(MAX(K13:M13)<=0,0,MAX(CELL(\"color\",K13)*K13,CELL(\"color\",L13)*L13,CELL(\"color\",M13)*M13))","v":270},270,270,null,null,{"$f":"IF(MAX(P13:R13)<=0,0,MAX(CELL(\"color\",P13)*P13,CELL(\"color\",Q13)*Q13,CELL(\"color\",R13)*R13))","v":270},{"$f":"IF(OR(N13=0,S13=0),0,N13+S13)","v":540},270,null,null,{"$f":"IF(MAX(U13:W13)<=0,0,MAX(CELL(\"color\",U13)*U13,CELL(\"color\",V13)*V13,CELL(\"color\",W13)*W13))","v":270},{"$f":"AM13*IF($AM$11=\"SQ\",N13,IF($AM$11=\"BP\",S13,IF($AM$11=\"DL\",X13,IF($AM$11=\"PP\",IF(OR(S13=0,X13=0),0,S13+X13),IF(OR(T13=0,X13=0),0,T13+X13)))))","v":0},{"$f":"IF(Y13=0,\"\",CONCATENATE(CD13,\"/\",IF(AN13=4,\"Wilks\",D13),\"/\",IF(AN13>1,\"\",F13),\"/\",$AM$11))","v":""},{"$f":"BB13","v":0},{"$f":"IF(AA13=0,\"\",CE13)","v":""},{"$f":"IFERROR(IPF_Formula(E13,I13,Y13),0)","v":0},{"$f":"IFERROR(VLOOKUP(AS13,DATA!$A$2:$B$63,2,TRUE),0)*AC13","v":0},"PL",null,null,{"$f":"IFERROR(VLOOKUP(A13,Setup!$Q$5:$R$20,2,FALSE),\"\")","v":0},{"$f":"IF(VALUE(INDIRECT(CONCATENATE($AI$11,ROW())))=0,\"\",ABS(INDIRECT(CONCATENATE($AI$11,ROW())))+0.000001*G13)","v":270.00001800000001},26,8,21,{"$f":"IF(ISERROR(SEARCH($AM$11,AE13)),0,1)","v":0},{"$f":"VLOOKUP(D13,Setup!$I$6:$K$92,3,FALSE)","v":1},{"$f":"ROUND(IFERROR(IF(AN13=1,Y13,IF(AN13=2,AC13,IF(AN13=3,AD13,AC13))),0),5)","v":0},null,{"$f":"IFERROR(MATCH(D13,Setup!$I$6:$I$92,0),\"\")","v":17},{"$f":"IFERROR(CONCATENATE(LEFT(D13,FIND(\"-\",D13)),IF(AS13=\"\",\"O\",VLOOKUP(AS13,DATA!$E$35:$F$53,2,TRUE))),\"\")","v":"F-M1b"},{"$f":"YEAR(TODAY())-H13","v":45},{"$f":"IF(AN13=1,MATCH(F13,DATA!$AB$2:$AB$34,0),0)","v":23},null,{"$f":"IF(MAX(K13:M13)>0,MAX(K13:M13),0)","v":270},{"$f":"IF(MAX(P13:R13)>0,MAX(P13:R13),0)","v":270},{"$f":"IF(MAX(U13:W13)>0,MAX(U13:W13),0)","v":270},{"$f":"AM13*IF($AM$11=\"PL\",IF(MIN(AV13:AX13)=0,0,AV13+AW13+AX13),IF($AM$11=\"PP\",IF(MIN(AW13:AX13)=0,0,AW13+AX13),IF($AM$11=\"BP\",AW13,IF($AM$11=\"DL\",AX13,AV13))))","v":0},{"$f":"IFERROR(IPF_Formula(E13,I13,AY13),0)","v":0},{"$f":"ROUND(IFERROR(VLOOKUP(AS13,DATA!$A$2:$B$63,2,FALSE),1)*AZ13,5)","v":0},{"$f":"IFERROR(IF(AN13=1,AY13,IF(AN13=2,AZ13,IF(AN13=3,BA13,AZ13))),0)","v":0},null,null,null,null,"16:50:13",null,null,null,null,null,null,null,null,null,null,null,null,null,null,null,null,null,null,{"$f":"IFERROR(IF(FIND(\"DT\",AE13),\"Y\",\"\"),\"\")","v":""},null,{"$f":"CONCATENATE(IF(AN13=4,\"\",D13),IF(AN13=1,F13,\"\"))","v":"F-O84+"},{"$f":"IF($AM$11=\"SQ\",AJ13,IF($AM$11=\"BP\",AK13,AL13))","v":8},{"$f":"1+COUNTIFS(INDIRECT(\"AN12:AN500\"),AN13,INDIRECT(\"CB12:CB500\"),CB13,INDIRECT(\"AO12:AO500\"),\">\"&AO13)\n+COUNTIFS(INDIRECT(\"AO12:AO500\"),AO13,INDIRECT(\"AN12:AN500\"),1,INDIRECT(\"CB12:CB500\"),CB13,INDIRECT(\"E12:E500\"),\"<\"&E13)\n+COUNTIFS(INDIRECT(\"AO12:AO500\"),AO13,INDIRECT(\"AN12:AN500\"),1,INDIRECT(\"CB12:CB500\"),CB13,INDIRECT(\"E12:E500\"),E13,INDIRECT(\"CC12:CC500\"),\"<\"&CC13)","v":6},{"$f":"1+COUNTIFS(INDIRECT(\"AN12:AN500\"),AN13,INDIRECT(\"CB12:CB500\"),CB13,INDIRECT(\"BB12:BB500\"),\">\"&BB13)\n+COUNTIFS(INDIRECT(\"BB12:BB500\"),BB13,INDIRECT(\"AN12:AN500\"),1,INDIRECT(\"CB12:CB500\"),CB13,INDIRECT(\"E12:E500\"),\"<\"&E13)","v":6}]
["B","石田 浩士","8suki gym","F-O",140,{"$f":"一般判定(IFERROR(VLOOKUP(E14,DATA!$E$2:$G$22,IF(LEFT(D14,1)=\"M\",2,3)),\"\"),D14)","v":"84+"},17,1970,{"$f":"CONCATENATE(LEFT(D14,1),IF(RIGHT(D14,1)=\"U\",\"C\",\"E\"),VLOOKUP($Y$11,$AM$1:$AO$4,3,FALSE))","v":"FEB"},260,260,null,null,{"$f":"IF(MAX(K14:M14)<=0,0,MAX(CELL(\"color\",K14)*K14,CELL(\"color\",L14)*L14,CELL(\"color\",M14)*M14))","v":260},260,260,null,null,{"$f":"IF(MAX(P14:R14)<=0,0,MAX(CELL(\"color\",P14)*P14,CELL(\"color\",Q14)*Q14,CELL(\"color\",R14)*R14))","v":260},{"$f":"IF(OR(N14=0,S14=0),0,N14+S14)","v":520},260,null,null,{"$f":"IF(MAX(U14:W14)<=0,0,MAX(CELL(\"color\",U14)*U14,CELL(\"color\",V14)*V14,CELL(\"color\",W14)*W14))","v":260},{"$f":"AM14*IF($AM$11=\"SQ\",N14,IF($AM$11=\"BP\",S14,IF($AM$11=\"DL\",X14,IF($AM$11=\"PP\",IF(OR(S14=0,X14=0),0,S14+X14),IF(OR(T14=0,X14=0),0,T14+X14)))))","v":0},{"$f":"IF(Y14=0,\"\",CONCATENATE(CD14,\"/\",IF(AN14=4,\"Wilks\",D14),\"/\",IF(AN14>1,\"\",F14),\"/\",$AM$11))","v":""},{"$f":"BB14","v":0},{"$f":"IF(AA14=0,\"\",CE14)","v":""},{"$f":"IFERROR(IPF_Formula(E14,I14,Y14),0)","v":0},{"$f":"IFERROR(VLOOKUP(AS14,DATA!$A$2:$B$63,2,TRUE),0)*AC14","v":0},"PL",null,null,{"$f":"IFERROR(VLOOKUP(A14,Setup!$Q$5:$R$20,2,FALSE),\"\")","v":0},{"$f":"IF(VALUE(INDIRECT(CONCATENATE($AI$11,ROW())))=0,\"\",ABS(INDIRECT(CONCATENATE($AI$11,ROW())))+0.000001*G14)","v":260.00001700000001},25,6,19,{"$f":"IF(ISERROR(SEARCH($AM$11,AE14)),0,1)","v":0},{"$f":"VLOOKUP(D14,Setup!$I$6:$K$92,3,FALSE)","v":1},{"$f":"ROUND(IFERROR(IF(AN14=1,Y14,IF(AN14=2,AC14,IF(AN14=3,AD14,AC14))),0),5)","v":0},null,{"$f":"IFERROR(MATCH(D14,Setup!$I$6:$I$92,0),\"\")","v":17},{"$f":"IFERROR(CONCATENATE(LEFT(D14,FIND(\"-\",D14)),IF(AS14=\"\",\"O\",VLOOKUP(AS14,DATA!$E$35:$F$53,2,TRUE))),\"\")","v":"F-M2a"},{"$f":"YEAR(TODAY())-H14","v":50},{"$f":"IF(AN14=1,MATCH(F14,DATA!$AB$2:$AB$34,0),0)","v":23},null,{"$f":"IF(MAX(K14:M14)>0,MAX(K14:M14),0)","v":260},{"$f":"IF(MAX(P14:R14)>0,MAX(P14:R14),0)","v":260},{"$f":"IF(MAX(U14:W14)>0,MAX(U14:W14),0)","v":260},{"$f":"AM14*IF($AM$11=\"PL\",IF(MIN(AV14:AX14)=0,0,AV14+AW14+AX14),IF($AM$11=\"PP\",IF(MIN(AW14:AX14)=0,0,AW14+AX14),IF($AM$11=\"BP\",AW14,IF($AM$11=\"DL\",AX14,AV14))))","v":0},{"$f":"IFERROR(IPF_Formula(E14,I14,AY14),0)","v":0},{"$f":"ROUND(IFERROR(VLOOKUP(AS14,DATA!$A$2:$B$63,2,FALSE),1)*AZ14,5)","v":0},{"$f":"IFERROR(IF(AN14=1,AY14,IF(AN14=2,AZ14,IF(AN14=3,BA14,AZ14))),0)","v":0},null,null,null,null,"16:50:10",null,null,null,null,null,null,null,null,null,null,null,null,null,null,null,null,null,null,{"$f":"IFERROR(IF(FIND(\"DT\",AE14),\"Y\",\"\"),\"\")","v":""},null,{"$f":"CONCATENATE(IF(AN14=4,\"\",D14),IF(AN14=1,F14,\"\"))","v":"F-O84+"},{"$f":"IF($AM$11=\"SQ\",AJ14,IF($AM$11=\"BP\",AK14,AL14))","v":6},{"$f":"1+COUNTIFS(INDIRECT(\"AN12:AN500\"),AN14,INDIRECT(\"CB12:CB500\"),CB14,INDIRECT(\"AO12:AO500\"),\">\"&AO14)\n+COUNTIFS(INDIRECT(\"AO12:AO500\"),AO14,INDIRECT(\"AN12:AN500\"),1,INDIRECT(\"CB12:CB500\"),CB14,INDIRECT(\"E12:E500\"),\"<\"&E14)\n+COUNTIFS(INDIRECT(\"AO12:AO500\"),AO14,INDIRECT(\"AN12:AN500\"),1,INDIRECT(\"CB12:CB500\"),CB14,INDIRECT(\"E12:E500\"),E14,INDIRECT(\"CC12:CC500\"),\"<\"&CC14)","v":5},{"$f":"1+COUNTIFS(INDIRECT(\"AN12:AN500\"),AN14,INDIRECT(\"CB12:CB500\"),CB14,INDIRECT(\"BB12:BB500\"),\">\"&BB14)\n+COUNTIFS(INDIRECT(\"BB12:BB500\"),BB14,INDIRECT(\"AN12:AN500\"),1,INDIRECT(\"CB12:CB500\"),CB14,INDIRECT(\"E12:E500\"),\"<\"&E14)","v":5}]
["B","光安 隆史","8suki gym","F-O",85,{"$f":"一般判定(IFERROR(VLOOKUP(E15,DATA!$E$2:$G$22,IF(LEFT(D15,1)=\"M\",2,3)),\"\"),D15)","v":"84+"},16,1976,{"$f":"CONCATENATE(LEFT(D15,1),IF(RIGHT(D15,1)=\"U\",\"C\",\"E\"),VLOOKUP($Y$11,$AM$1:$AO$4,3,FALSE))","v":"FEB"},250,250,null,null,{"$f":"IF(MAX(K15:M15)<=0,0,MAX(CELL(\"color\",K15)*K15,CELL(\"color\",L15)*L15,CELL(\"color\",M15)*M15))","v":250},250,250,null,null,{"$f":"IF(MAX(P15:R15)<=0,0,MAX(CELL(\"color\",P15)*P15,CELL(\"color\",Q15)*Q15,CELL(\"color\",R15)*R15))","v":250},{"$f":"IF(OR(N15=0,S15=0),0,N15+S15)","v":500},250,null,null,{"$f":"IF(MAX(U15:W15)<=0,0,MAX(CELL(\"color\",U15)*U15,CELL(\"color\",V15)*V15,CELL(\"color\",W15)*W15))","v":250},{"$f":"AM15*IF($AM$11=\"SQ\",N15,IF($AM$11=\"BP\",S15,IF($AM$11=\"DL\",X15,IF($AM$11=\"PP\",IF(OR(S15=0,X15=0),0,S15+X15),IF(OR(T15=0,X15=0),0,T15+X15)))))","v":0},{"$f":"IF(Y15=0,\"\",CONCATENATE(CD15,\"/\",IF(AN15=4,\"Wilks\",D15),\"/\",IF(AN15>1,\"\",F15),\"/\",$AM$11))","v":""},{"$f":"BB15","v":0},{"$f":"IF(AA15=0,\"\",CE15)","v":""},{"$f":"IFERROR(IPF_Formula(E15,I15,Y15),0)","v":0},{"$f":"IFERROR(VLOOKUP(AS15,DATA!$A$2:$B$63,2,TRUE),0)*AC15","v":0},"PL",null,null,{"$f":"IFERROR(VLOOKUP(A15,Setup!$Q$5:$R$20,2,FALSE),\"\")","v":0},{"$f":"IF(VALUE(INDIRECT(CONCATENATE($AI$11,ROW())))=0,\"\",ABS(INDIRECT(CONCATENATE($AI$11,ROW())))+0.000001*G15)","v":250.00001599999999},24,5,18,{"$f":"IF(ISERROR(SEARCH($AM$11,AE15)),0,1)","v":0},{"$f":"VLOOKUP(D15,Setup!$I$6:$K$92,3,FALSE)","v":1},{"$f":"ROUND(IFERROR(IF(AN15=1,Y15,IF(AN15=2,AC15,IF(AN15=3,AD15,AC15))),0),5)","v":0},null,{"$f":"IFERROR(MATCH(D15,Setup!$I$6:$I$92,0),\"\")","v":17},{"$f":"IFERROR(CONCATENATE(LEFT(D15,FIND(\"-\",D15)),IF(AS15=\"\",\"O\",VLOOKUP(AS15,DATA!$E$35:$F$53,2,TRUE))),\"\")","v":"F-M1a"},{"$f":"YEAR(TODAY())-H15","v":44},{"$f":"IF(AN15=1,MATCH(F15,DATA!$AB$2:$AB$34,0),0)","v":23},null,{"$f":"IF(MAX(K15:M15)>0,MAX(K15:M15),0)","v":250},{"$f":"IF(MAX(P15:R15)>0,MAX(P15:R15),0)","v":250},{"$f":"IF(MAX(U15:W15)>0,MAX(U15:W15),0)","v":250},{"$f":"AM15*IF($AM$11=\"PL\",IF(MIN(AV15:AX15)=0,0,AV15+AW15+AX15),IF($AM$11=\"PP\",IF(MIN(AW15:AX15)=0,0,AW15+AX15),IF($AM$11=\"BP\",AW15,IF($AM$11=\"DL\",AX15,AV15))))","v":0},{"$f":"IFERROR(IPF_Formula(E15,I15,AY15),0)","v":0},{"$f":"ROUND(IFERROR(VLOOKUP(AS15,DATA!$A$2:$B$63,2,FALSE),1)*AZ15,5)","v":0},{"$f":"IFERROR(IF(AN15=1,AY15,IF(AN15=2,AZ15,IF(AN15=3,BA15,AZ15))),0)","v":0},null,null,null,null,"16:50:09",null,null,null,null,null,null,null,null,null,null,null,null,null,null,null,null,null,null,{"$f":"IFERROR(IF(FIND(\"DT\",AE15),\"Y\",\"\"),\"\")","v":""},null,{"$f":"CONCATENATE(IF(AN15=4,\"\",D15),IF(AN15=1,F15,\"\"))","v":"F-O84+"},{"$f":"IF($AM$11=\"SQ\",AJ15,IF($AM$11=\"BP\",AK15,AL15))","v":5},{"$f":"1+COUNTIFS(INDIRECT(\"AN12:AN500\"),AN15,INDIRECT(\"CB12:CB500\"),CB15,INDIRECT(\"AO12:AO500\"),\">\"&AO15)\n+COUNTIFS(INDIRECT(\"AO12:AO500\"),AO15,INDIRECT(\"AN12:AN500\"),1,INDIRECT(\"CB12:CB500\"),CB15,INDIRECT(\"E12:E500\"),\"<\"&E15)\n+COUNTIFS(INDIRECT(\"AO12:AO500\"),AO15,INDIRECT(\"AN12:AN500\"),1,INDIRECT(\"CB12:CB500\"),CB15,INDIRECT(\"E12:E500\"),E15,INDIRECT(\"CC12:CC500\"),\"<\"&CC15)","v":1},{"$f":"1+COUNTIFS(INDIRECT(\"AN12:AN500\"),AN15,INDIRECT(\"CB12:CB500\"),CB15,INDIRECT(\"BB12:BB500\"),\">\"&BB15)\n+COUNTIFS(INDIRECT(\"BB12:BB500\"),BB15,INDIRECT(\"AN12:AN500\"),1,INDIRECT(\"CB12:CB500\"),CB15,INDIRECT(\"E12:E500\"),\"<\"&E15)","v":1}]
["B","田口 航大","8sukigym","F-O",120,{"$f":"一般判定(IFERROR(VLOOKUP(E16,DATA!$E$2:$G$22,IF(LEFT(D16,1)=\"M\",2,3)),\"\"),D16)","v":"84+"},15,2002,{"$f":"CONCATENATE(LEFT(D16,1),IF(RIGHT(D16,1)=\"U\",\"C\",\"E\"),VLOOKUP($Y$11,$AM$1:$AO$4,3,FALSE))","v":"FEB"},240,240,null,null,{"$f":"IF(MAX(K16:M16)<=0,0,MAX(CELL(\"color\",K16)*K16,CELL(\"color\",L16)*L16,CELL(\"color\",M16)*M16))","v":240},240,240,null,null,{"$f":"IF(MAX(P16:R16)<=0,0,MAX(CELL(\"color\",P16)*P16,CELL(\"color\",Q16)*Q16,CELL(\"color\",R16)*R16))","v":240},{"$f":"IF(OR(N16=0,S16=0),0,N16+S16)","v":480},240,null,null,{"$f":"IF(MAX(U16:W16)<=0,0,MAX(CELL(\"color\",U16)*U16,CELL(\"color\",V16)*V16,CELL(\"color\",W16)*W16))","v":240},{"$f":"AM16*IF($AM$11=\"SQ\",N16,IF($AM$11=\"BP\",S16,IF($AM$11=\"DL\",X16,IF($AM$11=\"PP\",IF(OR(S16=0,X16=0),0,S16+X16),IF(OR(T16=0,X16=0),0,T16+X16)))))","v":0},{"$f":"IF(Y16=0,\"\",CONCATENATE(CD16,\"/\",IF(AN16=4,\"Wilks\",D16),\"/\",IF(AN16>1,\"\",F16),\"/\",$AM$11))","v":""},{"$f":"BB16","v":0},{"$f":"IF(AA16=0,\"\",CE16)","v":""},{"$f":"IFERROR(IPF_Formula(E16,I16,Y16),0)","v":0},{"$f":"IFERROR(VLOOKUP(AS16,DATA!$A$2:$B$63,2,TRUE),0)*AC16","v":0},"PL",null,null,{"$f":"IFERROR(VLOOKUP(A16,Setup!$Q$5:$R$20,2,FALSE),\"\")","v":0},{"$f":"IF(VALUE(INDIRECT(CONCATENATE($AI$11,ROW())))=0,\"\",ABS(INDIRECT(CONCATENATE($AI$11,ROW())))+0.000001*G16)","v":240.00001499999999},23,4,17,{"$f":"IF(ISERROR(SEARCH($AM$11,AE16)),0,1)","v":0},{"$f":"VLOOKUP(D16,Setup!$I$6:$K$92,3,FALSE)","v":1},{"$f":"ROUND(IFERROR(IF(AN16=1,Y16,IF(AN16=2,AC16,IF(AN16=3,AD16,AC16))),0),5)","v":0},null,{"$f":"IFERROR(MATCH(D16,Setup!$I$6:$I$92,0),\"\")","v":17},{"$f":"IFERROR(CONCATENATE(LEFT(D16,FIND(\"-\",D16)),IF(AS16=\"\",\"O\",VLOOKUP(AS16,DATA!$E$35:$F$53,2,TRUE))),\"\")","v":"F-T3"},{"$f":"YEAR(TODAY())-H16","v":18},{"$f":"IF(AN16=1,MATCH(F16,DATA!$AB$2:$AB$34,0),0)","v":23},null,{"$f":"IF(MAX(K16:M16)>0,MAX(K16:M16),0)","v":240},{"$f":"IF(MAX(P16:R16)>0,MAX(P16:R16),0)","v":240},{"$f":"IF(MAX(U16:W16)>0,MAX(U16:W16),0)","v":240},{"$f":"AM16*IF($AM$11=\"PL\",IF(MIN(AV16:AX16)=0,0,AV16+AW16+AX16),IF($AM$11=\"PP\",IF(MIN(AW16:AX16)=0,0,AW16+AX16),IF($AM$11=\"BP\",AW16,IF($AM$11=\"DL\",AX16,AV16))))","v":0},{"$f":"IFERROR(IPF_Formula(E16,I16,AY16),0)","v":0},{"$f":"ROUND(IFERROR(VLOOKUP(AS16,DATA!$A$2:$B$63,2,FALSE),1)*AZ16,5)","v":0},{"$f":"IFERROR(IF(AN16=1,AY16,IF(AN16=2,AZ16,IF(AN16=3,BA16,AZ16))),0)","v":0},null,null,null,null,"16:50:08",null,null,null,null,null,null,null,null,null,null,null,null,null,null,null,null,null,null,{"$f":"IFERROR(IF(FIND(\"DT\",AE16),\"Y\",\"\"),\"\")","v":""},null,{"$f":"CONCATENATE(IF(AN16=4,\"\",D16),IF(AN16=1,F16,\"\"))","v":"F-O84+"},{"$f":"IF($AM$11=\"SQ\",AJ16,IF($AM$11=\"BP\",AK16,AL16))","v":4},{"$f":"1+COUNTIFS(INDIRECT(\"AN12:AN500\"),AN16,INDIRECT(\"CB12:CB500\"),CB16,INDIRECT(\"AO12:AO500\"),\">\"&AO16)\n+COUNTIFS(INDIRECT(\"AO12:AO500\"),AO16,INDIRECT(\"AN12:AN500\"),1,INDIRECT(\"CB12:CB500\"),CB16,INDIRECT(\"E12:E500\"),\"<\"&E16)\n+COUNTIFS(INDIRECT(\"AO12:AO500\"),AO16,INDIRECT(\"AN12:AN500\"),1,INDIRECT(\"CB12:CB500\"),CB16,INDIRECT(\"E12:E500\"),E16,INDIRECT(\"CC12:CC500\"),\"<\"&CC16)","v":3},{"$f":"1+COUNTIFS(INDIRECT(\"AN12:AN500\"),AN16,INDIRECT(\"CB12:CB500\"),CB16,INDIRECT(\"BB12:BB500\"),\">\"&BB16)\n+COUNTIFS(INDIRECT(\"BB12:BB500\"),BB16,INDIRECT(\"AN12:AN500\"),1,INDIRECT(\"CB12:CB500\"),CB16,INDIRECT(\"E12:E500\"),\"<\"&E16)","v":2}]
["B","瀧井 章男","Ks GYM","F-O",130,{"$f":"一般判定(IFERROR(VLOOKUP(E17,DATA!$E$2:$G$22,IF(LEFT(D17,1)=\"M\",2,3)),\"\"),D17)","v":"84+"},13,1984,{"$f":"CONCATENATE(LEFT(D17,1),IF(RIGHT(D17,1)=\"U\",\"C\",\"E\"),VLOOKUP($Y$11,$AM$1:$AO$4,3,FALSE))","v":"FEB"},220,220,null,null,{"$f":"IF(MAX(K17:M17)<=0,0,MAX(CELL(\"color\",K17)*K17,CELL(\"color\",L17)*L17,CELL(\"color\",M17)*M17))","v":220},220,220,null,null,{"$f":"IF(MAX(P17:R17)<=0,0,MAX(CELL(\"color\",P17)*P17,CELL(\"color\",Q17)*Q17,CELL(\"color\",R17)*R17))","v":220},{"$f":"IF(OR(N17=0,S17=0),0,N17+S17)","v":440},220,null,null,{"$f":"IF(MAX(U17:W17)<=0,0,MAX(CELL(\"color\",U17)*U17,CELL(\"color\",V17)*V17,CELL(\"color\",W17)*W17))","v":220},{"$f":"AM17*IF($AM$11=\"SQ\",N17,IF($AM$11=\"BP\",S17,IF($AM$11=\"DL\",X17,IF($AM$11=\"PP\",IF(OR(S17=0,X17=0),0,S17+X17),IF(OR(T17=0,X17=0),0,T17+X17)))))","v":0},{"$f":"IF(Y17=0,\"\",CONCATENATE(CD17,\"/\",IF(AN17=4,\"Wilks\",D17),\"/\",IF(AN17>1,\"\",F17),\"/\",$AM$11))","v":""},{"$f":"BB17","v":0},{"$f":"IF(AA17=0,\"\",CE17)","v":""},{"$f":"IFERROR(IPF_Formula(E17,I17,Y17),0)","v":0},{"$f":"IFERROR(VLOOKUP(AS17,DATA!$A$2:$B$63,2,TRUE),0)*AC17","v":0},"PL",null,null,{"$f":"IFERROR(VLOOKUP(A17,Setup!$Q$5:$R$20,2,FALSE),\"\")","v":0},{"$f":"IF(VALUE(INDIRECT(CONCATENATE($AI$11,ROW())))=0,\"\",ABS(INDIRECT(CONCATENATE($AI$11,ROW())))+0.000001*G17)","v":220.000013},21,2,15,{"$f":"IF(ISERROR(SEARCH($AM$11,AE17)),0,1)","v":0},{"$f":"VLOOKUP(D17,Setup!$I$6:$K$92,3,FALSE)","v":1},{"$f":"ROUND(IFERROR(IF(AN17=1,Y17,IF(AN17=2,AC17,IF(AN17=3,AD17,AC17))),0),5)","v":0},null,{"$f":"IFERROR(MATCH(D17,Setup!$I$6:$I$92,0),\"\")","v":17},{"$f":"IFERROR(CONCATENATE(LEFT(D17,FIND(\"-\",D17)),IF(AS17=\"\",\"O\",VLOOKUP(AS17,DATA!$E$35:$F$53,2,TRUE))),\"\")","v":"F-O"},{"$f":"YEAR(TODAY())-H17","v":36},{"$f":"IF(AN17=1,MATCH(F17,DATA!$AB$2:$AB$34,0),0)","v":23},null,{"$f":"IF(MAX(K17:M17)>0,MAX(K17:M17),0)","v":220},{"$f":"IF(MAX(P17:R17)>0,MAX(P17:R17),0)","v":220},{"$f":"IF(MAX(U17:W17)>0,MAX(U17:W17),0)","v":220},{"$f":"AM17*IF($AM$11=\"PL\",IF(MIN(AV17:AX17)=0,0,AV17+AW17+AX17),IF($AM$11=\"PP\",IF(MIN(AW17:AX17)=0,0,AW17+AX17),IF($AM$11=\"BP\",AW17,IF($AM$11=\"DL\",AX17,AV17))))","v":0},{"$f":"IFERROR(IPF_Formula(E17,I17,AY17),0)","v":0},{"$f":"ROUND(IFERROR(VLOOKUP(AS17,DATA!$A$2:$B$63,2,FALSE),1)*AZ17,5)","v":0},{"$f":"IFERROR(IF(AN17=1,AY17,IF(AN17=2,AZ17,IF(AN17=3,BA17,AZ17))),0)","v":0},null,null,null,null,"16:50:06",null,null,null,null,null,null,null,null,null,null,null,null,null,null,null,null,null,null,{"$f":"IFERROR(IF(FIND(\"DT\",AE17),\"Y\",\"\"),\"\")","v":""},null,{"$f":"CONCATENATE(IF(AN17=4,\"\",D17),IF(AN17=1,F17,\"\"))","v":"F-O84+"},{"$f":"IF($AM$11=\"SQ\",AJ17,IF($AM$11=\"BP\",AK17,AL17))","v":2},{"$f":"1+COUNTIFS(INDIRECT(\"AN12:AN500\"),AN17,INDIRECT(\"CB12:CB500\"),CB17,INDIRECT(\"AO12:AO500\"),\">\"&AO17)\n+COUNTIFS(INDIRECT(\"AO12:AO500\"),AO17,INDIRECT(\"AN12:AN500\"),1,INDIRECT(\"CB12:CB500\"),CB17,INDIRECT(\"E12:E500\"),\"<\"&E17)\n+COUNTIFS(INDIRECT(\"AO12:AO500\"),AO17,INDIRECT(\"AN12:AN500\"),1,INDIRECT(\"CB12:CB500\"),CB17,INDIRECT(\"E12:E500\"),E17,INDIRECT(\"CC12:CC500\"),\"<\"&CC17)","v":4},{"$f":"1+COUNTIFS(INDIRECT(\"AN12:AN500\"),AN17,INDIRECT(\"CB12:CB500\"),CB17,INDIRECT(\"BB12:BB500\"),\">\"&BB17)\n+COUNTIFS(INDIRECT(\"BB12:BB500\"),BB17,INDIRECT(\"AN12:AN500\"),1,INDIRECT(\"CB12:CB500\"),CB17,INDIRECT(\"E12:E500\"),\"<\"&E17)","v":4}]
["B","芳村 晃","8sukigym","F-O",120,{"$f":"一般判定(IFERROR(VLOOKUP(E18,DATA!$E$2:$G$22,IF(LEFT(D18,1)=\"M\",2,3)),\"\"),D18)","v":"84+"},12,1975,{"$f":"CONCATENATE(LEFT(D18,1),IF(RIGHT(D18,1)=\"U\",\"C\",\"E\"),VLOOKUP($Y$11,$AM$1:$AO$4,3,FALSE))","v":"FEB"},210,210,null,null,{"$f":"IF(MAX(K18:M18)<=0,0,MAX(CELL(\"color\",K18)*K18,CELL(\"color\",L18)*L18,CELL(\"color\",M18)*M18))","v":210},210,210,null,null,{"$f":"IF(MAX(P18:R18)<=0,0,MAX(CELL(\"color\",P18)*P18,CELL(\"color\",Q18)*Q18,CELL(\"color\",R18)*R18))","v":210},{"$f":"IF(OR(N18=0,S18=0),0,N18+S18)","v":420},210,null,null,{"$f":"IF(MAX(U18:W18)<=0,0,MAX(CELL(\"color\",U18)*U18,CELL(\"color\",V18)*V18,CELL(\"color\",W18)*W18))","v":210},{"$f":"AM18*IF($AM$11=\"SQ\",N18,IF($AM$11=\"BP\",S18,IF($AM$11=\"DL\",X18,IF($AM$11=\"PP\",IF(OR(S18=0,X18=0),0,S18+X18),IF(OR(T18=0,X18=0),0,T18+X18)))))","v":0},{"$f":"IF(Y18=0,\"\",CONCATENATE(CD18,\"/\",IF(AN18=4,\"Wilks\",D18),\"/\",IF(AN18>1,\"\",F18),\"/\",$AM$11))","v":""},{"$f":"BB18","v":0},{"$f":"IF(AA18=0,\"\",CE18)","v":""},{"$f":"IFERROR(IPF_Formula(E18,I18,Y18),0)","v":0},{"$f":"IFERROR(VLOOKUP(AS18,DATA!$A$2:$B$63,2,TRUE),0)*AC18","v":0},"PL",null,null,{"$f":"IFERROR(VLOOKUP(A18,Setup!$Q$5:$R$20,2,FALSE),\"\")","v":0},{"$f":"IF(VALUE(INDIRECT(CONCATENATE($AI$11,ROW())))=0,\"\",ABS(INDIRECT(CONCATENATE($AI$11,ROW())))+0.000001*G18)","v":210.000012},20,1,14,{"$f":"IF(ISERROR(SEARCH($AM$11,AE18)),0,1)","v":0},{"$f":"VLOOKUP(D18,Setup!$I$6:$K$92,3,FALSE)","v":1},{"$f":"ROUND(IFERROR(IF(AN18=1,Y18,IF(AN18=2,AC18,IF(AN18=3,AD18,AC18))),0),5)","v":0},null,{"$f":"IFERROR(MATCH(D18,Setup!$I$6:$I$92,0),\"\")","v":17},{"$f":"IFERROR(CONCATENATE(LEFT(D18,FIND(\"-\",D18)),IF(AS18=\"\",\"O\",VLOOKUP(AS18,DATA!$E$35:$F$53,2,TRUE))),\"\")","v":"F-M1b"},{"$f":"YEAR(TODAY())-H18","v":45},{"$f":"IF(AN18=1,MATCH(F18,DATA!$AB$2:$AB$34,0),0)","v":23},null,{"$f":"IF(MAX(K18:M18)>0,MAX(K18:M18),0)","v":210},{"$f":"IF(MAX(P18:R18)>0,MAX(P18:R18),0)","v":210},{"$f":"IF(MAX(U18:W18)>0,MAX(U18:W18),0)","v":210},{"$f":"AM18*IF($AM$11=\"PL\",IF(MIN(AV18:AX18)=0,0,AV18+AW18+AX18),IF($AM$11=\"PP\",IF(MIN(AW18:AX18)=0,0,AW18+AX18),IF($AM$11=\"BP\",AW18,IF($AM$11=\"DL\",AX18,AV18))))","v":0},{"$f":"IFERROR(IPF_Formula(E18,I18,AY18),0)","v":0},{"$f":"ROUND(IFERROR(VLOOKUP(AS18,DATA!$A$2:$B$63,2,FALSE),1)*AZ18,5)","v":0},{"$f":"IFERROR(IF(AN18=1,AY18,IF(AN18=2,AZ18,IF(AN18=3,BA18,AZ18))),0)","v":0},null,null,null,null,"16:50:05",null,null,null,null,null,null,null,null,null,null,null,null,null,null,null,null,null,null,{"$f":"IFERROR(IF(FIND(\"DT\",AE18),\"Y\",\"\"),\"\")","v":""},null,{"$f":"CONCATENATE(IF(AN18=4,\"\",D18),IF(AN18=1,F18,\"\"))","v":"F-O84+"},{"$f":"IF($AM$11=\"SQ\",AJ18,IF($AM$11=\"BP\",AK18,AL18))","v":1},{"$f":"1+COUNTIFS(INDIRECT(\"AN12:AN500\"),AN18,INDIRECT(\"CB12:CB500\"),CB18,INDIRECT(\"AO12:AO500\"),\">\"&AO18)\n+COUNTIFS(INDIRECT(\"AO12:AO500\"),AO18,INDIRECT(\"AN12:AN500\"),1,INDIRECT(\"CB12:CB500\"),CB18,INDIRECT(\"E12:E500\"),\"<\"&E18)\n+COUNTIFS(INDIRECT(\"AO12:AO500\"),AO18,INDIRECT(\"AN12:AN500\"),1,INDIRECT(\"CB12:CB500\"),CB18,INDIRECT(\"E12:E500\"),E18,INDIRECT(\"CC12:CC500\"),\"<\"&CC18)","v":2},{"$f":"1+COUNTIFS(INDIRECT(\"AN12:AN500\"),AN18,INDIRECT(\"CB12:CB500\"),CB18,INDIRECT(\"BB12:BB500\"),\">\"&BB18)\n+COUNTIFS(INDIRECT(\"BB12:BB500\"),BB18,INDIRECT(\"AN12:AN500\"),1,INDIRECT(\"CB12:CB500\"),CB18,INDIRECT(\"E12:E500\"),\"<\"&E18)","v":2}]
["B","吉岡 弘和","8suki gym","F-O",52,{"$f":"一般判定(IFERROR(VLOOKUP(E19,DATA!$E$2:$G$22,IF(LEFT(D19,1)=\"M\",2,3)),\"\"),D19)","v":"52"},14,1963,{"$f":"CONCATENATE(LEFT(D19,1),IF(RIGHT(D19,1)=\"U\",\"C\",\"E\"),VLOOKUP($Y$11,$AM$1:$AO$4,3,FALSE))","v":"FEB"},230,230,null,null,{"$f":"IF(MAX(K19:M19)<=0,0,MAX(CELL(\"color\",K19)*K19,CELL(\"color\",L19)*L19,CELL(\"color\",M19)*M19))","v":230},230,230,null,null,{"$f":"IF(MAX(P19:R19)<=0,0,MAX(CELL(\"color\",P19)*P19,CELL(\"color\",Q19)*Q19,CELL(\"color\",R19)*R19))","v":230},{"$f":"IF(OR(N19=0,S19=0),0,N19+S19)","v":460},230,null,null,{"$f":"IF(MAX(U19:W19)<=0,0,MAX(CELL(\"color\",U19)*U19,CELL(\"color\",V19)*V19,CELL(\"color\",W19)*W19))","v":230},{"$f":"AM19*IF($AM$11=\"SQ\",N19,IF($AM$11=\"BP\",S19,IF($AM$11=\"DL\",X19,IF($AM$11=\"PP\",IF(OR(S19=0,X19=0),0,S19+X19),IF(OR(T19=0,X19=0),0,T19+X19)))))","v":0},{"$f":"IF(Y19=0,\"\",CONCATENATE(CD19,\"/\",IF(AN19=4,\"Wilks\",D19),\"/\",IF(AN19>1,\"\",F19),\"/\",$AM$11))","v":""},{"$f":"BB19","v":0},{"$f":"IF(AA19=0,\"\",CE19)","v":""},{"$f":"IFERROR(IPF_Formula(E19,I19,Y19),0)","v":0},{"$f":"IFERROR(VLOOKUP(AS19,DATA!$A$2:$B$63,2,TRUE),0)*AC19","v":0},"PL",null,null,{"$f":"IFERROR(VLOOKUP(A19,Setup!$Q$5:$R$20,2,FALSE),\"\")","v":0},{"$f":"IF(VALUE(INDIRECT(CONCATENATE($AI$11,ROW())))=0,\"\",ABS(INDIRECT(CONCATENATE($AI$11,ROW())))+0.000001*G19)","v":230.00001399999999},22,3,16,{"$f":"IF(ISERROR(SEARCH($AM$11,AE19)),0,1)","v":0},{"$f":"VLOOKUP(D19,Setup!$I$6:$K$92,3,FALSE)","v":1},{"$f":"ROUND(IFERROR(IF(AN19=1,Y19,IF(AN19=2,AC19,IF(AN19=3,AD19,AC19))),0),5)","v":0},null,{"$f":"IFERROR(MATCH(D19,Setup!$I$6:$I$92,0),\"\")","v":17},{"$f":"IFERROR(CONCATENATE(LEFT(D19,FIND(\"-\",D19)),IF(AS19=\"\",\"O\",VLOOKUP(AS19,DATA!$E$35:$F$53,2,TRUE))),\"\")","v":"F-M2b"},{"$f":"YEAR(TODAY())-H19","v":57},{"$f":"IF(AN19=1,MATCH(F19,DATA!$AB$2:$AB$34,0),0)","v":{"$error":"#N/A"}},null,{"$f":"IF(MAX(K19:M19)>0,MAX(K19:M19),0)","v":230},{"$f":"IF(MAX(P19:R19)>0,MAX(P19:R19),0)","v":230},{"$f":"IF(MAX(U19:W19)>0,MAX(U19:W19),0)","v":230},{"$f":"AM19*IF($AM$11=\"PL\",IF(MIN(AV19:AX19)=0,0,AV19+AW19+AX19),IF($AM$11=\"PP\",IF(MIN(AW19:AX19)=0,0,AW19+AX19),IF($AM$11=\"BP\",AW19,IF($AM$11=\"DL\",AX19,AV19))))","v":0},{"$f":"IFERROR(IPF_Formula(E19,I19,AY19),0)","v":0},{"$f":"ROUND(IFERROR(VLOOKUP(AS19,DATA!$A$2:$B$63,2,FALSE),1)*AZ19,5)","v":0},{"$f":"IFERROR(IF(AN19=1,AY19,IF(AN19=2,AZ19,IF(AN19=3,BA19,AZ19))),0)","v":0},null,null,null,null,"16:50:07",null,null,null,null,null,null,null,null,null,null,null,null,null,null,null,null,null,null,{"$f":"IFERROR(IF(FIND(\"DT\",AE19),\"Y\",\"\"),\"\")","v":""},null,{"$f":"CONCATENATE(IF(AN19=4,\"\",D19),IF(AN19=1,F19,\"\"))","v":"F-O52"},{"$f":"IF($AM$11=\"SQ\",AJ19,IF($AM$11=\"BP\",AK19,AL19))","v":3},{"$f":"1+COUNTIFS(INDIRECT(\"AN12:AN500\"),AN19,INDIRECT(\"CB12:CB500\"),CB19,INDIRECT(\"AO12:AO500\"),\">\"&AO19)\n+COUNTIFS(INDIRECT(\"AO12:AO500\"),AO19,INDIRECT(\"AN12:AN500\"),1,INDIRECT(\"CB12:CB500\"),CB19,INDIRECT(\"E12:E500\"),\"<\"&E19)\n+COUNTIFS(INDIRECT(\"AO12:AO500\"),AO19,INDIRECT(\"AN12:AN500\"),1,INDIRECT(\"CB12:CB500\"),CB19,INDIRECT(\"E12:E500\"),E19,INDIRECT(\"CC12:CC500\"),\"<\"&CC19)","v":2},{"$f":"1+COUNTIFS(INDIRECT(\"AN12:AN500\"),AN19,INDIRECT(\"CB12:CB500\"),CB19,INDIRECT(\"BB12:BB500\"),\">\"&BB19)\n+COUNTIFS(INDIRECT(\"BB12:BB500\"),BB19,INDIRECT(\"AN12:AN500\"),1,INDIRECT(\"CB12:CB500\"),CB19,INDIRECT(\"E12:E500\"),\"<\"&E19)","v":2}]
["A","伊藤 由実子","8suki gym","F-O",46,{"$f":"一般判定(IFERROR(VLOOKUP(E20,DATA!$E$2:$G$22,IF(LEFT(D20,1)=\"M\",2,3)),\"\"),D20)","v":"47"},2,1976,{"$f":"CONCATENATE(LEFT(D20,1),IF(RIGHT(D20,1)=\"U\",\"C\",\"E\"),VLOOKUP($Y$11,$AM$1:$AO$4,3,FALSE))","v":"FEB"},110,110,null,null,{"$f":"IF(MAX(K20:M20)<=0,0,MAX(CELL(\"color\",K20)*K20,CELL(\"color\",L20)*L20,CELL(\"color\",M20)*M20))","v":110},110,110,null,null,{"$f":"IF(MAX(P20:R20)<=0,0,MAX(CELL(\"color\",P20)*P20,CELL(\"color\",Q20)*Q20,CELL(\"color\",R20)*R20))","v":110},{"$f":"IF(OR(N20=0,S20=0),0,N20+S20)","v":220},110,null,null,{"$f":"IF(MAX(U20:W20)<=0,0,MAX(CELL(\"color\",U20)*U20,CELL(\"color\",V20)*V20,CELL(\"color\",W20)*W20))","v":110},{"$f":"AM20*IF($AM$11=\"SQ\",N20,IF($AM$11=\"BP\",S20,IF($AM$11=\"DL\",X20,IF($AM$11=\"PP\",IF(OR(S20=0,X20=0),0,S20+X20),IF(OR(T20=0,X20=0),0,T20+X20)))))","v":0},{"$f":"IF(Y20=0,\"\",CONCATENATE(CD20,\"/\",IF(AN20=4,\"Wilks\",D20),\"/\",IF(AN20>1,\"\",F20),\"/\",$AM$11))","v":""},{"$f":"BB20","v":0},{"$f":"IF(AA20=0,\"\",CE20)","v":""},{"$f":"IFERROR(IPF_Formula(E20,I20,Y20),0)","v":0},{"$f":"IFERROR(VLOOKUP(AS20,DATA!$A$2:$B$63,2,TRUE),0)*AC20","v":0},"PL",null,null,{"$f":"IFERROR(VLOOKUP(A20,Setup!$Q$5:$R$20,2,FALSE),\"\")","v":12},{"$f":"IF(VALUE(INDIRECT(CONCATENATE($AI$11,ROW())))=0,\"\",ABS(INDIRECT(CONCATENATE($AI$11,ROW())))+0.000001*G20)","v":110.00000199999999},10,10,2,{"$f":"IF(ISERROR(SEARCH($AM$11,AE20)),0,1)","v":0},{"$f":"VLOOKUP(D20,Setup!$I$6:$K$92,3,FALSE)","v":1},{"$f":"ROUND(IFERROR(IF(AN20=1,Y20,IF(AN20=2,AC20,IF(AN20=3,AD20,AC20))),0),5)","v":0},null,{"$f":"IFERROR(MATCH(D20,Setup!$I$6:$I$92,0),\"\")","v":17},{"$f":"IFERROR(CONCATENATE(LEFT(D20,FIND(\"-\",D20)),IF(AS20=\"\",\"O\",VLOOKUP(AS20,DATA!$E$35:$F$53,2,TRUE))),\"\")","v":"F-M1a"},{"$f":"YEAR(TODAY())-H20","v":44},{"$f":"IF(AN20=1,MATCH(F20,DATA!$AB$2:$AB$34,0),0)","v":{"$error":"#N/A"}},null,{"$f":"IF(MAX(K20:M20)>0,MAX(K20:M20),0)","v":110},{"$f":"IF(MAX(P20:R20)>0,MAX(P20:R20),0)","v":110},{"$f":"IF(MAX(U20:W20)>0,MAX(U20:W20),0)","v":110},{"$f":"AM20*IF($AM$11=\"PL\",IF(MIN(AV20:AX20)=0,0,AV20+AW20+AX20),IF($AM$11=\"PP\",IF(MIN(AW20:AX20)=0,0,AW20+AX20),IF($AM$11=\"BP\",AW20,IF($AM$11=\"DL\",AX20,AV20))))","v":0},{"$f":"IFERROR(IPF_Formula(E20,I20,AY20),0)","v":0},{"$f":"ROUND(IFERROR(VLOOKUP(AS20,DATA!$A$2:$B$63,2,FALSE),1)*AZ20,5)","v":0},{"$f":"IFERROR(IF(AN20=1,AY20,IF(AN20=2,AZ20,IF(AN20=3,BA20,AZ20))),0)","v":0},null,null,null,null,null,null,null,null,null,null,null,null,null,null,null,null,null,null,null,null,null,null,null,{"$f":"IFERROR(IF(FIND(\"DT\",AE20),\"Y\",\"\"),\"\")","v":""},null,{"$f":"CONCATENATE(IF(AN20=4,\"\",D20),IF(AN20=1,F20,\"\"))","v":"F-O47"},{"$f":"IF($AM$11=\"SQ\",AJ20,IF($AM$11=\"BP\",AK20,AL20))","v":10},{"$f":"1+COUNTIFS(INDIRECT(\"AN12:AN500\"),AN20,INDIRECT(\"CB12:CB500\"),CB20,INDIRECT(\"AO12:AO500\"),\">\"&AO20)\n+COUNTIFS(INDIRECT(\"AO12:AO500\"),AO20,INDIRECT(\"AN12:AN500\"),1,INDIRECT(\"CB12:CB500\"),CB20,INDIRECT(\"E12:E500\"),\"<\"&E20)\n+COUNTIFS(INDIRECT(\"AO12:AO500\"),AO20,INDIRECT(\"AN12:AN500\"),1,INDIRECT(\"CB12:CB500\"),CB20,INDIRECT(\"E12:E500\"),E20,INDIRECT(\"CC12:CC500\"),\"<\"&CC20)","v":2},{"$f":"1+COUNTIFS(INDIRECT(\"AN12:AN500\"),AN20,INDIRECT(\"CB12:CB500\"),CB20,INDIRECT(\"BB12:BB500\"),\">\"&BB20)\n+COUNTIFS(INDIRECT(\"BB12:BB500\"),BB20,INDIRECT(\"AN12:AN500\"),1,INDIRECT(\"CB12:CB500\"),CB20,INDIRECT(\"E12:E500\"),\"<\"&E20)","v":2}]
["A","松尾 直樹","8sukigym","F-O",60,{"$f":"一般判定(IFERROR(VLOOKUP(E21,DATA!$E$2:$G$22,IF(LEFT(D21,1)=\"M\",2,3)),\"\"),D21)","v":"63"},6,1963,{"$f":"CONCATENATE(LEFT(D21,1),IF(RIGHT(D21,1)=\"U\",\"C\",\"E\"),VLOOKUP($Y$11,$AM$1:$AO$4,3,FALSE))","v":"FEB"},150,150,null,null,{"$f":"IF(MAX(K21:M21)<=0,0,MAX(CELL(\"color\",K21)*K21,CELL(\"color\",L21)*L21,CELL(\"color\",M21)*M21))","v":150},150,150,null,null,{"$f":"IF(MAX(P21:R21)<=0,0,MAX(CELL(\"color\",P21)*P21,CELL(\"color\",Q21)*Q21,CELL(\"color\",R21)*R21))","v":150},{"$f":"IF(OR(N21=0,S21=0),0,N21+S21)","v":300},150,null,null,{"$f":"IF(MAX(U21:W21)<=0,0,MAX(CELL(\"color\",U21)*U21,CELL(\"color\",V21)*V21,CELL(\"color\",W21)*W21))","v":150},{"$f":"AM21*IF($AM$11=\"SQ\",N21,IF($AM$11=\"BP\",S21,IF($AM$11=\"DL\",X21,IF($AM$11=\"PP\",IF(OR(S21=0,X21=0),0,S21+X21),IF(OR(T21=0,X21=0),0,T21+X21)))))","v":0},{"$f":"IF(Y21=0,\"\",CONCATENATE(CD21,\"/\",IF(AN21=4,\"Wilks\",D21),\"/\",IF(AN21>1,\"\",F21),\"/\",$AM$11))","v":""},{"$f":"BB21","v":0},{"$f":"IF(AA21=0,\"\",CE21)","v":""},{"$f":"IFERROR(IPF_Formula(E21,I21,Y21),0)","v":0},{"$f":"IFERROR(VLOOKUP(AS21,DATA!$A$2:$B$63,2,TRUE),0)*AC21","v":0},"PL",null,null,{"$f":"IFERROR(VLOOKUP(A21,Setup!$Q$5:$R$20,2,FALSE),\"\")","v":12},{"$f":"IF(VALUE(INDIRECT(CONCATENATE($AI$11,ROW())))=0,\"\",ABS(INDIRECT(CONCATENATE($AI$11,ROW())))+0.000001*G21)","v":150.00000600000001},14,14,6,{"$f":"IF(ISERROR(SEARCH($AM$11,AE21)),0,1)","v":0},{"$f":"VLOOKUP(D21,Setup!$I$6:$K$92,3,FALSE)","v":1},{"$f":"ROUND(IFERROR(IF(AN21=1,Y21,IF(AN21=2,AC21,IF(AN21=3,AD21,AC21))),0),5)","v":0},null,{"$f":"IFERROR(MATCH(D21,Setup!$I$6:$I$92,0),\"\")","v":17},{"$f":"IFERROR(CONCATENATE(LEFT(D21,FIND(\"-\",D21)),IF(AS21=\"\",\"O\",VLOOKUP(AS21,DATA!$E$35:$F$53,2,TRUE))),\"\")","v":"F-M2b"},{"$f":"YEAR(TODAY())-H21","v":57},{"$f":"IF(AN21=1,MATCH(F21,DATA!$AB$2:$AB$34,0),0)","v":{"$error":"#N/A"}},null,{"$f":"IF(MAX(K21:M21)>0,MAX(K21:M21),0)","v":150},{"$f":"IF(MAX(P21:R21)>0,MAX(P21:R21),0)","v":150},{"$f":"IF(MAX(U21:W21)>0,MAX(U21:W21),0)","v":150},{"$f":"AM21*IF($AM$11=\"PL\",IF(MIN(AV21:AX21)=0,0,AV21+AW21+AX21),IF($AM$11=\"PP\",IF(MIN(AW21:AX21)=0,0,AW21+AX21),IF($AM$11=\"BP\",AW21,IF($AM$11=\"DL\",AX21,AV21))))","v":0},{"$f":"IFERROR(IPF_Formula(E21,I21,AY21),0)","v":0},{"$f":"ROUND(IFERROR(VLOOKUP(AS21,DATA!$A$2:$B$63,2,FALSE),1)*AZ21,5)","v":0},{"$f":"IFERROR(IF(AN21=1,AY21,IF(AN21=2,AZ21,IF(AN21=3,BA21,AZ21))),0)","v":0},null,null,null,null,null,null,null,null,null,null,null,null,null,null,null,null,null,null,null,null,null,null,null,{"$f":"IFERROR(IF(FIND(\"DT\",AE21),\"Y\",\"\"),\"\")","v":""},null,{"$f":"CONCATENATE(IF(AN21=4,\"\",D21),IF(AN21=1,F21,\"\"))","v":"F-O63"},{"$f":"IF($AM$11=\"SQ\",AJ21,IF($AM$11=\"BP\",AK21,AL21))","v":14},{"$f":"1+COUNTIFS(INDIRECT(\"AN12:AN500\"),AN21,INDIRECT(\"CB12:CB500\"),CB21,INDIRECT(\"AO12:AO500\"),\">\"&AO21)\n+COUNTIFS(INDIRECT(\"AO12:AO500\"),AO21,INDIRECT(\"AN12:AN500\"),1,INDIRECT(\"CB12:CB500\"),CB21,INDIRECT(\"E12:E500\"),\"<\"&E21)\n+COUNTIFS(INDIRECT(\"AO12:AO500\"),AO21,INDIRECT(\"AN12:AN500\"),1,INDIRECT(\"CB12:CB500\"),CB21,INDIRECT(\"E12:E500\"),E21,INDIRECT(\"CC12:CC500\"),\"<\"&CC21)","v":1},{"$f":"1+COUNTIFS(INDIRECT(\"AN12:AN500\"),AN21,INDIRECT(\"CB12:CB500\"),CB21,INDIRECT(\"BB12:BB500\"),\">\"&BB21)\n+COUNTIFS(INDIRECT(\"BB12:BB500\"),BB21,INDIRECT(\"AN12:AN500\"),1,INDIRECT(\"CB12:CB500\"),CB21,INDIRECT(\"E12:E500\"),\"<\"&E21)","v":1}]
["A","三木 聖也","8sukiGYM","F-O",54,{"$f":"一般判定(IFERROR(VLOOKUP(E22,DATA!$E$2:$G$22,IF(LEFT(D22,1)=\"M\",2,3)),\"\"),D22)","v":"57"},7,1996,{"$f":"CONCATENATE(LEFT(D22,1),IF(RIGHT(D22,1)=\"U\",\"C\",\"E\"),VLOOKUP($Y$11,$AM$1:$AO$4,3,FALSE))","v":"FEB"},160,160,null,null,{"$f":"IF(MAX(K22:M22)<=0,0,MAX(CELL(\"color\",K22)*K22,CELL(\"color\",L22)*L22,CELL(\"color\",M22)*M22))","v":160},160,160,null,null,{"$f":"IF(MAX(P22:R22)<=0,0,MAX(CELL(\"color\",P22)*P22,CELL(\"color\",Q22)*Q22,CELL(\"color\",R22)*R22))","v":160},{"$f":"IF(OR(N22=0,S22=0),0,N22+S22)","v":320},160,null,null,{"$f":"IF(MAX(U22:W22)<=0,0,MAX(CELL(\"color\",U22)*U22,CELL(\"color\",V22)*V22,CELL(\"color\",W22)*W22))","v":160},{"$f":"AM22*IF($AM$11=\"SQ\",N22,IF($AM$11=\"BP\",S22,IF($AM$11=\"DL\",X22,IF($AM$11=\"PP\",IF(OR(S22=0,X22=0),0,S22+X22),IF(OR(T22=0,X22=0),0,T22+X22)))))","v":0},{"$f":"IF(Y22=0,\"\",CONCATENATE(CD22,\"/\",IF(AN22=4,\"Wilks\",D22),\"/\",IF(AN22>1,\"\",F22),\"/\",$AM$11))","v":""},{"$f":"BB22","v":0},{"$f":"IF(AA22=0,\"\",CE22)","v":""},{"$f":"IFERROR(IPF_Formula(E22,I22,Y22),0)","v":0},{"$f":"IFERROR(VLOOKUP(AS22,DATA!$A$2:$B$63,2,TRUE),0)*AC22","v":0},"PL",null,null,{"$f":"IFERROR(VLOOKUP(A22,Setup!$Q$5:$R$20,2,FALSE),\"\")","v":12},{"$f":"IF(VALUE(INDIRECT(CONCATENATE($AI$11,ROW())))=0,\"\",ABS(INDIRECT(CONCATENATE($AI$11,ROW())))+0.000001*G22)","v":160.00000700000001},15,15,7,{"$f":"IF(ISERROR(SEARCH($AM$11,AE22)),0,1)","v":0},{"$f":"VLOOKUP(D22,Setup!$I$6:$K$92,3,FALSE)","v":1},{"$f":"ROUND(IFERROR(IF(AN22=1,Y22,IF(AN22=2,AC22,IF(AN22=3,AD22,AC22))),0),5)","v":0},null,{"$f":"IFERROR(MATCH(D22,Setup!$I$6:$I$92,0),\"\")","v":17},{"$f":"IFERROR(CONCATENATE(LEFT(D22,FIND(\"-\",D22)),IF(AS22=\"\",\"O\",VLOOKUP(AS22,DATA!$E$35:$F$53,2,TRUE))),\"\")","v":"F-O"},{"$f":"YEAR(TODAY())-H22","v":24},{"$f":"IF(AN22=1,MATCH(F22,DATA!$AB$2:$AB$34,0),0)","v":{"$error":"#N/A"}},null,{"$f":"IF(MAX(K22:M22)>0,MAX(K22:M22),0)","v":160},{"$f":"IF(MAX(P22:R22)>0,MAX(P22:R22),0)","v":160},{"$f":"IF(MAX(U22:W22)>0,MAX(U22:W22),0)","v":160},{"$f":"AM22*IF($AM$11=\"PL\",IF(MIN(AV22:AX22)=0,0,AV22+AW22+AX22),IF($AM$11=\"PP\",IF(MIN(AW22:AX22)=0,0,AW22+AX22),IF($AM$11=\"BP\",AW22,IF($AM$11=\"DL\",AX22,AV22))))","v":0},{"$f":"IFERROR(IPF_Formula(E22,I22,AY22),0)","v":0},{"$f":"ROUND(IFERROR(VLOOKUP(AS22,DATA!$A$2:$B$63,2,FALSE),1)*AZ22,5)","v":0},{"$f":"IFERROR(IF(AN22=1,AY22,IF(AN22=2,AZ22,IF(AN22=3,BA22,AZ22))),0)","v":0},null,null,null,null,null,null,null,null,null,null,null,null,null,null,null,null,null,null,null,null,null,null,null,{"$f":"IFERROR(IF(FIND(\"DT\",AE22),\"Y\",\"\"),\"\")","v":""},null,{"$f":"CONCATENATE(IF(AN22=4,\"\",D22),IF(AN22=1,F22,\"\"))","v":"F-O57"},{"$f":"IF($AM$11=\"SQ\",AJ22,IF($AM$11=\"BP\",AK22,AL22))","v":15},{"$f":"1+COUNTIFS(INDIRECT(\"AN12:AN500\"),AN22,INDIRECT(\"CB12:CB500\"),CB22,INDIRECT(\"AO12:AO500\"),\">\"&AO22)\n+COUNTIFS(INDIRECT(\"AO12:AO500\"),AO22,INDIRECT(\"AN12:AN500\"),1,INDIRECT(\"CB12:CB500\"),CB22,INDIRECT(\"E12:E500\"),\"<\"&E22)\n+COUNTIFS(INDIRECT(\"AO12:AO500\"),AO22,INDIRECT(\"AN12:AN500\"),1,INDIRECT(\"CB12:CB500\"),CB22,INDIRECT(\"E12:E500\"),E22,INDIRECT(\"CC12:CC500\"),\"<\"&CC22)","v":1},{"$f":"1+COUNTIFS(INDIRECT(\"AN12:AN500\"),AN22,INDIRECT(\"CB12:CB500\"),CB22,INDIRECT(\"BB12:BB500\"),\">\"&BB22)\n+COUNTIFS(INDIRECT(\"BB12:BB500\"),BB22,INDIRECT(\"AN12:AN500\"),1,INDIRECT(\"CB12:CB500\"),CB22,INDIRECT(\"E12:E500\"),\"<\"&E22)","v":1}]
["A","山本 泰資","8sukigym","F-O",70,{"$f":"一般判定(IFERROR(VLOOKUP(E23,DATA!$E$2:$G$22,IF(LEFT(D23,1)=\"M\",2,3)),\"\"),D23)","v":"72"},8,1993,{"$f":"CONCATENATE(LEFT(D23,1),IF(RIGHT(D23,1)=\"U\",\"C\",\"E\"),VLOOKUP($Y$11,$AM$1:$AO$4,3,FALSE))","v":"FEB"},170,170,null,null,{"$f":"IF(MAX(K23:M23)<=0,0,MAX(CELL(\"color\",K23)*K23,CELL(\"color\",L23)*L23,CELL(\"color\",M23)*M23))","v":170},170,170,null,null,{"$f":"IF(MAX(P23:R23)<=0,0,MAX(CELL(\"color\",P23)*P23,CELL(\"color\",Q23)*Q23,CELL(\"color\",R23)*R23))","v":170},{"$f":"IF(OR(N23=0,S23=0),0,N23+S23)","v":340},170,null,null,{"$f":"IF(MAX(U23:W23)<=0,0,MAX(CELL(\"color\",U23)*U23,CELL(\"color\",V23)*V23,CELL(\"color\",W23)*W23))","v":170},{"$f":"AM23*IF($AM$11=\"SQ\",N23,IF($AM$11=\"BP\",S23,IF($AM$11=\"DL\",X23,IF($AM$11=\"PP\",IF(OR(S23=0,X23=0),0,S23+X23),IF(OR(T23=0,X23=0),0,T23+X23)))))","v":0},{"$f":"IF(Y23=0,\"\",CONCATENATE(CD23,\"/\",IF(AN23=4,\"Wilks\",D23),\"/\",IF(AN23>1,\"\",F23),\"/\",$AM$11))","v":""},{"$f":"BB23","v":0},{"$f":"IF(AA23=0,\"\",CE23)","v":""},{"$f":"IFERROR(IPF_Formula(E23,I23,Y23),0)","v":0},{"$f":"IFERROR(VLOOKUP(AS23,DATA!$A$2:$B$63,2,TRUE),0)*AC23","v":0},"PL",null,null,{"$f":"IFERROR(VLOOKUP(A23,Setup!$Q$5:$R$20,2,FALSE),\"\")","v":12},{"$f":"IF(VALUE(INDIRECT(CONCATENATE($AI$11,ROW())))=0,\"\",ABS(INDIRECT(CONCATENATE($AI$11,ROW())))+0.000001*G23)","v":170.00000800000001},16,16,8,{"$f":"IF(ISERROR(SEARCH($AM$11,AE23)),0,1)","v":0},{"$f":"VLOOKUP(D23,Setup!$I$6:$K$92,3,FALSE)","v":1},{"$f":"ROUND(IFERROR(IF(AN23=1,Y23,IF(AN23=2,AC23,IF(AN23=3,AD23,AC23))),0),5)","v":0},null,{"$f":"IFERROR(MATCH(D23,Setup!$I$6:$I$92,0),\"\")","v":17},{"$f":"IFERROR(CONCATENATE(LEFT(D23,FIND(\"-\",D23)),IF(AS23=\"\",\"O\",VLOOKUP(AS23,DATA!$E$35:$F$53,2,TRUE))),\"\")","v":"F-O"},{"$f":"YEAR(TODAY())-H23","v":27},{"$f":"IF(AN23=1,MATCH(F23,DATA!$AB$2:$AB$34,0),0)","v":{"$error":"#N/A"}},null,{"$f":"IF(MAX(K23:M23)>0,MAX(K23:M23),0)","v":170},{"$f":"IF(MAX(P23:R23)>0,MAX(P23:R23),0)","v":170},{"$f":"IF(MAX(U23:W23)>0,MAX(U23:W23),0)","v":170},{"$f":"AM23*IF($AM$11=\"PL\",IF(MIN(AV23:AX23)=0,0,AV23+AW23+AX23),IF($AM$11=\"PP\",IF(MIN(AW23:AX23)=0,0,AW23+AX23),IF($AM$11=\"BP\",AW23,IF($AM$11=\"DL\",AX23,AV23))))","v":0},{"$f":"IFERROR(IPF_Formula(E23,I23,AY23),0)","v":0},{"$f":"ROUND(IFERROR(VLOOKUP(AS23,DATA!$A$2:$B$63,2,FALSE),1)*AZ23,5)","v":0},{"$f":"IFERROR(IF(AN23=1,AY23,IF(AN23=2,AZ23,IF(AN23=3,BA23,AZ23))),0)","v":0},null,null,null,null,null,null,null,null,null,null,null,null,null,null,null,null,null,null,null,null,null,null,null,{"$f":"IFERROR(IF(FIND(\"DT\",AE23),\"Y\",\"\"),\"\")","v":""},null,{"$f":"CONCATENATE(IF(AN23=4,\"\",D23),IF(AN23=1,F23,\"\"))","v":"F-O72"},{"$f":"IF($AM$11=\"SQ\",AJ23,IF($AM$11=\"BP\",AK23,AL23))","v":16},{"$f":"1+COUNTIFS(INDIRECT(\"AN12:AN500\"),AN23,INDIRECT(\"CB12:CB500\"),CB23,INDIRECT(\"AO12:AO500\"),\">\"&AO23)\n+COUNTIFS(INDIRECT(\"AO12:AO500\"),AO23,INDIRECT(\"AN12:AN500\"),1,INDIRECT(\"CB12:CB500\"),CB23,INDIRECT(\"E12:E500\"),\"<\"&E23)\n+COUNTIFS(INDIRECT(\"AO12:AO500\"),AO23,INDIRECT(\"AN12:AN500\"),1,INDIRECT(\"CB12:CB500\"),CB23,INDIRECT(\"E12:E500\"),E23,INDIRECT(\"CC12:CC500\"),\"<\"&CC23)","v":2},{"$f":"1+COUNTIFS(INDIRECT(\"AN12:AN500\"),AN23,INDIRECT(\"CB12:CB500\"),CB23,INDIRECT(\"BB12:BB500\"),\">\"&BB23)\n+COUNTIFS(INDIRECT(\"BB12:BB500\"),BB23,INDIRECT(\"AN12:AN500\"),1,INDIRECT(\"CB12:CB500\"),CB23,INDIRECT(\"E12:E500\"),\"<\"&E23)","v":2}]
["A","大寺 康平","8suki gym","F-O",75,{"$f":"一般判定(IFERROR(VLOOKUP(E24,DATA!$E$2:$G$22,IF(LEFT(D24,1)=\"M\",2,3)),\"\"),D24)","v":"84"},11,1987,{"$f":"CONCATENATE(LEFT(D24,1),IF(RIGHT(D24,1)=\"U\",\"C\",\"E\"),VLOOKUP($Y$11,$AM$1:$AO$4,3,FALSE))","v":"FEB"},200,200,null,null,{"$f":"IF(MAX(K24:M24)<=0,0,MAX(CELL(\"color\",K24)*K24,CELL(\"color\",L24)*L24,CELL(\"color\",M24)*M24))","v":200},200,200,null,null,{"$f":"IF(MAX(P24:R24)<=0,0,MAX(CELL(\"color\",P24)*P24,CELL(\"color\",Q24)*Q24,CELL(\"color\",R24)*R24))","v":200},{"$f":"IF(OR(N24=0,S24=0),0,N24+S24)","v":400},200,null,null,{"$f":"IF(MAX(U24:W24)<=0,0,MAX(CELL(\"color\",U24)*U24,CELL(\"color\",V24)*V24,CELL(\"color\",W24)*W24))","v":200},{"$f":"AM24*IF($AM$11=\"SQ\",N24,IF($AM$11=\"BP\",S24,IF($AM$11=\"DL\",X24,IF($AM$11=\"PP\",IF(OR(S24=0,X24=0),0,S24+X24),IF(OR(T24=0,X24=0),0,T24+X24)))))","v":0},{"$f":"IF(Y24=0,\"\",CONCATENATE(CD24,\"/\",IF(AN24=4,\"Wilks\",D24),\"/\",IF(AN24>1,\"\",F24),\"/\",$AM$11))","v":""},{"$f":"BB24","v":0},{"$f":"IF(AA24=0,\"\",CE24)","v":""},{"$f":"IFERROR(IPF_Formula(E24,I24,Y24),0)","v":0},{"$f":"IFERROR(VLOOKUP(AS24,DATA!$A$2:$B$63,2,TRUE),0)*AC24","v":0},"PL",null,null,{"$f":"IFERROR(VLOOKUP(A24,Setup!$Q$5:$R$20,2,FALSE),\"\")","v":12},{"$f":"IF(VALUE(INDIRECT(CONCATENATE($AI$11,ROW())))=0,\"\",ABS(INDIRECT(CONCATENATE($AI$11,ROW())))+0.000001*G24)","v":200.000011},19,19,13,{"$f":"IF(ISERROR(SEARCH($AM$11,AE24)),0,1)","v":0},{"$f":"VLOOKUP(D24,Setup!$I$6:$K$92,3,FALSE)","v":1},{"$f":"ROUND(IFERROR(IF(AN24=1,Y24,IF(AN24=2,AC24,IF(AN24=3,AD24,AC24))),0),5)","v":0},null,{"$f":"IFERROR(MATCH(D24,Setup!$I$6:$I$92,0),\"\")","v":17},{"$f":"IFERROR(CONCATENATE(LEFT(D24,FIND(\"-\",D24)),IF(AS24=\"\",\"O\",VLOOKUP(AS24,DATA!$E$35:$F$53,2,TRUE))),\"\")","v":"F-O"},{"$f":"YEAR(TODAY())-H24","v":33},{"$f":"IF(AN24=1,MATCH(F24,DATA!$AB$2:$AB$34,0),0)","v":{"$error":"#N/A"}},null,{"$f":"IF(MAX(K24:M24)>0,MAX(K24:M24),0)","v":200},{"$f":"IF(MAX(P24:R24)>0,MAX(P24:R24),0)","v":200},{"$f":"IF(MAX(U24:W24)>0,MAX(U24:W24),0)","v":200},{"$f":"AM24*IF($AM$11=\"PL\",IF(MIN(AV24:AX24)=0,0,AV24+AW24+AX24),IF($AM$11=\"PP\",IF(MIN(AW24:AX24)=0,0,AW24+AX24),IF($AM$11=\"BP\",AW24,IF($AM$11=\"DL\",AX24,AV24))))","v":0},{"$f":"IFERROR(IPF_Formula(E24,I24,AY24),0)","v":0},{"$f":"ROUND(IFERROR(VLOOKUP(AS24,DATA!$A$2:$B$63,2,FALSE),1)*AZ24,5)","v":0},{"$f":"IFERROR(IF(AN24=1,AY24,IF(AN24=2,AZ24,IF(AN24=3,BA24,AZ24))),0)","v":0},null,null,null,null,null,null,null,null,null,null,null,null,null,null,null,null,null,null,null,null,null,null,null,{"$f":"IFERROR(IF(FIND(\"DT\",AE24),\"Y\",\"\"),\"\")","v":""},null,{"$f":"CONCATENATE(IF(AN24=4,\"\",D24),IF(AN24=1,F24,\"\"))","v":"F-O84"},{"$f":"IF($AM$11=\"SQ\",AJ24,IF($AM$11=\"BP\",AK24,AL24))","v":19},{"$f":"1+COUNTIFS(INDIRECT(\"AN12:AN500\"),AN24,INDIRECT(\"CB12:CB500\"),CB24,INDIRECT(\"AO12:AO500\"),\">\"&AO24)\n+COUNTIFS(INDIRECT(\"AO12:AO500\"),AO24,INDIRECT(\"AN12:AN500\"),1,INDIRECT(\"CB12:CB500\"),CB24,INDIRECT(\"E12:E500\"),\"<\"&E24)\n+COUNTIFS(INDIRECT(\"AO12:AO500\"),AO24,INDIRECT(\"AN12:AN500\"),1,INDIRECT(\"CB12:CB500\"),CB24,INDIRECT(\"E12:E500\"),E24,INDIRECT(\"CC12:CC500\"),\"<\"&CC24)","v":2},{"$f":"1+COUNTIFS(INDIRECT(\"AN12:AN500\"),AN24,INDIRECT(\"CB12:CB500\"),CB24,INDIRECT(\"BB12:BB500\"),\">\"&BB24)\n+COUNTIFS(INDIRECT(\"BB12:BB500\"),BB24,INDIRECT(\"AN12:AN500\"),1,INDIRECT(\"CB12:CB500\"),CB24,INDIRECT(\"E12:E500\"),\"<\"&E24)","v":1}]
["A","中川 貴美子","8suki gym","F-O",42,{"$f":"一般判定(IFERROR(VLOOKUP(E25,DATA!$E$2:$G$22,IF(LEFT(D25,1)=\"M\",2,3)),\"\"),D25)","v":"47"},1,1982,{"$f":"CONCATENATE(LEFT(D25,1),IF(RIGHT(D25,1)=\"U\",\"C\",\"E\"),VLOOKUP($Y$11,$AM$1:$AO$4,3,FALSE))","v":"FEB"},100,100,null,null,{"$f":"IF(MAX(K25:M25)<=0,0,MAX(CELL(\"color\",K25)*K25,CELL(\"color\",L25)*L25,CELL(\"color\",M25)*M25))","v":100},100,100,null,null,{"$f":"IF(MAX(P25:R25)<=0,0,MAX(CELL(\"color\",P25)*P25,CELL(\"color\",Q25)*Q25,CELL(\"color\",R25)*R25))","v":100},{"$f":"IF(OR(N25=0,S25=0),0,N25+S25)","v":200},100,null,null,{"$f":"IF(MAX(U25:W25)<=0,0,MAX(CELL(\"color\",U25)*U25,CELL(\"color\",V25)*V25,CELL(\"color\",W25)*W25))","v":100},{"$f":"AM25*IF($AM$11=\"SQ\",N25,IF($AM$11=\"BP\",S25,IF($AM$11=\"DL\",X25,IF($AM$11=\"PP\",IF(OR(S25=0,X25=0),0,S25+X25),IF(OR(T25=0,X25=0),0,T25+X25)))))","v":0},{"$f":"IF(Y25=0,\"\",CONCATENATE(CD25,\"/\",IF(AN25=4,\"Wilks\",D25),\"/\",IF(AN25>1,\"\",F25),\"/\",$AM$11))","v":""},{"$f":"BB25","v":0},{"$f":"IF(AA25=0,\"\",CE25)","v":""},{"$f":"IFERROR(IPF_Formula(E25,I25,Y25),0)","v":0},{"$f":"IFERROR(VLOOKUP(AS25,DATA!$A$2:$B$63,2,TRUE),0)*AC25","v":0},"PL",null,null,{"$f":"IFERROR(VLOOKUP(A25,Setup!$Q$5:$R$20,2,FALSE),\"\")","v":12},{"$f":"IF(VALUE(INDIRECT(CONCATENATE($AI$11,ROW())))=0,\"\",ABS(INDIRECT(CONCATENATE($AI$11,ROW())))+0.000001*G25)","v":100.000001},9,9,1,{"$f":"IF(ISERROR(SEARCH($AM$11,AE25)),0,1)","v":0},{"$f":"VLOOKUP(D25,Setup!$I$6:$K$92,3,FALSE)","v":1},{"$f":"ROUND(IFERROR(IF(AN25=1,Y25,IF(AN25=2,AC25,IF(AN25=3,AD25,AC25))),0),5)","v":0},null,{"$f":"IFERROR(MATCH(D25,Setup!$I$6:$I$92,0),\"\")","v":17},{"$f":"IFERROR(CONCATENATE(LEFT(D25,FIND(\"-\",D25)),IF(AS25=\"\",\"O\",VLOOKUP(AS25,DATA!$E$35:$F$53,2,TRUE))),\"\")","v":"F-O"},{"$f":"YEAR(TODAY())-H25","v":38},{"$f":"IF(AN25=1,MATCH(F25,DATA!$AB$2:$AB$34,0),0)","v":{"$error":"#N/A"}},null,{"$f":"IF(MAX(K25:M25)>0,MAX(K25:M25),0)","v":100},{"$f":"IF(MAX(P25:R25)>0,MAX(P25:R25),0)","v":100},{"$f":"IF(MAX(U25:W25)>0,MAX(U25:W25),0)","v":100},{"$f":"AM25*IF($AM$11=\"PL\",IF(MIN(AV25:AX25)=0,0,AV25+AW25+AX25),IF($AM$11=\"PP\",IF(MIN(AW25:AX25)=0,0,AW25+AX25),IF($AM$11=\"BP\",AW25,IF($AM$11=\"DL\",AX25,AV25))))","v":0},{"$f":"IFERROR(IPF_Formula(E25,I25,AY25),0)","v":0},{"$f":"ROUND(IFERROR(VLOOKUP(AS25,DATA!$A$2:$B$63,2,FALSE),1)*AZ25,5)","v":0},{"$f":"IFERROR(IF(AN25=1,AY25,IF(AN25=2,AZ25,IF(AN25=3,BA25,AZ25))),0)","v":0},null,null,null,null,null,null,null,null,null,null,null,null,null,null,null,null,null,null,null,null,null,null,null,{"$f":"IFERROR(IF(FIND(\"DT\",AE25),\"Y\",\"\"),\"\")","v":""},null,{"$f":"CONCATENATE(IF(AN25=4,\"\",D25),IF(AN25=1,F25,\"\"))","v":"F-O47"},{"$f":"IF($AM$11=\"SQ\",AJ25,IF($AM$11=\"BP\",AK25,AL25))","v":9},{"$f":"1+COUNTIFS(INDIRECT(\"AN12:AN500\"),AN25,INDIRECT(\"CB12:CB500\"),CB25,INDIRECT(\"AO12:AO500\"),\">\"&AO25)\n+COUNTIFS(INDIRECT(\"AO12:AO500\"),AO25,INDIRECT(\"AN12:AN500\"),1,INDIRECT(\"CB12:CB500\"),CB25,INDIRECT(\"E12:E500\"),\"<\"&E25)\n+COUNTIFS(INDIRECT(\"AO12:AO500\"),AO25,INDIRECT(\"AN12:AN500\"),1,INDIRECT(\"CB12:CB500\"),CB25,INDIRECT(\"E12:E500\"),E25,INDIRECT(\"CC12:CC500\"),\"<\"&CC25)","v":1},{"$f":"1+COUNTIFS(INDIRECT(\"AN12:AN500\"),AN25,INDIRECT(\"CB12:CB500\"),CB25,INDIRECT(\"BB12:BB500\"),\">\"&BB25)\n+COUNTIFS(INDIRECT(\"BB12:BB500\"),BB25,INDIRECT(\"AN12:AN500\"),1,INDIRECT(\"CB12:CB500\"),CB25,INDIRECT(\"E12:E500\"),\"<\"&E25)","v":1}]
["A","丸山 武","8suki gym","F-O",50,{"$f":"一般判定(IFERROR(VLOOKUP(E26,DATA!$E$2:$G$22,IF(LEFT(D26,1)=\"M\",2,3)),\"\"),D26)","v":"52"},3,1981,{"$f":"CONCATENATE(LEFT(D26,1),IF(RIGHT(D26,1)=\"U\",\"C\",\"E\"),VLOOKUP($Y$11,$AM$1:$AO$4,3,FALSE))","v":"FEB"},120,120,null,null,{"$f":"IF(MAX(K26:M26)<=0,0,MAX(CELL(\"color\",K26)*K26,CELL(\"color\",L26)*L26,CELL(\"color\",M26)*M26))","v":120},120,120,null,null,{"$f":"IF(MAX(P26:R26)<=0,0,MAX(CELL(\"color\",P26)*P26,CELL(\"color\",Q26)*Q26,CELL(\"color\",R26)*R26))","v":120},{"$f":"IF(OR(N26=0,S26=0),0,N26+S26)","v":240},120,null,null,{"$f":"IF(MAX(U26:W26)<=0,0,MAX(CELL(\"color\",U26)*U26,CELL(\"color\",V26)*V26,CELL(\"color\",W26)*W26))","v":120},{"$f":"AM26*IF($AM$11=\"SQ\",N26,IF($AM$11=\"BP\",S26,IF($AM$11=\"DL\",X26,IF($AM$11=\"PP\",IF(OR(S26=0,X26=0),0,S26+X26),IF(OR(T26=0,X26=0),0,T26+X26)))))","v":0},{"$f":"IF(Y26=0,\"\",CONCATENATE(CD26,\"/\",IF(AN26=4,\"Wilks\",D26),\"/\",IF(AN26>1,\"\",F26),\"/\",$AM$11))","v":""},{"$f":"BB26","v":0},{"$f":"IF(AA26=0,\"\",CE26)","v":""},{"$f":"IFERROR(IPF_Formula(E26,I26,Y26),0)","v":0},{"$f":"IFERROR(VLOOKUP(AS26,DATA!$A$2:$B$63,2,TRUE),0)*AC26","v":0},"PL",null,null,{"$f":"IFERROR(VLOOKUP(A26,Setup!$Q$5:$R$20,2,FALSE),\"\")","v":12},{"$f":"IF(VALUE(INDIRECT(CONCATENATE($AI$11,ROW())))=0,\"\",ABS(INDIRECT(CONCATENATE($AI$11,ROW())))+0.000001*G26)","v":120.00000300000001},11,11,3,{"$f":"IF(ISERROR(SEARCH($AM$11,AE26)),0,1)","v":0},{"$f":"VLOOKUP(D26,Setup!$I$6:$K$92,3,FALSE)","v":1},{"$f":"ROUND(IFERROR(IF(AN26=1,Y26,IF(AN26=2,AC26,IF(AN26=3,AD26,AC26))),0),5)","v":0},null,{"$f":"IFERROR(MATCH(D26,Setup!$I$6:$I$92,0),\"\")","v":17},{"$f":"IFERROR(CONCATENATE(LEFT(D26,FIND(\"-\",D26)),IF(AS26=\"\",\"O\",VLOOKUP(AS26,DATA!$E$35:$F$53,2,TRUE))),\"\")","v":"F-O"},{"$f":"YEAR(TODAY())-H26","v":39},{"$f":"IF(AN26=1,MATCH(F26,DATA!$AB$2:$AB$34,0),0)","v":{"$error":"#N/A"}},null,{"$f":"IF(MAX(K26:M26)>0,MAX(K26:M26),0)","v":120},{"$f":"IF(MAX(P26:R26)>0,MAX(P26:R26),0)","v":120},{"$f":"IF(MAX(U26:W26)>0,MAX(U26:W26),0)","v":120},{"$f":"AM26*IF($AM$11=\"PL\",IF(MIN(AV26:AX26)=0,0,AV26+AW26+AX26),IF($AM$11=\"PP\",IF(MIN(AW26:AX26)=0,0,AW26+AX26),IF($AM$11=\"BP\",AW26,IF($AM$11=\"DL\",AX26,AV26))))","v":0},{"$f":"IFERROR(IPF_Formula(E26,I26,AY26),0)","v":0},{"$f":"ROUND(IFERROR(VLOOKUP(AS26,DATA!$A$2:$B$63,2,FALSE),1)*AZ26,5)","v":0},{"$f":"IFERROR(IF(AN26=1,AY26,IF(AN26=2,AZ26,IF(AN26=3,BA26,AZ26))),0)","v":0},null,null,null,null,null,null,null,null,null,null,null,null,null,null,null,null,null,null,null,null,null,null,null,{"$f":"IFERROR(IF(FIND(\"DT\",AE26),\"Y\",\"\"),\"\")","v":""},null,{"$f":"CONCATENATE(IF(AN26=4,\"\",D26),IF(AN26=1,F26,\"\"))","v":"F-O52"},{"$f":"IF($AM$11=\"SQ\",AJ26,IF($AM$11=\"BP\",AK26,AL26))","v":11},{"$f":"1+COUNTIFS(INDIRECT(\"AN12:AN500\"),AN26,INDIRECT(\"CB12:CB500\"),CB26,INDIRECT(\"AO12:AO500\"),\">\"&AO26)\n+COUNTIFS(INDIRECT(\"AO12:AO500\"),AO26,INDIRECT(\"AN12:AN500\"),1,INDIRECT(\"CB12:CB500\"),CB26,INDIRECT(\"E12:E500\"),\"<\"&E26)\n+COUNTIFS(INDIRECT(\"AO12:AO500\"),AO26,INDIRECT(\"AN12:AN500\"),1,INDIRECT(\"CB12:CB500\"),CB26,INDIRECT(\"E12:E500\"),E26,INDIRECT(\"CC12:CC500\"),\"<\"&CC26)","v":1},{"$f":"1+COUNTIFS(INDIRECT(\"AN12:AN500\"),AN26,INDIRECT(\"CB12:CB500\"),CB26,INDIRECT(\"BB12:BB500\"),\">\"&BB26)\n+COUNTIFS(INDIRECT(\"BB12:BB500\"),BB26,INDIRECT(\"AN12:AN500\"),1,INDIRECT(\"CB12:CB500\"),CB26,INDIRECT(\"E12:E500\"),\"<\"&E26)","v":1}]
["A","立脇 和弥","8suki gym","F-O",55,{"$f":"一般判定(IFERROR(VLOOKUP(E27,DATA!$E$2:$G$22,IF(LEFT(D27,1)=\"M\",2,3)),\"\"),D27)","v":"57"},4,1986,{"$f":"CONCATENATE(LEFT(D27,1),IF(RIGHT(D27,1)=\"U\",\"C\",\"E\"),VLOOKUP($Y$11,$AM$1:$AO$4,3,FALSE))","v":"FEB"},130,130,null,null,{"$f":"IF(MAX(K27:M27)<=0,0,MAX(CELL(\"color\",K27)*K27,CELL(\"color\",L27)*L27,CELL(\"color\",M27)*M27))","v":130},130,130,null,null,{"$f":"IF(MAX(P27:R27)<=0,0,MAX(CELL(\"color\",P27)*P27,CELL(\"color\",Q27)*Q27,CELL(\"color\",R27)*R27))","v":130},{"$f":"IF(OR(N27=0,S27=0),0,N27+S27)","v":260},130,null,null,{"$f":"IF(MAX(U27:W27)<=0,0,MAX(CELL(\"color\",U27)*U27,CELL(\"color\",V27)*V27,CELL(\"color\",W27)*W27))","v":130},{"$f":"AM27*IF($AM$11=\"SQ\",N27,IF($AM$11=\"BP\",S27,IF($AM$11=\"DL\",X27,IF($AM$11=\"PP\",IF(OR(S27=0,X27=0),0,S27+X27),IF(OR(T27=0,X27=0),0,T27+X27)))))","v":0},{"$f":"IF(Y27=0,\"\",CONCATENATE(CD27,\"/\",IF(AN27=4,\"Wilks\",D27),\"/\",IF(AN27>1,\"\",F27),\"/\",$AM$11))","v":""},{"$f":"BB27","v":0},{"$f":"IF(AA27=0,\"\",CE27)","v":""},{"$f":"IFERROR(IPF_Formula(E27,I27,Y27),0)","v":0},{"$f":"IFERROR(VLOOKUP(AS27,DATA!$A$2:$B$63,2,TRUE),0)*AC27","v":0},"PL",null,null,{"$f":"IFERROR(VLOOKUP(A27,Setup!$Q$5:$R$20,2,FALSE),\"\")","v":12},{"$f":"IF(VALUE(INDIRECT(CONCATENATE($AI$11,ROW())))=0,\"\",ABS(INDIRECT(CONCATENATE($AI$11,ROW())))+0.000001*G27)","v":130.00000399999999},12,12,4,{"$f":"IF(ISERROR(SEARCH($AM$11,AE27)),0,1)","v":0},{"$f":"VLOOKUP(D27,Setup!$I$6:$K$92,3,FALSE)","v":1},{"$f":"ROUND(IFERROR(IF(AN27=1,Y27,IF(AN27=2,AC27,IF(AN27=3,AD27,AC27))),0),5)","v":0},null,{"$f":"IFERROR(MATCH(D27,Setup!$I$6:$I$92,0),\"\")","v":17},{"$f":"IFERROR(CONCATENATE(LEFT(D27,FIND(\"-\",D27)),IF(AS27=\"\",\"O\",VLOOKUP(AS27,DATA!$E$35:$F$53,2,TRUE))),\"\")","v":"F-O"},{"$f":"YEAR(TODAY())-H27","v":34},{"$f":"IF(AN27=1,MATCH(F27,DATA!$AB$2:$AB$34,0),0)","v":{"$error":"#N/A"}},null,{"$f":"IF(MAX(K27:M27)>0,MAX(K27:M27),0)","v":130},{"$f":"IF(MAX(P27:R27)>0,MAX(P27:R27),0)","v":130},{"$f":"IF(MAX(U27:W27)>0,MAX(U27:W27),0)","v":130},{"$f":"AM27*IF($AM$11=\"PL\",IF(MIN(AV27:AX27)=0,0,AV27+AW27+AX27),IF($AM$11=\"PP\",IF(MIN(AW27:AX27)=0,0,AW27+AX27),IF($AM$11=\"BP\",AW27,IF($AM$11=\"DL\",AX27,AV27))))","v":0},{"$f":"IFERROR(IPF_Formula(E27,I27,AY27),0)","v":0},{"$f":"ROUND(IFERROR(VLOOKUP(AS27,DATA!$A$2:$B$63,2,FALSE),1)*AZ27,5)","v":0},{"$f":"IFERROR(IF(AN27=1,AY27,IF(AN27=2,AZ27,IF(AN27=3,BA27,AZ27))),0)","v":0},null,null,null,null,null,null,null,null,null,null,null,null,null,null,null,null,null,null,null,null,null,null,null,{"$f":"IFERROR(IF(FIND(\"DT\",AE27),\"Y\",\"\"),\"\")","v":""},null,{"$f":"CONCATENATE(IF(AN27=4,\"\",D27),IF(AN27=1,F27,\"\"))","v":"F-O57"},{"$f":"IF($AM$11=\"SQ\",AJ27,IF($AM$11=\"BP\",AK27,AL27))","v":12},{"$f":"1+COUNTIFS(INDIRECT(\"AN12:AN500\"),AN27,INDIRECT(\"CB12:CB500\"),CB27,INDIRECT(\"AO12:AO500\"),\">\"&AO27)\n+COUNTIFS(INDIRECT(\"AO12:AO500\"),AO27,INDIRECT(\"AN12:AN500\"),1,INDIRECT(\"CB12:CB500\"),CB27,INDIRECT(\"E12:E500\"),\"<\"&E27)\n+COUNTIFS(INDIRECT(\"AO12:AO500\"),AO27,INDIRECT(\"AN12:AN500\"),1,INDIRECT(\"CB12:CB500\"),CB27,INDIRECT(\"E12:E500\"),E27,INDIRECT(\"CC12:CC500\"),\"<\"&CC27)","v":2},{"$f":"1+COUNTIFS(INDIRECT(\"AN12:AN500\"),AN27,INDIRECT(\"CB12:CB500\"),CB27,INDIRECT(\"BB12:BB500\"),\">\"&BB27)\n+COUNTIFS(INDIRECT(\"BB12:BB500\"),BB27,INDIRECT(\"AN12:AN500\"),1,INDIRECT(\"CB12:CB500\"),CB27,INDIRECT(\"E12:E500\"),\"<\"&E27)","v":2}]
["A","小脇 剛","烈剛河内","F-O",65,{"$f":"一般判定(IFERROR(VLOOKUP(E28,DATA!$E$2:$G$22,IF(LEFT(D28,1)=\"M\",2,3)),\"\"),D28)","v":"72"},5,1979,{"$f":"CONCATENATE(LEFT(D28,1),IF(RIGHT(D28,1)=\"U\",\"C\",\"E\"),VLOOKUP($Y$11,$AM$1:$AO$4,3,FALSE))","v":"FEB"},140,140,null,null,{"$f":"IF(MAX(K28:M28)<=0,0,MAX(CELL(\"color\",K28)*K28,CELL(\"color\",L28)*L28,CELL(\"color\",M28)*M28))","v":140},140,140,null,null,{"$f":"IF(MAX(P28:R28)<=0,0,MAX(CELL(\"color\",P28)*P28,CELL(\"color\",Q28)*Q28,CELL(\"color\",R28)*R28))","v":140},{"$f":"IF(OR(N28=0,S28=0),0,N28+S28)","v":280},140,null,null,{"$f":"IF(MAX(U28:W28)<=0,0,MAX(CELL(\"color\",U28)*U28,CELL(\"color\",V28)*V28,CELL(\"color\",W28)*W28))","v":140},{"$f":"AM28*IF($AM$11=\"SQ\",N28,IF($AM$11=\"BP\",S28,IF($AM$11=\"DL\",X28,IF($AM$11=\"PP\",IF(OR(S28=0,X28=0),0,S28+X28),IF(OR(T28=0,X28=0),0,T28+X28)))))","v":0},{"$f":"IF(Y28=0,\"\",CONCATENATE(CD28,\"/\",IF(AN28=4,\"Wilks\",D28),\"/\",IF(AN28>1,\"\",F28),\"/\",$AM$11))","v":""},{"$f":"BB28","v":0},{"$f":"IF(AA28=0,\"\",CE28)","v":""},{"$f":"IFERROR(IPF_Formula(E28,I28,Y28),0)","v":0},{"$f":"IFERROR(VLOOKUP(AS28,DATA!$A$2:$B$63,2,TRUE),0)*AC28","v":0},"PL",null,null,{"$f":"IFERROR(VLOOKUP(A28,Setup!$Q$5:$R$20,2,FALSE),\"\")","v":12},{"$f":"IF(VALUE(INDIRECT(CONCATENATE($AI$11,ROW())))=0,\"\",ABS(INDIRECT(CONCATENATE($AI$11,ROW())))+0.000001*G28)","v":140.00000499999999},13,13,5,{"$f":"IF(ISERROR(SEARCH($AM$11,AE28)),0,1)","v":0},{"$f":"VLOOKUP(D28,Setup!$I$6:$K$92,3,FALSE)","v":1},{"$f":"ROUND(IFERROR(IF(AN28=1,Y28,IF(AN28=2,AC28,IF(AN28=3,AD28,AC28))),0),5)","v":0},null,{"$f":"IFERROR(MATCH(D28,Setup!$I$6:$I$92,0),\"\")","v":17},{"$f":"IFERROR(CONCATENATE(LEFT(D28,FIND(\"-\",D28)),IF(AS28=\"\",\"O\",VLOOKUP(AS28,DATA!$E$35:$F$53,2,TRUE))),\"\")","v":"F-M1a"},{"$f":"YEAR(TODAY())-H28","v":41},{"$f":"IF(AN28=1,MATCH(F28,DATA!$AB$2:$AB$34,0),0)","v":{"$error":"#N/A"}},null,{"$f":"IF(MAX(K28:M28)>0,MAX(K28:M28),0)","v":140},{"$f":"IF(MAX(P28:R28)>0,MAX(P28:R28),0)","v":140},{"$f":"IF(MAX(U28:W28)>0,MAX(U28:W28),0)","v":140},{"$f":"AM28*IF($AM$11=\"PL\",IF(MIN(AV28:AX28)=0,0,AV28+AW28+AX28),IF($AM$11=\"PP\",IF(MIN(AW28:AX28)=0,0,AW28+AX28),IF($AM$11=\"BP\",AW28,IF($AM$11=\"DL\",AX28,AV28))))","v":0},{"$f":"IFERROR(IPF_Formula(E28,I28,AY28),0)","v":0},{"$f":"ROUND(IFERROR(VLOOKUP(AS28,DATA!$A$2:$B$63,2,FALSE),1)*AZ28,5)","v":0},{"$f":"IFERROR(IF(AN28=1,AY28,IF(AN28=2,AZ28,IF(AN28=3,BA28,AZ28))),0)","v":0},null,null,null,null,null,null,null,null,null,null,null,null,null,null,null,null,null,null,null,null,null,null,null,{"$f":"IFERROR(IF(FIND(\"DT\",AE28),\"Y\",\"\"),\"\")","v":""},null,{"$f":"CONCATENATE(IF(AN28=4,\"\",D28),IF(AN28=1,F28,\"\"))","v":"F-O72"},{"$f":"IF($AM$11=\"SQ\",AJ28,IF($AM$11=\"BP\",AK28,AL28))","v":13},{"$f":"1+COUNTIFS(INDIRECT(\"AN12:AN500\"),AN28,INDIRECT(\"CB12:CB500\"),CB28,INDIRECT(\"AO12:AO500\"),\">\"&AO28)\n+COUNTIFS(INDIRECT(\"AO12:AO500\"),AO28,INDIRECT(\"AN12:AN500\"),1,INDIRECT(\"CB12:CB500\"),CB28,INDIRECT(\"E12:E500\"),\"<\"&E28)\n+COUNTIFS(INDIRECT(\"AO12:AO500\"),AO28,INDIRECT(\"AN12:AN500\"),1,INDIRECT(\"CB12:CB500\"),CB28,INDIRECT(\"E12:E500\"),E28,INDIRECT(\"CC12:CC500\"),\"<\"&CC28)","v":1},{"$f":"1+COUNTIFS(INDIRECT(\"AN12:AN500\"),AN28,INDIRECT(\"CB12:CB500\"),CB28,INDIRECT(\"BB12:BB500\"),\">\"&BB28)\n+COUNTIFS(INDIRECT(\"BB12:BB500\"),BB28,INDIRECT(\"AN12:AN500\"),1,INDIRECT(\"CB12:CB500\"),CB28,INDIRECT(\"E12:E500\"),\"<\"&E28)","v":1}]
["A","佐藤 啓","8sukigym","F-O",75,{"$f":"一般判定(IFERROR(VLOOKUP(E29,DATA!$E$2:$G$22,IF(LEFT(D29,1)=\"M\",2,3)),\"\"),D29)","v":"84"},10,1971,{"$f":"CONCATENATE(LEFT(D29,1),IF(RIGHT(D29,1)=\"U\",\"C\",\"E\"),VLOOKUP($Y$11,$AM$1:$AO$4,3,FALSE))","v":"FEB"},190,190,null,null,{"$f":"IF(MAX(K29:M29)<=0,0,MAX(CELL(\"color\",K29)*K29,CELL(\"color\",L29)*L29,CELL(\"color\",M29)*M29))","v":190},190,190,null,null,{"$f":"IF(MAX(P29:R29)<=0,0,MAX(CELL(\"color\",P29)*P29,CELL(\"color\",Q29)*Q29,CELL(\"color\",R29)*R29))","v":190},{"$f":"IF(OR(N29=0,S29=0),0,N29+S29)","v":380},190,null,null,{"$f":"IF(MAX(U29:W29)<=0,0,MAX(CELL(\"color\",U29)*U29,CELL(\"color\",V29)*V29,CELL(\"color\",W29)*W29))","v":190},{"$f":"AM29*IF($AM$11=\"SQ\",N29,IF($AM$11=\"BP\",S29,IF($AM$11=\"DL\",X29,IF($AM$11=\"PP\",IF(OR(S29=0,X29=0),0,S29+X29),IF(OR(T29=0,X29=0),0,T29+X29)))))","v":0},{"$f":"IF(Y29=0,\"\",CONCATENATE(CD29,\"/\",IF(AN29=4,\"Wilks\",D29),\"/\",IF(AN29>1,\"\",F29),\"/\",$AM$11))","v":""},{"$f":"BB29","v":0},{"$f":"IF(AA29=0,\"\",CE29)","v":""},{"$f":"IFERROR(IPF_Formula(E29,I29,Y29),0)","v":0},{"$f":"IFERROR(VLOOKUP(AS29,DATA!$A$2:$B$63,2,TRUE),0)*AC29","v":0},"PL",null,null,{"$f":"IFERROR(VLOOKUP(A29,Setup!$Q$5:$R$20,2,FALSE),\"\")","v":12},{"$f":"IF(VALUE(INDIRECT(CONCATENATE($AI$11,ROW())))=0,\"\",ABS(INDIRECT(CONCATENATE($AI$11,ROW())))+0.000001*G29)","v":190.00001},18,18,10,{"$f":"IF(ISERROR(SEARCH($AM$11,AE29)),0,1)","v":0},{"$f":"VLOOKUP(D29,Setup!$I$6:$K$92,3,FALSE)","v":1},{"$f":"ROUND(IFERROR(IF(AN29=1,Y29,IF(AN29=2,AC29,IF(AN29=3,AD29,AC29))),0),5)","v":0},null,{"$f":"IFERROR(MATCH(D29,Setup!$I$6:$I$92,0),\"\")","v":17},{"$f":"IFERROR(CONCATENATE(LEFT(D29,FIND(\"-\",D29)),IF(AS29=\"\",\"O\",VLOOKUP(AS29,DATA!$E$35:$F$53,2,TRUE))),\"\")","v":"F-M1b"},{"$f":"YEAR(TODAY())-H29","v":49},{"$f":"IF(AN29=1,MATCH(F29,DATA!$AB$2:$AB$34,0),0)","v":{"$error":"#N/A"}},null,{"$f":"IF(MAX(K29:M29)>0,MAX(K29:M29),0)","v":190},{"$f":"IF(MAX(P29:R29)>0,MAX(P29:R29),0)","v":190},{"$f":"IF(MAX(U29:W29)>0,MAX(U29:W29),0)","v":190},{"$f":"AM29*IF($AM$11=\"PL\",IF(MIN(AV29:AX29)=0,0,AV29+AW29+AX29),IF($AM$11=\"PP\",IF(MIN(AW29:AX29)=0,0,AW29+AX29),IF($AM$11=\"BP\",AW29,IF($AM$11=\"DL\",AX29,AV29))))","v":0},{"$f":"IFERROR(IPF_Formula(E29,I29,AY29),0)","v":0},{"$f":"ROUND(IFERROR(VLOOKUP(AS29,DATA!$A$2:$B$63,2,FALSE),1)*AZ29,5)","v":0},{"$f":"IFERROR(IF(AN29=1,AY29,IF(AN29=2,AZ29,IF(AN29=3,BA29,AZ29))),0)","v":0},null,null,null,null,null,null,null,null,null,null,null,null,null,null,null,null,null,null,null,null,null,null,null,{"$f":"IFERROR(IF(FIND(\"DT\",AE29),\"Y\",\"\"),\"\")","v":""},null,{"$f":"CONCATENATE(IF(AN29=4,\"\",D29),IF(AN29=1,F29,\"\"))","v":"F-O84"},{"$f":"IF($AM$11=\"SQ\",AJ29,IF($AM$11=\"BP\",AK29,AL29))","v":18},{"$f":"1+COUNTIFS(INDIRECT(\"AN12:AN500\"),AN29,INDIRECT(\"CB12:CB500\"),CB29,INDIRECT(\"AO12:AO500\"),\">\"&AO29)\n+COUNTIFS(INDIRECT(\"AO12:AO500\"),AO29,INDIRECT(\"AN12:AN500\"),1,INDIRECT(\"CB12:CB500\"),CB29,INDIRECT(\"E12:E500\"),\"<\"&E29)\n+COUNTIFS(INDIRECT(\"AO12:AO500\"),AO29,INDIRECT(\"AN12:AN500\"),1,INDIRECT(\"CB12:CB500\"),CB29,INDIRECT(\"E12:E500\"),E29,INDIRECT(\"CC12:CC500\"),\"<\"&CC29)","v":1},{"$f":"1+COUNTIFS(INDIRECT(\"AN12:AN500\"),AN29,INDIRECT(\"CB12:CB500\"),CB29,INDIRECT(\"BB12:BB500\"),\">\"&BB29)\n+COUNTIFS(INDIRECT(\"BB12:BB500\"),BB29,INDIRECT(\"AN12:AN500\"),1,INDIRECT(\"CB12:CB500\"),CB29,INDIRECT(\"E12:E500\"),\"<\"&E29)","v":1}]
["A","大西 康平","8suki gym","F-O",80,{"$f":"一般判定(IFERROR(VLOOKUP(E30,DATA!$E$2:$G$22,IF(LEFT(D30,1)=\"M\",2,3)),\"\"),D30)","v":"84"},9,1994,{"$f":"CONCATENATE(LEFT(D30,1),IF(RIGHT(D30,1)=\"U\",\"C\",\"E\"),VLOOKUP($Y$11,$AM$1:$AO$4,3,FALSE))","v":"FEB"},180,180,null,null,{"$f":"IF(MAX(K30:M30)<=0,0,MAX(CELL(\"color\",K30)*K30,CELL(\"color\",L30)*L30,CELL(\"color\",M30)*M30))","v":180},180,180,null,null,{"$f":"IF(MAX(P30:R30)<=0,0,MAX(CELL(\"color\",P30)*P30,CELL(\"color\",Q30)*Q30,CELL(\"color\",R30)*R30))","v":180},{"$f":"IF(OR(N30=0,S30=0),0,N30+S30)","v":360},180,null,null,{"$f":"IF(MAX(U30:W30)<=0,0,MAX(CELL(\"color\",U30)*U30,CELL(\"color\",V30)*V30,CELL(\"color\",W30)*W30))","v":180},{"$f":"AM30*IF($AM$11=\"SQ\",N30,IF($AM$11=\"BP\",S30,IF($AM$11=\"DL\",X30,IF($AM$11=\"PP\",IF(OR(S30=0,X30=0),0,S30+X30),IF(OR(T30=0,X30=0),0,T30+X30)))))","v":0},{"$f":"IF(Y30=0,\"\",CONCATENATE(CD30,\"/\",IF(AN30=4,\"Wilks\",D30),\"/\",IF(AN30>1,\"\",F30),\"/\",$AM$11))","v":""},{"$f":"BB30","v":0},{"$f":"IF(AA30=0,\"\",CE30)","v":""},{"$f":"IFERROR(IPF_Formula(E30,I30,Y30),0)","v":0},{"$f":"IFERROR(VLOOKUP(AS30,DATA!$A$2:$B$63,2,TRUE),0)*AC30","v":0},"PL",null,null,{"$f":"IFERROR(VLOOKUP(A30,Setup!$Q$5:$R$20,2,FALSE),\"\")","v":12},{"$f":"IF(VALUE(INDIRECT(CONCATENATE($AI$11,ROW())))=0,\"\",ABS(INDIRECT(CONCATENATE($AI$11,ROW())))+0.000001*G30)","v":180.00000900000001},17,17,9,{"$f":"IF(ISERROR(SEARCH($AM$11,AE30)),0,1)","v":0},{"$f":"VLOOKUP(D30,Setup!$I$6:$K$92,3,FALSE)","v":1},{"$f":"ROUND(IFERROR(IF(AN30=1,Y30,IF(AN30=2,AC30,IF(AN30=3,AD30,AC30))),0),5)","v":0},null,{"$f":"IFERROR(MATCH(D30,Setup!$I$6:$I$92,0),\"\")","v":17},{"$f":"IFERROR(CONCATENATE(LEFT(D30,FIND(\"-\",D30)),IF(AS30=\"\",\"O\",VLOOKUP(AS30,DATA!$E$35:$F$53,2,TRUE))),\"\")","v":"F-O"},{"$f":"YEAR(TODAY())-H30","v":26},{"$f":"IF(AN30=1,MATCH(F30,DATA!$AB$2:$AB$34,0),0)","v":{"$error":"#N/A"}},null,{"$f":"IF(MAX(K30:M30)>0,MAX(K30:M30),0)","v":180},{"$f":"IF(MAX(P30:R30)>0,MAX(P30:R30),0)","v":180},{"$f":"IF(MAX(U30:W30)>0,MAX(U30:W30),0)","v":180},{"$f":"AM30*IF($AM$11=\"PL\",IF(MIN(AV30:AX30)=0,0,AV30+AW30+AX30),IF($AM$11=\"PP\",IF(MIN(AW30:AX30)=0,0,AW30+AX30),IF($AM$11=\"BP\",AW30,IF($AM$11=\"DL\",AX30,AV30))))","v":0},{"$f":"IFERROR(IPF_Formula(E30,I30,AY30),0)","v":0},{"$f":"ROUND(IFERROR(VLOOKUP(AS30,DATA!$A$2:$B$63,2,FALSE),1)*AZ30,5)","v":0},{"$f":"IFERROR(IF(AN30=1,AY30,IF(AN30=2,AZ30,IF(AN30=3,BA30,AZ30))),0)","v":0},null,null,null,null,null,null,null,null,null,null,null,null,null,null,null,null,null,null,null,null,null,null,null,{"$f":"IFERROR(IF(FIND(\"DT\",AE30),\"Y\",\"\"),\"\")","v":""},null,{"$f":"CONCATENATE(IF(AN30=4,\"\",D30),IF(AN30=1,F30,\"\"))","v":"F-O84"},{"$f":"IF($AM$11=\"SQ\",AJ30,IF($AM$11=\"BP\",AK30,AL30))","v":17},{"$f":"1+COUNTIFS(INDIRECT(\"AN12:AN500\"),AN30,INDIRECT(\"CB12:CB500\"),CB30,INDIRECT(\"AO12:AO500\"),\">\"&AO30)\n+COUNTIFS(INDIRECT(\"AO12:AO500\"),AO30,INDIRECT(\"AN12:AN500\"),1,INDIRECT(\"CB12:CB500\"),CB30,INDIRECT(\"E12:E500\"),\"<\"&E30)\n+COUNTIFS(INDIRECT(\"AO12:AO500\"),AO30,INDIRECT(\"AN12:AN500\"),1,INDIRECT(\"CB12:CB500\"),CB30,INDIRECT(\"E12:E500\"),E30,INDIRECT(\"CC12:CC500\"),\"<\"&CC30)","v":3},{"$f":"1+COUNTIFS(INDIRECT(\"AN12:AN500\"),AN30,INDIRECT(\"CB12:CB500\"),CB30,INDIRECT(\"BB12:BB500\"),\">\"&BB30)\n+COUNTIFS(INDIRECT(\"BB12:BB500\"),BB30,INDIRECT(\"AN12:AN500\"),1,INDIRECT(\"CB12:CB500\"),CB30,INDIRECT(\"E12:E500\"),\"<\"&E30)","v":3}]
[null,null," ","-",null,{"$f":"一般判定(IFERROR(VLOOKUP(E31,DATA!$E$2:$G$22,IF(LEFT(D31,1)=\"M\",2,3)),\"\"),D31)","v":""},null,null,{"$f":"CONCATENATE(LEFT(D31,1),IF(RIGHT(D31,1)=\"U\",\"C\",\"E\"),VLOOKUP($Y$11,$AM$1:$AO$4,3,FALSE))","v":"-EB"},null,null,null,null,{"$f":"IF(MAX(K31:M31)<=0,0,MAX(CELL(\"color\",K31)*K31,CELL(\"color\",L31)*L31,CELL(\"color\",M31)*M31))","v":0},null,null,null,null,{"$f":"IF(MAX(P31:R31)<=0,0,MAX(CELL(\"color\",P31)*P31,CELL(\"color\",Q31)*Q31,CELL(\"color\",R31)*R31))","v":0},{"$f":"IF(OR(N31=0,S31=0),0,N31+S31)","v":0},null,null,null,{"$f":"IF(MAX(U31:W31)<=0,0,MAX(CELL(\"color\",U31)*U31,CELL(\"color\",V31)*V31,CELL(\"color\",W31)*W31))","v":0},{"$f":"AM31*IF($AM$11=\"SQ\",N31,IF($AM$11=\"BP\",S31,IF($AM$11=\"DL\",X31,IF($AM$11=\"PP\",IF(OR(S31=0,X31=0),0,S31+X31),IF(OR(T31=0,X31=0),0,T31+X31)))))","v":0},{"$f":"IF(Y31=0,\"\",CONCATENATE(CD31,\"/\",IF(AN31=4,\"Wilks\",D31),\"/\",IF(AN31>1,\"\",F31),\"/\",$AM$11))","v":""},{"$f":"BB31","v":0},{"$f":"IF(AA31=0,\"\",CE31)","v":""},{"$f":"IFERROR(IPF_Formula(E31,I31,Y31),0)","v":0},{"$f":"IFERROR(VLOOKUP(AS31,DATA!$A$2:$B$63,2,TRUE),0)*AC31","v":0},null,null,null,{"$f":"IFERROR(VLOOKUP(A31,Setup!$Q$5:$R$20,2,FALSE),\"\")","v":""},{"$f":"IF(VALUE(INDIRECT(CONCATENATE($AI$11,ROW())))=0,\"\",ABS(INDIRECT(CONCATENATE($AI$11,ROW())))+0.000001*G31)","v":""},0,0,0,{"$f":"IF(ISERROR(SEARCH($AM$11,AE31)),0,1)","v":0},{"$f":"VLOOKUP(D31,Setup!$I$6:$K$92,3,FALSE)","v":{"$error":"#N/A"}},{"$f":"ROUND(IFERROR(IF(AN31=1,Y31,IF(AN31=2,AC31,IF(AN31=3,AD31,AC31))),0),5)","v":0},null,{"$f":"IFERROR(MATCH(D31,Setup!$I$6:$I$92,0),\"\")","v":""},{"$f":"IFERROR(CONCATENATE(LEFT(D31,FIND(\"-\",D31)),IF(AS31=\"\",\"O\",VLOOKUP(AS31,DATA!$E$35:$F$53,2,TRUE))),\"\")","v":"-M6"},{"$f":"YEAR(TODAY())-H31","v":2020},{"$f":"IF(AN31=1,MATCH(F31,DATA!$AB$2:$AB$34,0),0)","v":{"$error":"#N/A"}},null,{"$f":"IF(MAX(K31:M31)>0,MAX(K31:M31),0)","v":0},{"$f":"IF(MAX(P31:R31)>0,MAX(P31:R31),0)","v":0},{"$f":"IF(MAX(U31:W31)>0,MAX(U31:W31),0)","v":0},{"$f":"AM31*IF($AM$11=\"PL\",IF(MIN(AV31:AX31)=0,0,AV31+AW31+AX31),IF($AM$11=\"PP\",IF(MIN(AW31:AX31)=0,0,AW31+AX31),IF($AM$11=\"BP\",AW31,IF($AM$11=\"DL\",AX31,AV31))))","v":0},{"$f":"IFERROR(IPF_Formula(E31,I31,AY31),0)","v":0},{"$f":"ROUND(IFERROR(VLOOKUP(AS31,DATA!$A$2:$B$63,2,FALSE),1)*AZ31,5)","v":0},{"$f":"IFERROR(IF(AN31=1,AY31,IF(AN31=2,AZ31,IF(AN31=3,BA31,AZ31))),0)","v":0},null,null,null,null,null,null,null,null,null,null,null,null,null,null,null,null,null,null,null,null,null,null,null,{"$f":"IFERROR(IF(FIND(\"DT\",AE31),\"Y\",\"\"),\"\")","v":""},null,{"$f":"CONCATENATE(IF(AN31=4,\"\",D31),IF(AN31=1,F31,\"\"))","v":{"$error":"#N/A"}},{"$f":"IF($AM$11=\"SQ\",AJ31,IF($AM$11=\"BP\",AK31,AL31))","v":0},{"$f":"1+COUNTIFS(INDIRECT(\"AN12:AN500\"),AN31,INDIRECT(\"CB12:CB500\"),CB31,INDIRECT(\"AO12:AO500\"),\">\"&AO31)\n+COUNTIFS(INDIRECT(\"AO12:AO500\"),AO31,INDIRECT(\"AN12:AN500\"),1,INDIRECT(\"CB12:CB500\"),CB31,INDIRECT(\"E12:E500\"),\"<\"&E31)\n+COUNTIFS(INDIRECT(\"AO12:AO500\"),AO31,INDIRECT(\"AN12:AN500\"),1,INDIRECT(\"CB12:CB500\"),CB31,INDIRECT(\"E12:E500\"),E31,INDIRECT(\"CC12:CC500\"),\"<\"&CC31)","v":1},{"$f":"1+COUNTIFS(INDIRECT(\"AN12:AN500\"),AN31,INDIRECT(\"CB12:CB500\"),CB31,INDIRECT(\"BB12:BB500\"),\">\"&BB31)\n+COUNTIFS(INDIRECT(\"BB12:BB500\"),BB31,INDIRECT(\"AN12:AN500\"),1,INDIRECT(\"CB12:CB500\"),CB31,INDIRECT(\"E12:E500\"),\"<\"&E31)","v":1}]

{"sheet":"QuickPrint","index":5,"n_rows":20,"n_cols":35,"rows_kept":20,"cut":false,"hidden":false,"merged":[]}
[null,"2020-06-01","全日本パワーリフティング選手権",null,null,null,null,null,null,null,null,null,null,null,null,null,null,"３行目からB-AEまでコピーして、グッドリフト集計用、B3に値のみ貼り付け（オレンジ）の行の部分"]
["Grp B","Name","Team","Div","検量体重","IPF Wt Cls","lot#","Birth Year","IPF Pts Code","SQ rack","SQ-1","SQ-2","SQ-3","Best SQ","BP rack","BP-1","BP-2","BP-3","Best BP","Sub Total","DL-1","DL-2","DL-3","Best DL","PL Total","Pl/Div/Cls/Event","Forecast\nScore","F'cast Place","IPF Points","Age & Points","Events Entered","MemberID","State","団体A","団体B"]
["B","堀 滋","8suki gym","F-O",150,"84+",18,1975,"FEP",270,270,null,null,270,270,270,null,null,270,540,270,null,null,270,810,"1/F-O/84+/PL",810,1,724.84935335398893,764.7160677884583,"PL"]
["B","石田 浩士","8suki gym","F-O",140,"84+",17,1970,"FEP",260,260,null,null,260,260,260,null,null,260,520,260,null,null,260,780,"2/F-O/84+/PL",780,2,716.89081588918998,810.08662195478462,"PL"]
["B","光安 隆史","8suki gym","F-O",85,"84+",16,1976,"FEP",250,250,null,null,250,250,250,null,null,250,500,250,null,null,250,750,"3/F-O/84+/PL",750,3,821.92645133939754,857.26928874699161,"PL"]
["B","田口 航大","8sukigym","F-O",120,"84+",15,2002,"FEP",240,240,null,null,240,240,240,null,null,240,480,240,null,null,240,720,"4/F-O/84+/PL",720,4,703.29600263093812,745.49376278879447,"PL"]
["B","瀧井 章男","Ks GYM","F-O",130,"84+",13,1984,"FEP",220,220,null,null,220,220,220,null,null,220,440,220,null,null,220,660,"5/F-O/84+/PL",660,5,638.11834344742999,638.11834344742999,"PL"]
["B","芳村 晃","8sukigym","F-O",120,"84+",12,1975,"FEP",210,210,null,null,210,210,210,null,null,210,420,210,null,null,210,630,"6/F-O/84+/PL",630,6,629.50128705278541,664.12385784068863,"PL"]
["B","吉岡 弘和","8suki gym","F-O",52,"52",14,1963,"FEP",230,230,null,null,230,230,230,null,null,230,460,230,null,null,230,690,"1/F-O/52/PL",690,1,948.91991409491925,1193.7412519314084,"PL"]
["A","伊藤 由実子","8suki gym","F-O",46,"47",2,1976,"FEP",110,110,null,null,110,110,110,null,null,110,220,110,null,null,110,330,"1/F-O/47/PL",330,1,536.0971660018829,559.14934413996377,"PL"]
["A","松尾 直樹","8sukigym","F-O",60,"63",6,1963,"FEP",150,150,null,null,150,150,150,null,null,150,300,150,null,null,150,450,"1/F-O/63/PL",450,1,613.53445490790079,771.82634427413916,"PL"]
["A","三木 聖也","8sukiGYM","F-O",54,"57",7,1996,"FEP",160,160,null,null,160,160,160,null,null,160,320,160,null,null,160,480,"1/F-O/57/PL",480,1,678.86516218286545,678.86516218286545,"PL"]
["A","山本 泰資","8sukigym","F-O",70,"72",8,1993,"FEP",170,170,null,null,170,170,170,null,null,170,340,170,null,null,170,510,"1/F-O/72/PL",510,1,638.88826859872245,638.88826859872245,"PL"]
["A","大寺 康平","8suki gym","F-O",75,"84",11,1987,"FEP",200,200,null,null,200,200,200,null,null,200,400,200,null,null,200,600,"1/F-O/84/PL",600,1,712.66257926286642,712.66257926286642,"PL"]
["A","中川 貴美子","8suki gym","F-O",42,"47",1,1982,"FEP",100,100,null,null,100,100,100,null,null,100,200,100,null,null,100,300,"2/F-O/47/PL",300,2,518.73235376550156,518.73235376550156,"PL"]
["A","丸山 武","8suki gym","F-O",50,"52",3,1981,"FEP",120,120,null,null,120,120,120,null,null,120,240,120,null,null,120,360,"2/F-O/52/PL",360,2,553.46957765969819,553.46957765969819,"PL"]
["A","立脇 和弥","8suki gym","F-O",55,"57",4,1986,"FEP",130,130,null,null,130,130,130,null,null,130,260,130,null,null,130,390,"2/F-O/57/PL",390,2,566.18467322295146,566.18467322295146,"PL"]
["A","小脇 剛","烈剛河内","F-O",65,"72",5,1979,"FEP",140,140,null,null,140,140,140,null,null,140,280,140,null,null,140,420,"2/F-O/72/PL",420,2,560.92129535080983,566.53050830431789,"PL"]
["A","佐藤 啓","8sukigym","F-O",75,"84",10,1971,"FEP",190,190,null,null,190,190,190,null,null,190,380,190,null,null,190,570,"2/F-O/84/PL",570,2,682.4165820831895,759.52965585858988,"PL"]
["A","大西 康平","8suki gym","F-O",80,"84",9,1994,"FEP",180,180,null,null,180,180,180,null,null,180,360,180,null,null,180,540,"3/F-O/84/PL",540,3,636.3811640138731,636.3811640138731,"PL"]

{"sheet":"表彰状","index":6,"n_rows":22,"n_cols":14,"rows_kept":22,"cut":false,"hidden":false,"merged":[[16,1,17,2],[16,5,17,6],[18,5,18,6],[21,1,21,5]]}
[]
[]
[]
[]
[]
[]
[]
[null,null,null,null,null,null,null,null,null,null,null,null,"start行番号",3]
[null,null,null,null,null,null,null,null,null,null,null,null,"end行番号",8]
[]
[null,null,null,null,null,null,null,null,null,null,null,null,"行番号",12]
[]
[]
[]
[]
[]
[null,{"$f":"日本語数式(INDEX(QuickPrint!Z$1:Z$430,$N$11),0)","v":"フルギア"},null,null,null,"記　録"]
[]
[null,{"$f":"日本語数式(INDEX(QuickPrint!$Z$1:$Z$430,$N$11),1)","v":"女子"},{"$f":"日本語数式(INDEX(QuickPrint!$F$1:$F$430,$N$11),2)","v":"57 Kg級"},{"$f":"日本語数式(INDEX(QuickPrint!$Z$1:$Z$430,$N$11),3)","v":"一般"},{"$f":"日本語数式(INDEX(QuickPrint!$Z$1:$Z$430,$N$11),4)","v":"第1位"},{"$f":"日本語数式(INDEX(QuickPrint!$Y$1:$Y$430,$N$11),5)","v":"480Kg"},{"$f":"日本語数式(INDEX(QuickPrint!J$1:J$2,$N$11),2)","v":{"$error":"#VALUE!"}}]
[]
[]
[null,{"$f":"日本語数式(INDEX(QuickPrint!$B$1:$B$430,$N$11),6)","v":"三木 聖也"},null,null,null,null,"殿"]

{"sheet":"Awards","index":7,"n_rows":10,"n_cols":22,"rows_kept":10,"cut":false,"hidden":false,"merged":[[1,0,1,4]]}
[null,null,null,null,null,null,null,null,null,null,null,"FillRows",{"$f":"COUNTA(P:P)+1","v":9}]
["Men (40 -49) 3-Lift 59-kg cls",null,null,null,null,null,null,null,null,{"$f":"OFFSET($V$1,MATCH(A2,$U:$U,0)-1,0)","v":{"$error":"#N/A"}},null,{"$f":"CONCATENATE(\"U3:U\",M1)","v":"U3:U9"},null,null,null,"Div","Cls","Event"]
["PLACE","NAME",{"$f":"Lifting!E3","v":"Kg"},"IPF Pts.","Team",null,null,null,"row",null,null,"PL","3-Lift",null,null,"F-O","84+","PL",{"$f":"IF($P3=\"Wilks\",$P3,VLOOKUP($P3,Setup!$I:$J,2,FALSE))","v":"Women"},{"$f":"VLOOKUP(R3,$L$3:$M$7,2,FALSE)","v":"3-Lift"},{"$f":"CONCATENATE($S3,\" \",$T3,\" \",IF($Q3=\"\",\"\",CONCATENATE($Q3,\"-\",$M$10)))","v":"Women 3-Lift 84+-kg cls"},{"$f":"CONCATENATE(P3,\"/\",Q3,\"/\",R3)","v":"F-O/84+/PL"}]
[1,{"$f":"IFERROR(INDIRECT(CONCATENATE(\"QuickPrint!B\",I4)),\"\")","v":""},{"$f":"IFERROR(INDIRECT(CONCATENATE(\"QuickPrint!Y\",I4)),\"\")","v":""},{"$f":"IFERROR(INDIRECT(CONCATENATE(\"QuickPrint!\",IF($J$10=3,\"AD\",\"AC\"),I4)),\"\")","v":""},{"$f":"IFERROR(VLOOKUP(INDIRECT(CONCATENATE(\"QuickPrint!c\",I4)),Setup!$M$6:$N$93,2,FALSE),\"\")","v":""},null,null,null,{"$f":"MATCH(J4,INDIRECT(CONCATENATE(\"QuickPrint!$Z:$Z\")),0)","v":{"$error":"#N/A"}},{"$f":"CONCATENATE(\"1/\",$J$2)","v":{"$error":"#N/A"}},null,"BP","Bench Press",null,null,"F-O",52,"PL",{"$f":"IF($P4=\"Wilks\",$P4,VLOOKUP($P4,Setup!$I:$J,2,FALSE))","v":"Women"},{"$f":"VLOOKUP(R4,$L$3:$M$7,2,FALSE)","v":"3-Lift"},{"$f":"CONCATENATE($S4,\" \",$T4,\" \",IF($Q4=\"\",\"\",CONCATENATE($Q4,\"-\",$M$10)))","v":"Women 3-Lift 52-kg cls"},{"$f":"CONCATENATE(P4,\"/\",Q4,\"/\",R4)","v":"F-O/52/PL"}]
[2,"","","",{"$f":"IFERROR(VLOOKUP(INDIRECT(CONCATENATE(\"QuickPrint!c\",I5)),Setup!$M$6:$N$93,2,FALSE),\"\")","v":""},null,null,null,{"$f":"MATCH(J5,INDIRECT(CONCATENATE(\"QuickPrint!$Z:$Z\")),0)","v":{"$error":"#N/A"}},{"$f":"CONCATENATE(\"2/\",$J$2)","v":{"$error":"#N/A"}},null,"SQ","Squat",null,null,"F-O",47,"PL",{"$f":"IF($P5=\"Wilks\",$P5,VLOOKUP($P5,Setup!$I:$J,2,FALSE))","v":"Women"},"3-Lift","Women 3-Lift 47-kg cls","F-O/47/PL"]
[3,"","","",{"$f":"IFERROR(VLOOKUP(INDIRECT(CONCATENATE(\"QuickPrint!c\",I6)),Setup!$M$6:$N$93,2,FALSE),\"\")","v":""},null,null,null,{"$f":"MATCH(J6,INDIRECT(CONCATENATE(\"QuickPrint!$Z:$Z\")),0)","v":{"$error":"#N/A"}},{"$f":"CONCATENATE(\"3/\",$J$2)","v":{"$error":"#N/A"}},null,"DL","Deadlift",null,null,"F-O",63,"PL",{"$f":"IF($P6=\"Wilks\",$P6,VLOOKUP($P6,Setup!$I:$J,2,FALSE))","v":"Women"},"3-Lift","Women 3-Lift 63-kg cls","F-O/63/PL"]
[4,"","","",{"$f":"IFERROR(VLOOKUP(INDIRECT(CONCATENATE(\"QuickPrint!c\",I7)),Setup!$M$6:$N$93,2,FALSE),\"\")","v":""},null,null,null,{"$f":"MATCH(J7,INDIRECT(CONCATENATE(\"QuickPrint!$Z:$Z\")),0)","v":{"$error":"#N/A"}},{"$f":"CONCATENATE(\"4/\",$J$2)","v":{"$error":"#N/A"}},null,"PP","Push Pull",null,null,"F-O",57,"PL",{"$f":"IF($P7=\"Wilks\",$P7,VLOOKUP($P7,Setup!$I:$J,2,FALSE))","v":"Women"},"3-Lift","Women 3-Lift 57-kg cls","F-O/57/PL"]
[5,"","","",{"$f":"IFERROR(VLOOKUP(INDIRECT(CONCATENATE(\"QuickPrint!c\",I8)),Setup!$M$6:$N$93,2,FALSE),\"\")","v":""},null,null,null,{"$f":"MATCH(J8,INDIRECT(CONCATENATE(\"QuickPrint!$Z:$Z\")),0)","v":{"$error":"#N/A"}},{"$f":"CONCATENATE(\"5/\",$J$2)","v":{"$error":"#N/A"}},null,null,null,null,null,"F-O",72,"PL",{"$f":"IF($P8=\"Wilks\",$P8,VLOOKUP($P8,Setup!$I:$J,2,FALSE))","v":"Women"},"3-Lift","Women 3-Lift 72-kg cls","F-O/72/PL"]
[6,"","","",null,null,null,null,null,null,null,null,null,null,null,"F-O",84,"PL",{"$f":"IF($P9=\"Wilks\",$P9,VLOOKUP($P9,Setup!$I:$J,2,FALSE))","v":"Women"},"3-Lift","Women 3-Lift 84-kg cls","F-O/84/PL"]
[null,null,null,null,null,null,null,null,"score code",{"$f":"IF(P3=\"Wilks\",4,VLOOKUP(OFFSET($P$1,MATCH(A2,$U:$U,0)-1,0),Setup!I5:K200,3,FALSE))","v":{"$error":"#N/A"}},null,{"$f":"Setup!B39","v":0},{"$f":"IF(L10=\"Pounds\",\"lb cls\",\"kg cls\")","v":"kg cls"}]

{"sheet":"SpeakersCard","index":8,"n_rows":25,"n_cols":15,"rows_kept":25,"cut":false,"hidden":true,"merged":[[4,13,4,14],[5,8,5,9],[5,13,5,14],[16,3,16,4],[17,5,17,6],[16,11,16,12],[17,13,17,14],[11,2,11,3],[11,10,11,11],[4,11,4,12],[5,11,5,12],[15,1,15,3],[15,9,15,11],[10,0,10,1],[10,8,10,9],[11,0,11,1],[23,0,23,1],[23,8,23,9],[24,0,24,1],[24,8,24,9],[25,0,25,6],[25,8,25,14],[24,2,24,3],[24,10,24,11],[22,0,22,1],[17,3,17,4],[17,11,17,12],[12,0,12,6],[12,8,12,14],[14,0,14,4],[14,8,14,12],[18,13,18,14],[18,3,18,4],[18,11,18,12],[18,0,18,1],[18,5,18,6],[18,8,18,9],[22,8,22,9],[11,8,11,9],[3,3,3,4],[5,0,5,1],[9,0,9,1],[4,3,4,4],[9,8,9,9],[5,3,5,4],[4,5,4,6],[5,5,5,6],[1,0,1,4],[1,8,1,12],[3,11,3,12],[2,1,2,3],[2,9,2,11]]}
[]
[{"$f":"Setup!$B$6","v":"全日本ベンチプレス選手権"},null,null,null,null,"Group:","A",null,{"$f":"Setup!$B$6","v":"全日本ベンチプレス選手権"},null,null,null,null,"Group:","A"]
["Name &\nMbr #:","lifter5-5",null,null,null,"Lot number:",5,null,"Name &\nMbr #:","lifter2-2",null,null,null,"Lot number:",2]
["Birth Year:","1990-01-05","Team:","Abrev",null,"Weight\nClass:",72,null,"Birth Year:","1990-01-02","Team:","Abrev",null,"Weight\nClass:",72]
["Body Weight:",80,null,"Events Entered:",null,"Division(s)",null,null,"Body Weight:",65,null,"Events Entered:",null,"Division(s)"]
["Lifter/Coach\nInitials:",null,null,"pl",null,"FR-O",null,null,"Lifter/Coach\nInitials:",null,null,"pl",null,"FR-O"]
["Event","Rack Hts","1st\nAttempt","2nd Attempt","3rd\nAttempt","Best Attempt","Place",null,"Event","Rack Hts","1st\nAttempt","2nd Attempt","3rd\nAttempt","Best Attempt","Place"]
["Squat","14",null,null,null,null,null,null,"Squat","11"]
["Bench Press","10-11",null,null,null,null,null,null,"Bench Press","10-8"]
[null,null,null,null,"Subtotal",null,null,null,null,null,null,null,"Subtotal"]
["Deadlift",null,null,null,null,null,null,null,"Deadlift"]
["IPF Points:",null,null,null,"Total",null,null,null,"IPF Points:",null,null,null,"Total"]
[]
[]
[{"$f":"Setup!$B$6","v":"全日本ベンチプレス選手権"},null,null,null,null,"Group:","A",null,{"$f":"Setup!$B$6","v":"全日本ベンチプレス選手権"},null,null,null,null,"Group:","A"]
["Name &\nMbr #:","lifter3-3",null,null,null,"Lot number:",3,null,"Name &\nMbr #:","lifter4-4",null,null,null,"Lot number:",4]
["Birth Year:","1990-01-03","Team:","Abrev",null,"Weight\nClass:",72,null,"Birth Year:","1990-01-04","Team:","Abrev",null,"Weight\nClass:",72]
["Body Weight:",70,null,"Events Entered:",null,"Division(s)",null,null,"Body Weight:",75,null,"Events Entered:",null,"Division(s)"]
["Lifter/Coach\nInitials:",null,null,"pl",null,"FR-O",null,null,"Lifter/Coach\nInitials:",null,null,"pl",null,"FR-O"]
["Event","Rack Hts","1st\nAttempt","2nd Attempt","3rd\nAttempt","Best Attempt","Place",null,"Event","Rack Hts","1st\nAttempt","2nd Attempt","3rd\nAttempt","Best Attempt","Place"]
["Squat","12",null,null,null,null,null,null,"Squat","13"]
["Bench Press","10-9",null,null,null,null,null,null,"Bench Press","10-10"]
[null,null,null,null,"Subtotal",null,null,null,null,null,null,null,"Subtotal"]
["Deadlift",null,null,null,null,null,null,null,"Deadlift"]
["IPF Points:",null,null,null,"Total",null,null,null,"IPF Points:",null,null,null,"Total"]

{"sheet":"ContestResults","index":9,"n_rows":1,"n_cols":33,"rows_kept":1,"cut":false,"hidden":true,"merged":[]}
[null,null,null,null,null,null,null,null,null,null,null,null,null,null,null,null,null,null,null,null,null,null,null,null,null,null,null,null,null,null,null,null,{"$f":"3*COUNTA(C:C)","v":0}]

{"sheet":"ContestLog","index":10,"n_rows":1232,"n_cols":10,"rows_kept":1232,"cut":false,"hidden":true,"merged":[]}
["Time","Name",{"$f":"\"Weight Cls \"&IF(Setup!B39=\"Kilograms\",\"(Kg)\",\"(Lb)\")","v":"Weight Cls (Lb)"},"Lift",{"$f":"\"Weight (\"&Setup!G15&\")\"","v":"Weight (Kg)"},{"$f":"\"Total (\"&Setup!G15&\")\"","v":"Total (Kg)"},"Record?",null,null,{"$f":"COUNTA(B:B)+1","v":1233}]
["16:16:29","山下 彩",43,"Squat 1",100]
["16:16:31","高岡 美穂",47,"Squat 1",110]
["16:16:32","酒井 維吹",53,"Squat 1",120]
["16:16:33","野口 貴史",59,"Squat 1",130]
["16:16:35","安倉 明徳",66,"Squat 1",140]
["16:16:36","吉村 雄一",66,"Squat 1",150]
["16:16:37","菅原 大輔",59,"Squat 1",150]
["16:16:39","久保田 甲斐",74,"Squat 1",160]
["16:16:40","阪本 賢一",83,"Squat 1",160]
["16:16:41","松尾 静葵",83,"Squat 1",180]
["16:16:44","後藤 隆",83,"Squat 1",200]
["16:16:54","山下 彩",43,"Bench Press 1",100]
["16:16:55","高岡 美穂",47,"Bench Press 1",110]
["16:16:57","酒井 維吹",53,"Bench Press 1",120]
["16:16:59","野口 貴史",59,"Bench Press 1",130]
["16:17:00","安倉 明徳",66,"Bench Press 1",140]
["16:17:01","吉村 雄一",66,"Bench Press 1",150]
["16:17:02","菅原 大輔",59,"Bench Press 1",150]
["16:17:03","久保田 甲斐",74,"Bench Press 1",160]
["16:17:05","阪本 賢一",83,"Bench Press 1",160]
["16:17:06","松尾 静葵",83,"Bench Press 1",180]
["16:17:07","後藤 隆",83,"Bench Press 1",200]
["16:17:13","山下 彩",43,"Deadlift 1",-100]
["16:17:14","高岡 美穂",47,"Deadlift 1",-110]
["16:17:15","酒井 維吹",53,"Deadlift 1",-120]
["16:17:17","野口 貴史",59,"Deadlift 1",-130]
["16:17:18","安倉 明徳",66,"Deadlift 1",140,420]
["16:17:19","吉村 雄一",66,"Deadlift 1",-150]
["16:17:20","菅原 大輔",59,"Deadlift 1",-150]
["16:17:21","久保田 甲斐",74,"Deadlift 1",160,480]
["16:17:22","阪本 賢一",83,"Deadlift 1",-160]
["16:17:23","松尾 静葵",83,"Deadlift 1",180,540]
["16:17:25","後藤 隆",83,"Deadlift 1",-200]
["16:17:26","後藤 隆",83,"Deadlift 1",200,600]
["16:18:10","山下 彩",43,"Deadlift 2",100,300]
["16:18:11","高岡 美穂",47,"Deadlift 2",110,330]
["16:18:12","酒井 維吹",53,"Deadlift 2",120,360]
["16:18:14","野口 貴史",59,"Deadlift 2",130,390]
["16:18:15","安倉 明徳",66,"Deadlift 2",142.5,422.5]
["16:18:16","吉村 雄一",66,"Deadlift 2",150,450]
["16:18:18","菅原 大輔",59,"Deadlift 2",150,450]
["16:18:19","阪本 賢一",83,"Deadlift 2",160,480]
["16:18:20","久保田 甲斐",74,"Deadlift 2",170,490]
["16:18:22","松尾 静葵",83,"Deadlift 2",185,545]
["16:18:23","後藤 隆",83,"Deadlift 2",205,605]
["16:20:56","山本 僚介",120,"Deadlift 1",120]
["16:20:57","上田 真司","120+","Deadlift 1",120]
["16:20:59","塚村 英夫",53,"Deadlift 1",130]
["16:21:00","西田 貴胤",120,"Deadlift 1",130]
["16:21:02","植野 哲",93,"Deadlift 1",-140]
["16:21:03","山下 保樹","120+","Deadlift 1",140]
["16:21:05","岩本 隆全","120+","Deadlift 1",150]
["16:21:28","山本 僚介",120,"Deadlift 2",130]
["16:21:30","上田 真司","120+","Deadlift 2",130]
["16:21:32","植野 哲",93,"Deadlift 2",140]
["16:21:33","塚村 英夫",53,"Deadlift 2",140]
["16:21:36","西田 貴胤",120,"Deadlift 2",140]
["16:21:38","山下 保樹","120+","Deadlift 2",145]
["16:21:57","山本 僚介",120,"Squat 1",120]
["16:21:59","上田 真司","120+","Squat 1",120]
["16:22:03","塚村 英夫",53,"Squat 1",130]
["16:22:07","西田 貴胤",120,"Squat 1",130]
["16:22:09","植野 哲",93,"Squat 1",140]
["16:22:11","山下 保樹","120+","Squat 1",140]
["16:22:12","岩本 隆全","120+","Squat 1",150]
["16:23:01","山本 僚介",120,"Bench Press 1",120,370]
["16:23:03","上田 真司","120+","Bench Press 1",120,370]
["16:23:04","塚村 英夫",53,"Bench Press 1",130,400]
["16:23:06","西田 貴胤",120,"Bench Press 1",130,400]
["16:23:08","植野 哲",93,"Bench Press 1",140,420]
["16:23:10","山下 保樹","120+","Bench Press 1",140,425]
["16:23:12","岩本 隆全","120+","Bench Press 1",150,450]
["00:51:32","山下 彩",43,"Squat 1",-100]
["00:51:35","高岡 美穂",47,"Squat 1",-110]
["00:51:38","酒井 維吹",59,"Squat 1",-120]
["00:51:55","久保田 甲斐",74,"Squat 1",-160]
["00:52:01","久保田 甲斐",74,"Squat 1",160,490]
["00:52:05","久保田 甲斐",74,"Squat 1",-160]
["00:52:07","久保田 甲斐",74,"Squat 1",160,490]
["00:52:14","久保田 甲斐",74,"Squat 1",-160]
["00:52:16","久保田 甲斐",74,"Squat 1",-160]
["00:52:20","久保田 甲斐",74,"Squat 1",-160]
["00:53:00","山下 彩",43,"Squat 1",100,300]
["00:53:02","高岡 美穂",47,"Squat 1",110,330]
["00:53:03","酒井 維吹",59,"Squat 1",120,360]
["00:53:05","野口 貴史",59,"Squat 1",130,390]
["00:53:27","山下 彩",43,"Squat 1",100,300]
["00:53:29","高岡 美穂",47,"Squat 1",110,330]
["00:53:31","酒井 維吹",59,"Squat 1",120,360]
["00:53:33","野口 貴史",59,"Squat 1",130,390]
["00:53:34","安倉 明徳",66,"Squat 1",140,422.5]
["00:53:37","吉村 雄一",59,"Squat 1",150,450]
["00:53:39","菅原 大輔",53,"Squat 1",150,450]
["00:53:40","久保田 甲斐",74,"Squat 1",160,490]
["00:53:42","阪本 賢一",83,"Squat 1",160,480]
["00:53:43","松尾 静葵",59,"Squat 1",180,545]
["14:25:25","山下 彩",43,"Bench Press 1",100]
["14:25:27","高岡 美穂",47,"Bench Press 1",110]
["14:25:29","酒井 維吹",59,"Bench Press 1",-120]
["14:25:30","野口 貴史",59,"Bench Press 1",130]
["14:25:32","安倉 明徳",66,"Bench Press 1",140]
["14:25:33","吉村 雄一",59,"Bench Press 1",150]
["14:25:34","菅原 大輔",53,"Bench Press 1",150]
["14:25:37","久保田 甲斐",74,"Bench Press 1",160]
["14:25:38","阪本 賢一",83,"Bench Press 1",160]
["14:25:39","松尾 静葵",59,"Bench Press 1",180]
["14:35:49","後藤 隆",83,"Bench Press 1",200,605]
["14:35:59","山下 彩",43,"Squat 2",120,320]
["14:36:00","高岡 美穂",47,"Squat 2",130,350]
["14:36:02","酒井 維吹",59,"Squat 2",140]
["14:36:04","野口 貴史",59,"Squat 2",150,410]
["14:36:05","安倉 明徳",66,"Squat 2",160,442.5]
["14:36:07","吉村 雄一",59,"Squat 2",170,470]
["14:36:08","菅原 大輔",53,"Squat 2",180,480]
["14:36:09","久保田 甲斐",74,"Squat 2",190,520]
["14:36:11","松尾 静葵",59,"Squat 2",190,555]
["14:36:12","阪本 賢一",83,"Squat 2",200,520]
["14:36:24","後藤 隆",83,"Squat 2",220,625]
["14:36:26","後藤 隆",83,"Squat 2",-220,605]
["23:20:57","山下 彩",43,"Squat 1",-100]
["23:21:07","酒井 維吹",52,"Squat 1",-120]
["23:21:12","野口 貴史",57,"Squat 1",130]
["23:21:22","吉村 雄一",63,"Squat 1",-150]
["23:21:28","菅原 大輔",57,"Squat 1",160]
["23:31:20","山下 彩",43,"Squat 1",100]
["23:31:22","高岡 美穂",47,"Squat 1",-110]
["23:31:23","酒井 維吹",52,"Squat 1",120]
["23:31:25","野口 貴史",57,"Squat 1",130]
["23:31:27","安倉 明徳",72,"Squat 1",140]
["23:31:28","吉村 雄一",63,"Squat 1",-150]
["23:31:29","菅原 大輔",57,"Squat 1",160]
["23:31:31","久保田 甲斐",72,"Squat 1",-170]
["23:31:32","阪本 賢一",84,"Squat 1",-180]
["23:31:34","松尾 静葵",84,"Squat 1",190]
["23:31:36","後藤 隆",84,"Squat 1",200]
["23:32:00","山下 彩",43,"Squat 2",120]
["23:32:02","高岡 美穂",47,"Squat 2",130]
["23:32:04","酒井 維吹",52,"Squat 2",-140,360]
["23:32:05","野口 貴史",57,"Squat 2",150]
["23:32:06","安倉 明徳",72,"Squat 2",-160,420]
["23:32:07","吉村 雄一",63,"Squat 2",170]
["23:32:09","菅原 大輔",57,"Squat 2",-180,480]
["23:32:11","久保田 甲斐",72,"Squat 2",190]
["23:32:12","阪本 賢一",84,"Squat 2",-200]
["23:32:14","松尾 静葵",84,"Squat 2",210]
["23:32:15","後藤 隆",84,"Squat 2",-220,600]
["23:32:16","後藤 隆",84,"Squat 2",220]
["23:32:43","後藤 隆",84,"Squat 2",-220,625]
["23:32:44","後藤 隆",84,"Squat 2",-220,625]
["23:32:50","山下 彩",43,"Squat 3",-140,320]
["23:32:51","高岡 美穂",47,"Squat 3",-150,350]
["23:32:52","酒井 維吹",52,"Squat 3",-160,360]
["23:32:53","野口 貴史",57,"Squat 3",-170,410]
["23:32:54","吉村 雄一",63,"Squat 3",-175,470]
["23:32:55","安倉 明徳",72,"Squat 3",-180,420]
["23:32:57","菅原 大輔",57,"Squat 3",-180,480]
["23:32:58","久保田 甲斐",72,"Squat 3",-195,530]
["23:32:59","阪本 賢一",84,"Squat 3",-200]
["23:33:00","松尾 静葵",84,"Squat 3",215]
["23:33:01","後藤 隆",84,"Squat 3",-225,600]
["23:33:02","後藤 隆",84,"Squat 3",225]
["23:33:11","山下 彩",43,"Bench Press 1",100]
["23:33:12","高岡 美穂",47,"Bench Press 1",-110]
["23:33:14","酒井 維吹",52,"Bench Press 1",120]
["23:33:15","野口 貴史",57,"Bench Press 1",-130]
["23:33:16","安倉 明徳",72,"Bench Press 1",140]
["23:33:18","吉村 雄一",63,"Bench Press 1",-150]
["23:33:19","菅原 大輔",57,"Bench Press 1",160]
["23:33:20","久保田 甲斐",72,"Bench Press 1",-170]
["23:33:22","阪本 賢一",84,"Bench Press 1",180]
["23:33:26","松尾 静葵",84,"Bench Press 1",-190]
["23:33:27","後藤 隆",84,"Bench Press 1",200]
["23:33:55","山下 彩",43,"Bench Press 2",120]
["23:33:56","酒井 維吹",52,"Bench Press 2",120]
["23:33:58","高岡 美穂",47,"Bench Press 2",130]
["23:33:59","安倉 明徳",72,"Bench Press 2",140]
["23:34:00","野口 貴史",57,"Bench Press 2",150]
["23:34:01","菅原 大輔",57,"Bench Press 2",160]
["23:34:02","吉村 雄一",63,"Bench Press 2",170]
["23:34:03","久保田 甲斐",72,"Bench Press 2",190]
["23:34:04","松尾 静葵",84,"Bench Press 2",215]
["23:34:05","阪本 賢一",84,"Bench Press 2",220]
["23:34:12","後藤 隆",84,"Bench Press 2",-220,625]
["23:34:18","山下 彩",43,"Bench Press 2",-120,320]
["23:34:25","山下 彩",43,"Bench Press 2",120]
["23:34:55","山下 彩",43,"Bench Press 3",150]
["23:34:57","酒井 維吹",52,"Bench Press 3",-160,360]
["23:34:58","野口 貴史",57,"Bench Press 3",-160,430]
["23:34:59","高岡 美穂",47,"Bench Press 3",-170,370]
["23:35:00","菅原 大輔",57,"Bench Press 3",-170,480]
["23:35:02","安倉 明徳",72,"Bench Press 3",-180,420]
["23:35:03","吉村 雄一",63,"Bench Press 3",-180,490]
["23:35:04","久保田 甲斐",72,"Bench Press 3",-200,550]
["23:35:05","松尾 静葵",84,"Bench Press 3",-220,620]
["23:35:06","阪本 賢一",84,"Bench Press 3",-225]
["23:35:07","後藤 隆",84,"Bench Press 3",-225,625]
["23:35:08","後藤 隆",84,"Bench Press 3",-225,625]
["23:35:21","山下 彩",43,"Deadlift 1",100,370]
["23:35:23","高岡 美穂",47,"Deadlift 1",110,370]
["23:35:24","酒井 維吹",52,"Deadlift 1",120,360]
["23:35:25","野口 貴史",57,"Deadlift 1",130,430]
["23:35:27","安倉 明徳",72,"Deadlift 1",140,420]
["23:35:28","吉村 雄一",63,"Deadlift 1",150,490]
["23:35:29","菅原 大輔",57,"Deadlift 1",160,480]
["23:35:31","久保田 甲斐",72,"Deadlift 1",170,550]
["23:35:32","阪本 賢一",84,"Deadlift 1",180]
["23:35:33","松尾 静葵",84,"Deadlift 1",190,620]
["23:35:35","後藤 隆",84,"Deadlift 1",200,625]
["23:39:24","山下 彩",43,"Deadlift 2",-110,370]
["23:39:26","高岡 美穂",47,"Deadlift 2",120,380]
["23:39:27","酒井 維吹",52,"Deadlift 2",130,370]
["23:39:29","野口 貴史",57,"Deadlift 2",-140,430]
["23:39:30","安倉 明徳",72,"Deadlift 2",150,430]
["23:39:32","吉村 雄一",63,"Deadlift 2",-160,490]
["23:39:33","菅原 大輔",57,"Deadlift 2",170,490]
["23:39:35","久保田 甲斐",72,"Deadlift 2",-180,550]
["23:39:37","阪本 賢一",84,"Deadlift 2",190]
["23:39:39","松尾 静葵",84,"Deadlift 2",-200,620]
["23:39:41","後藤 隆",84,"Deadlift 2",215,640]
["23:40:03","山下 彩",43,"Deadlift 3",-120,370]
["23:40:04","高岡 美穂",47,"Deadlift 3",-130,380]
["23:40:05","酒井 維吹",52,"Deadlift 3",-140,370]
["23:40:06","野口 貴史",57,"Deadlift 3",-150,430]
["23:40:08","安倉 明徳",72,"Deadlift 3",-160,430]
["23:40:09","吉村 雄一",63,"Deadlift 3",-170,490]
["23:40:10","菅原 大輔",57,"Deadlift 3",-180,490]
["23:40:12","久保田 甲斐",72,"Deadlift 3",-190,550]
["23:40:13","阪本 賢一",84,"Deadlift 3",-200]
["23:40:14","松尾 静葵",84,"Deadlift 3",-210,620]
["23:40:15","後藤 隆",84,"Deadlift 3",220,645]
["18:17:08","山下 彩",47,"Squat 1",100]
["18:17:13","高岡 美穂",47,"Squat 1",-110]
["23:57:23","山下 彩",47,"Bench Press 2",0,300]
["00:02:06","高岡 美穂",47,"Bench Press 2",0]
["00:04:09","酒井 維吹",52,"Bench Press 2",0]
["00:05:55","山下 彩",47,"Squat 1",100]
["00:06:01","高岡 美穂",47,"Squat 1",110]
["00:06:08","酒井 維吹",52,"Squat 1",-120]
["13:33:58","菅原 大輔",57,"Squat 2",0]
["13:36:01","久保田 甲斐",72,"Squat 2",0]
["13:42:29","阪本 賢一",84,"Squat 2",0]
["13:42:45","松尾 静葵",84,"Squat 2",0,570]
["13:43:54","後藤 隆",84,"Squat 2",0]
["13:55:42","後藤 隆",84,"Squat 2",0]
["14:00:27","山下 彩",47,"Bench Press 3",0,300]
["14:01:23","菅原 大輔",57,"Bench Press 3",0,480]
["14:01:58","久保田 甲斐",72,"Bench Press 3",0,510]
["14:02:33","松尾 静葵",84,"Bench Press 3",0,570]
["14:03:20","後藤 隆",84,"Bench Press 3",0]
["14:03:56","後藤 隆",84,"Bench Press 3",0]
["14:05:29","野口 貴史",57,"Bench Press 3",0,390]
["14:06:40","安倉 明徳",72,"Bench Press 3",0,420]
["14:07:05","吉村 雄一",63,"Bench Press 3",0,450]
["14:35:31","酒井 維吹",52,"Bench Press 1",120]
["14:36:01","野口 貴史",57,"Bench Press 1",130]
["14:36:45","安倉 明徳",72,"Bench Press 1",140]
["14:37:01","吉村 雄一",63,"Bench Press 1",-150]
["17:17:58","阪本 賢一",84,"Bench Press 1",180]
["21:48:42","後藤 隆",84,"Deadlift 1",200]
["21:48:58","後藤 隆",84,"Deadlift 1",-200]
["10:05:20","上田 真司","84+","Squat 1",-220]
["10:05:23","塚村 英夫",52,"Squat 1",230]
["10:05:28","西田 貴胤","84+","Squat 1",240]
["10:06:52","植野 哲","84+","Squat 1",-250]
["10:06:59","岩本 隆全","84+","Squat 1",270]
["10:09:51","山本 僚介","84+","Squat 2",0]
["10:09:54","上田 真司","84+","Squat 2",0]
["10:10:00","塚村 英夫",52,"Squat 2",0]
["10:10:09","植野 哲","84+","Squat 2",0]
["10:10:29","山下 保樹","84+","Squat 2",0]
["10:13:51","山本 僚介","84+","Squat 3",0]
["10:13:55","上田 真司","84+","Squat 3",0]
["10:14:01","西田 貴胤","84+","Squat 3",0]
["10:29:12","植野 哲","84+","Squat 3",0]
["10:29:14","山下 保樹","84+","Squat 3",0,780]
["10:29:23","上田 真司","84+","Squat 1",220]
["10:29:25","塚村 英夫",52,"Squat 1",-230]
["10:29:28","西田 貴胤","84+","Squat 1",240]
["10:29:30","植野 哲","84+","Squat 1",-250]
["10:29:32","山下 保樹","84+","Squat 1",260]
["10:29:41","山本 僚介","84+","Squat 2",0]
["10:39:10","上田 真司","84+","Squat 2",0]
["10:39:15","塚村 英夫",52,"Squat 2",0]
["11:24:57","西田 貴胤","84+","Squat 2",0]
["11:25:01","植野 哲","84+","Squat 2",0]
["11:25:03","山下 保樹","84+","Squat 2",0]
["11:25:21","岩本 隆全","84+","Squat 2",0]
["11:27:39","山本 僚介","84+","Squat 3",0]
["11:27:41","上田 真司","84+","Squat 3",0]
["11:27:43","塚村 英夫",52,"Squat 3",0]
["11:27:45","西田 貴胤","84+","Squat 3",0]
["11:27:47","植野 哲","84+","Squat 3",0]
["11:28:14","山下 保樹","84+","Squat 3",0]
["11:28:18","岩本 隆全","84+","Squat 3",0]
["11:28:24","山本 僚介","84+","Bench Press 1",210]
["11:28:26","上田 真司","84+","Bench Press 1",220]
["11:28:27","塚村 英夫",52,"Bench Press 1",230]
["11:28:29","西田 貴胤","84+","Bench Press 1",240]
["11:28:32","植野 哲","84+","Bench Press 1",250]
["11:28:33","山下 保樹","84+","Bench Press 1",260]
["11:28:35","岩本 隆全","84+","Bench Press 1",270]
["11:29:04","山本 僚介","84+","Bench Press 2",0,630]
["11:29:05","上田 真司","84+","Bench Press 2",0,660]
["11:29:07","塚村 英夫",52,"Bench Press 2",0]
["11:29:08","西田 貴胤","84+","Bench Press 2",0,720]
["11:29:10","植野 哲","84+","Bench Press 2",0]
["11:29:11","山下 保樹","84+","Bench Press 2",0,780]
["11:29:13","岩本 隆全","84+","Bench Press 2",0,810]
["11:29:22","山本 僚介","84+","Deadlift 1",210]
["11:29:23","上田 真司","84+","Deadlift 1",220,660]
["11:29:25","塚村 英夫",52,"Deadlift 1",230]
["11:29:40","西田 貴胤","84+","Deadlift 1",240,720]
["11:29:42","植野 哲","84+","Deadlift 1",250]
["11:29:44","山下 保樹","84+","Deadlift 1",260,780]
["11:30:19","山本 僚介","84+","Bench Press 2",0]
["11:30:22","上田 真司","84+","Bench Press 2",0,660]
["11:30:23","塚村 英夫",52,"Bench Press 2",0]
["11:30:24","西田 貴胤","84+","Bench Press 2",0,720]
["11:33:05","植野 哲","84+","Bench Press 2",0]
["11:33:08","山下 保樹","84+","Bench Press 2",0,780]
["11:33:14","山本 僚介","84+","Deadlift 1",210]
["11:33:15","上田 真司","84+","Deadlift 1",220,660]
["11:33:17","塚村 英夫",52,"Deadlift 1",-230]
["11:35:57","山本 僚介","84+","Deadlift 1",-210]
["11:36:01","上田 真司","84+","Deadlift 1",-220]
["11:36:06","塚村 英夫",52,"Deadlift 1",-230]
["11:36:10","西田 貴胤","84+","Deadlift 1",-240]
["11:36:14","植野 哲","84+","Deadlift 1",-250]
["11:36:19","山下 保樹","84+","Deadlift 1",-260]
["11:36:21","岩本 隆全","84+","Deadlift 1",-270]
["11:36:24","岩本 隆全","84+","Deadlift 1",-270]
["11:56:35","山下 彩",47,"Squat 1",100]
["11:56:37","高岡 美穂",47,"Squat 1",110]
["11:56:38","酒井 維吹",52,"Squat 1",120]
["11:56:39","野口 貴史",57,"Squat 1",130]
["11:56:40","安倉 明徳",66,"Squat 1",140]
["11:56:41","吉村 雄一",66,"Squat 1",150]
["11:56:43","菅原 大輔",57,"Squat 1",160]
["11:56:44","久保田 甲斐",72,"Squat 1",170]
["11:56:45","阪本 賢一",83,"Squat 1",180]
["11:56:48","松尾 静葵",84,"Squat 1",190]
["11:56:49","後藤 隆",83,"Squat 1",200]
["11:56:54","山下 彩",47,"Bench Press 1",100]
["11:56:55","高岡 美穂",47,"Bench Press 1",110]
["11:56:56","酒井 維吹",52,"Bench Press 1",120]
["11:56:57","野口 貴史",57,"Bench Press 1",130]
["11:56:58","安倉 明徳",66,"Bench Press 1",140]
["11:56:59","吉村 雄一",66,"Bench Press 1",150]
["11:57:12","菅原 大輔",57,"Bench Press 1",160]
["11:57:13","久保田 甲斐",72,"Bench Press 1",170]
["11:57:14","阪本 賢一",83,"Bench Press 1",180]
["11:57:16","松尾 静葵",84,"Bench Press 1",190]
["11:57:17","後藤 隆",83,"Bench Press 1",200]
["11:57:22","山下 彩",47,"Deadlift 1",100,300]
["11:57:23","高岡 美穂",47,"Deadlift 1",110,330]
["11:57:24","酒井 維吹",52,"Deadlift 1",120,360]
["11:57:25","野口 貴史",57,"Deadlift 1",130,390]
["11:57:26","安倉 明徳",66,"Deadlift 1",140,420]
["11:57:28","吉村 雄一",66,"Deadlift 1",150,450]
["11:57:29","菅原 大輔",57,"Deadlift 1",160,480]
["11:57:30","久保田 甲斐",72,"Deadlift 1",170,510]
["11:57:31","阪本 賢一",83,"Deadlift 1",180,540]
["11:57:32","松尾 静葵",84,"Deadlift 1",190,570]
["11:57:34","後藤 隆",83,"Deadlift 1",200,600]
["11:57:35","後藤 隆",83,"Deadlift 1",200,600]
["11:57:35","後藤 隆",83,"Deadlift 1",200,600]
["11:57:36","後藤 隆",83,"Deadlift 1",200,600]
["11:58:29","山本 僚介","84+","Deadlift 1",210]
["11:58:30","上田 真司","84+","Deadlift 1",220,660]
["11:58:32","塚村 英夫",52,"Deadlift 1",230]
["11:58:33","西田 貴胤","84+","Deadlift 1",240,720]
["12:00:42","植野 哲","84+","Deadlift 1",250]
["12:00:43","山下 保樹","84+","Deadlift 1",260,780]
["12:00:45","岩本 隆全","84+","Deadlift 1",270,810]
["12:00:48","岩本 隆全","84+","Deadlift 1",270,810]
["12:11:55","久保田 甲斐",72,"Squat 1",170,510]
["12:11:57","高岡 美穂",47,"Squat 1",110,330]
["12:11:58","松尾 静葵",84,"Squat 1",190,570]
["12:11:59","安倉 明徳",66,"Squat 1",140,420]
["12:12:01","阪本 賢一",83,"Squat 1",180,540]
["12:12:02","吉村 雄一",66,"Squat 1",150,450]
["12:12:03","後藤 隆",83,"Squat 1",200,600]
["12:12:05","後藤 隆",83,"Squat 1",200,600]
["12:12:19","山本 僚介","84+","Squat 1",210,630]
["12:12:35","上田 真司","84+","Squat 1",220,660]
["16:12:36","山下 彩",47,"Squat 1",100]
["16:12:37","高岡 美穂",47,"Squat 1",110]
["16:12:38","酒井 維吹",52,"Squat 1",120]
["16:12:39","野口 貴史",57,"Squat 1",130]
["16:12:40","安倉 明徳",72,"Squat 1",140]
["16:12:42","吉村 雄一",63,"Squat 1",150]
["16:12:43","菅原 大輔",57,"Squat 1",160]
["16:12:44","久保田 甲斐",72,"Squat 1",170]
["16:12:45","阪本 賢一",84,"Squat 1",180]
["16:12:46","松尾 静葵",84,"Squat 1",190]
["16:12:48","後藤 隆",84,"Squat 1",200]
["16:12:52","山下 彩",47,"Bench Press 1",100]
["16:12:53","高岡 美穂",47,"Bench Press 1",110]
["16:12:55","酒井 維吹",52,"Bench Press 1",120]
["16:12:56","野口 貴史",57,"Bench Press 1",130]
["16:12:57","安倉 明徳",72,"Bench Press 1",140]
["16:12:58","吉村 雄一",63,"Bench Press 1",150]
["16:12:59","菅原 大輔",57,"Bench Press 1",160]
["16:13:00","久保田 甲斐",72,"Bench Press 1",170]
["16:13:02","阪本 賢一",84,"Bench Press 1",180]
["16:13:03","松尾 静葵",84,"Bench Press 1",190]
["16:13:04","後藤 隆",84,"Bench Press 1",200]
["16:13:05","後藤 隆",84,"Bench Press 1",200]
["16:13:09","山下 彩",47,"Deadlift 1",100,300]
["16:13:10","高岡 美穂",47,"Deadlift 1",110,330]
["16:13:11","酒井 維吹",52,"Deadlift 1",120,360]
["16:13:12","野口 貴史",57,"Deadlift 1",130,390]
["16:13:13","安倉 明徳",72,"Deadlift 1",140,420]
["16:13:14","吉村 雄一",63,"Deadlift 1",150,450]
["16:13:16","菅原 大輔",57,"Deadlift 1",160,480]
["16:13:17","久保田 甲斐",72,"Deadlift 1",170,510]
["16:13:18","阪本 賢一",84,"Deadlift 1",180,540]
["16:13:19","松尾 静葵",84,"Deadlift 1",190,570]
["16:13:20","後藤 隆",84,"Deadlift 1",200,600]
["16:13:22","後藤 隆",84,"Deadlift 1",200,600]
["16:21:06","山下 彩",47,"Squat 1",100]
["16:21:08","高岡 美穂",47,"Squat 1",110]
["16:21:09","酒井 維吹",52,"Squat 1",120]
["16:21:10","野口 貴史",57,"Squat 1",130]
["16:21:11","安倉 明徳",72,"Squat 1",140]
["16:21:13","吉村 雄一",63,"Squat 1",-150]
["16:21:14","菅原 大輔",57,"Squat 1",-160]
["16:21:16","久保田 甲斐",72,"Squat 1",-170]
["16:21:18","阪本 賢一",84,"Squat 1",-180]
["16:21:19","松尾 静葵",84,"Squat 1",-190]
["16:21:51","山下 彩",47,"Squat 2",110]
["16:21:52","高岡 美穂",47,"Squat 2",-120,330]
["16:21:55","酒井 維吹",52,"Squat 2",-130,360]
["16:21:58","野口 貴史",57,"Squat 2",-140,390]
["16:22:00","安倉 明徳",72,"Squat 2",-150,420]
["16:22:02","吉村 雄一",63,"Squat 2",-160]
["16:22:04","菅原 大輔",57,"Squat 2",-170]
["16:22:07","久保田 甲斐",72,"Squat 2",-180]
["16:22:10","阪本 賢一",84,"Squat 2",-190]
["16:22:37","山下 彩",47,"Squat 2",110]
["16:22:38","高岡 美穂",47,"Squat 2",120]
["16:22:40","酒井 維吹",52,"Squat 2",130]
["16:22:41","野口 貴史",57,"Squat 2",140]
["16:22:42","安倉 明徳",72,"Squat 2",150]
["16:22:44","吉村 雄一",63,"Squat 2",160]
["16:22:45","菅原 大輔",57,"Squat 2",170]
["16:22:46","久保田 甲斐",72,"Squat 2",180]
["16:22:47","阪本 賢一",84,"Squat 2",190]
["16:22:49","松尾 静葵",84,"Squat 2",200]
["16:22:50","後藤 隆",84,"Squat 2",-210,600]
["16:23:00","山下 彩",47,"Squat 2",110]
["16:23:01","高岡 美穂",47,"Squat 2",-120,330]
["16:23:11","酒井 維吹",52,"Squat 2",-130,360]
["16:23:49","山下 彩",47,"Squat 1",-100,310]
["16:24:24","高岡 美穂",47,"Squat 1",-110]
["16:26:03","酒井 維吹",52,"Squat 1",-120]
["17:35:27","野口 貴史",57,"Squat 1",130]
["17:35:28","安倉 明徳",72,"Squat 1",-140,430]
["17:35:30","吉村 雄一",63,"Squat 1",150]
["17:35:32","菅原 大輔",57,"Squat 1",-160,490]
["17:35:38","山下 彩",47,"Squat 2",110]
["17:35:40","高岡 美穂",47,"Squat 2",-120]
["17:35:41","酒井 維吹",52,"Squat 2",130]
["17:35:42","野口 貴史",57,"Squat 2",-140,390]
["17:35:46","安倉 明徳",72,"Squat 2",150]
["17:35:48","吉村 雄一",63,"Squat 2",-160,450]
["17:35:49","菅原 大輔",57,"Squat 2",170]
["17:35:51","久保田 甲斐",72,"Squat 2",-180]
["17:39:08","阪本 賢一",84,"Squat 2",190]
["17:39:11","松尾 静葵",84,"Squat 2",-200]
["17:39:13","後藤 隆",84,"Squat 2",210]
["17:39:16","後藤 隆",84,"Squat 2",-210,600]
["17:39:27","山下 彩",47,"Squat 1",100]
["17:39:31","高岡 美穂",47,"Squat 1",-110]
["17:39:34","酒井 維吹",52,"Squat 1",120]
["17:39:37","野口 貴史",57,"Squat 1",-130]
["17:39:40","安倉 明徳",72,"Squat 1",140]
["17:39:43","吉村 雄一",63,"Squat 1",-150]
["17:39:47","菅原 大輔",57,"Squat 1",160]
["17:39:50","久保田 甲斐",72,"Squat 1",170]
["17:39:53","阪本 賢一",84,"Squat 1",180]
["17:40:16","山下 彩",47,"Squat 2",110]
["17:40:19","高岡 美穂",47,"Squat 2",120]
["17:40:22","酒井 維吹",52,"Squat 2",130]
["17:40:25","野口 貴史",57,"Squat 2",140]
["17:40:28","安倉 明徳",72,"Squat 2",150]
["17:40:31","吉村 雄一",63,"Squat 2",160]
["17:40:33","菅原 大輔",57,"Squat 2",170]
["17:40:36","久保田 甲斐",72,"Squat 2",180]
["17:40:39","阪本 賢一",84,"Squat 2",190]
["17:40:41","松尾 静葵",84,"Squat 2",200]
["17:40:44","後藤 隆",84,"Squat 2",210]
["17:41:06","山下 彩",47,"Bench Press 1",100]
["17:41:08","高岡 美穂",47,"Bench Press 1",110]
["17:41:11","酒井 維吹",52,"Bench Press 1",-120]
["17:41:14","野口 貴史",57,"Bench Press 1",130]
["17:41:17","安倉 明徳",72,"Bench Press 1",-140]
["17:41:20","吉村 雄一",63,"Bench Press 1",150]
["17:41:23","菅原 大輔",57,"Bench Press 1",-160]
["17:41:25","久保田 甲斐",72,"Bench Press 1",170]
["17:41:28","阪本 賢一",84,"Bench Press 1",180]
["17:41:31","松尾 静葵",84,"Bench Press 1",190]
["17:41:43","山下 彩",47,"Deadlift 1",100,310]
["17:41:45","高岡 美穂",47,"Deadlift 1",110,340]
["17:41:48","酒井 維吹",52,"Deadlift 1",120]
["17:41:50","野口 貴史",57,"Deadlift 1",130,400]
["17:41:53","安倉 明徳",72,"Deadlift 1",140]
["17:41:56","吉村 雄一",63,"Deadlift 1",150,460]
["17:41:58","菅原 大輔",57,"Deadlift 1",160]
["17:42:01","久保田 甲斐",72,"Deadlift 1",-170]
["17:42:04","阪本 賢一",84,"Deadlift 1",180,550]
["17:42:06","松尾 静葵",84,"Deadlift 1",-190]
["17:42:23","後藤 隆",84,"Deadlift 1",200]
["17:42:30","久保田 甲斐",72,"Deadlift 2",170,520]
["17:42:33","松尾 静葵",84,"Deadlift 2",190,580]
["17:42:49","山本 僚介","84+","Deadlift 1",210]
["17:42:52","上田 真司","84+","Deadlift 1",220]
["17:42:54","塚村 英夫",52,"Deadlift 1",230]
["17:42:57","西田 貴胤","84+","Deadlift 1",240]
["17:42:59","植野 哲","84+","Deadlift 1",250]
["17:43:02","山下 保樹","84+","Deadlift 1",260]
["17:43:05","岩本 隆全","84+","Deadlift 1",270]
["17:44:04","山下 彩",47,"Squat 1",100]
["17:44:07","高岡 美穂",47,"Squat 1",110]
["17:44:10","酒井 維吹",52,"Squat 1",-120]
["17:44:13","野口 貴史",57,"Squat 1",130]
["17:44:15","安倉 明徳",72,"Squat 1",-140]
["17:44:18","吉村 雄一",63,"Squat 1",150]
["17:44:21","菅原 大輔",57,"Squat 1",-160]
["17:44:23","久保田 甲斐",72,"Squat 1",170]
["17:44:26","阪本 賢一",84,"Squat 1",-180]
["17:44:29","松尾 静葵",84,"Squat 1",190]
["17:44:32","後藤 隆",84,"Squat 1",200]
["17:44:35","後藤 隆",84,"Squat 1",200]
["17:45:02","山下 彩",47,"Bench Press 1",100]
["17:45:05","高岡 美穂",47,"Bench Press 1",110]
["17:45:07","酒井 維吹",52,"Bench Press 1",120]
["17:45:10","野口 貴史",57,"Bench Press 1",130]
["17:45:13","安倉 明徳",72,"Bench Press 1",140]
["17:45:16","吉村 雄一",63,"Bench Press 1",150]
["17:45:19","菅原 大輔",57,"Bench Press 1",160]
["17:45:22","久保田 甲斐",72,"Bench Press 1",170]
["17:45:24","阪本 賢一",84,"Bench Press 1",180]
["17:45:27","松尾 静葵",84,"Bench Press 1",190]
["17:45:30","後藤 隆",84,"Bench Press 1",200]
["17:45:38","山下 彩",47,"Deadlift 1",100,300]
["17:45:41","高岡 美穂",47,"Deadlift 1",110,330]
["17:45:44","酒井 維吹",52,"Deadlift 1",120]
["17:45:47","野口 貴史",57,"Deadlift 1",130,390]
["17:45:49","安倉 明徳",72,"Deadlift 1",140]
["17:45:52","吉村 雄一",63,"Deadlift 1",150,450]
["17:45:55","菅原 大輔",57,"Deadlift 1",160]
["17:46:47","久保田 甲斐",72,"Deadlift 1",170,510]
["17:46:50","阪本 賢一",84,"Deadlift 1",180]
["17:46:53","松尾 静葵",84,"Deadlift 1",-190]
["17:46:55","後藤 隆",84,"Deadlift 1",200,600]
["18:13:12","山下 彩",47,"Bench Press 1",-100]
["18:13:14","高岡 美穂",47,"Bench Press 1",110,330]
["18:13:15","酒井 維吹",52,"Bench Press 1",-120]
["18:13:17","野口 貴史",57,"Bench Press 1",130,390]
["18:13:18","安倉 明徳",72,"Bench Press 1",-140]
["18:13:19","吉村 雄一",63,"Bench Press 1",150,450]
["18:13:21","菅原 大輔",57,"Bench Press 1",-160]
["18:13:23","久保田 甲斐",72,"Bench Press 1",170,510]
["18:13:24","阪本 賢一",84,"Bench Press 1",-180]
["18:13:25","松尾 静葵",84,"Bench Press 1",190]
["18:13:27","後藤 隆",84,"Bench Press 1",200,600]
["18:13:54","山下 彩",47,"Bench Press 2",-120]
["18:13:56","高岡 美穂",47,"Bench Press 2",130,350]
["18:13:57","酒井 維吹",52,"Bench Press 2",140]
["18:13:58","野口 貴史",57,"Bench Press 2",150,410]
["18:13:59","安倉 明徳",72,"Bench Press 2",-160]
["18:14:01","吉村 雄一",63,"Bench Press 2",170,470]
["18:14:02","菅原 大輔",57,"Bench Press 2",180]
["18:14:03","久保田 甲斐",72,"Bench Press 2",190,530]
["18:26:47","阪本 賢一",84,"Bench Press 2",200]
["18:26:48","松尾 静葵",84,"Bench Press 2",-210]
["18:26:50","後藤 隆",84,"Bench Press 2",220,620]
["18:26:56","山下 彩",47,"Deadlift 1",100]
["18:26:58","高岡 美穂",47,"Deadlift 1",-110]
["18:26:59","酒井 維吹",52,"Deadlift 1",120]
["18:27:00","野口 貴史",57,"Deadlift 1",-130]
["18:27:01","安倉 明徳",72,"Deadlift 1",140]
["18:27:02","吉村 雄一",63,"Deadlift 1",150,470]
["18:27:04","菅原 大輔",57,"Deadlift 1",-160]
["18:27:05","久保田 甲斐",72,"Deadlift 1",-170]
["18:27:06","阪本 賢一",84,"Deadlift 1",-180]
["18:27:07","松尾 静葵",84,"Deadlift 1",-190]
["18:27:08","後藤 隆",84,"Deadlift 1",-200]
["18:27:49","山下 彩",47,"Squat 1",100]
["18:27:53","高岡 美穂",47,"Squat 1",110]
["18:28:00","酒井 維吹",52,"Squat 1",-120]
["18:28:05","野口 貴史",57,"Squat 1",130]
["18:28:09","安倉 明徳",72,"Squat 1",-140]
["18:28:13","吉村 雄一",63,"Squat 1",150]
["18:28:17","菅原 大輔",57,"Squat 1",-160]
["18:28:21","久保田 甲斐",72,"Squat 1",170]
["18:28:25","阪本 賢一",84,"Squat 1",180]
["18:28:29","松尾 静葵",84,"Squat 1",190]
["18:28:42","山下 彩",47,"Squat 2",-110,300]
["18:28:43","高岡 美穂",47,"Squat 2",120]
["18:28:45","酒井 維吹",52,"Squat 2",-130]
["18:28:46","野口 貴史",57,"Squat 2",150]
["18:28:47","安倉 明徳",72,"Squat 2",150]
["18:28:48","吉村 雄一",63,"Squat 2",160]
["18:28:49","菅原 大輔",57,"Squat 2",170]
["18:28:50","久保田 甲斐",72,"Squat 2",180]
["18:28:51","阪本 賢一",84,"Squat 2",190]
["18:28:53","松尾 静葵",84,"Squat 2",200]
["18:29:00","山下 彩",47,"Bench Press 1",100]
["18:29:01","高岡 美穂",47,"Bench Press 1",110]
["18:29:02","酒井 維吹",52,"Bench Press 1",120]
["18:29:03","野口 貴史",57,"Bench Press 1",130]
["18:29:04","安倉 明徳",72,"Bench Press 1",140]
["18:29:05","吉村 雄一",63,"Bench Press 1",150]
["18:29:07","菅原 大輔",57,"Bench Press 1",160]
["18:29:08","久保田 甲斐",72,"Bench Press 1",170]
["18:29:09","阪本 賢一",84,"Bench Press 1",180]
["18:29:10","松尾 静葵",84,"Bench Press 1",190]
["18:29:11","後藤 隆",84,"Bench Press 1",200]
["18:29:15","山下 彩",47,"Deadlift 1",100,300]
["18:29:16","高岡 美穂",47,"Deadlift 1",110,340]
["18:29:17","酒井 維吹",52,"Deadlift 1",120]
["18:29:18","野口 貴史",57,"Deadlift 1",130,410]
["18:29:19","安倉 明徳",72,"Deadlift 1",140,430]
["18:29:20","吉村 雄一",63,"Deadlift 1",150,460]
["18:29:21","菅原 大輔",57,"Deadlift 1",160,490]
["18:29:23","久保田 甲斐",72,"Deadlift 1",170,520]
["18:29:24","阪本 賢一",84,"Deadlift 1",180,550]
["18:29:25","松尾 静葵",84,"Deadlift 1",190,580]
["18:29:27","後藤 隆",84,"Deadlift 1",200]
["18:29:38","山下 彩",47,"Deadlift 2",110,310]
["18:29:39","高岡 美穂",47,"Deadlift 2",120,350]
["18:29:40","酒井 維吹",52,"Deadlift 2",130]
["18:29:41","野口 貴史",57,"Deadlift 2",140,420]
["18:29:42","安倉 明徳",72,"Deadlift 2",150,440]
["18:29:43","吉村 雄一",63,"Deadlift 2",160,470]
["18:29:45","菅原 大輔",57,"Deadlift 2",170,500]
["18:29:46","久保田 甲斐",72,"Deadlift 2",180,530]
["18:29:47","阪本 賢一",84,"Deadlift 2",190,560]
["18:29:48","松尾 静葵",84,"Deadlift 2",200,590]
["18:29:49","後藤 隆",84,"Deadlift 2",210]
["18:55:15","山下 彩",47,"Squat 1",100]
["18:55:17","高岡 美穂",47,"Squat 1",110]
["18:55:19","酒井 維吹",52,"Squat 1",120]
["18:55:36","野口 貴史",57,"Squat 1",130]
["18:55:37","安倉 明徳",72,"Squat 1",-140]
["18:55:38","吉村 雄一",63,"Squat 1",150]
["18:55:40","菅原 大輔",57,"Squat 1",160]
["18:55:42","久保田 甲斐",72,"Squat 1",170]
["18:55:43","阪本 賢一",84,"Squat 1",180]
["18:55:45","松尾 静葵",84,"Squat 1",190]
["18:55:46","後藤 隆",84,"Squat 1",200]
["18:55:52","山下 彩",47,"Bench Press 1",100]
["18:55:54","高岡 美穂",47,"Bench Press 1",110]
["18:55:55","酒井 維吹",52,"Bench Press 1",120]
["18:55:57","野口 貴史",57,"Bench Press 1",130]
["18:55:58","安倉 明徳",72,"Bench Press 1",140]
["18:55:59","吉村 雄一",63,"Bench Press 1",150]
["18:56:01","菅原 大輔",57,"Bench Press 1",160]
["18:56:02","久保田 甲斐",72,"Bench Press 1",170]
["18:56:04","阪本 賢一",84,"Bench Press 1",180]
["18:56:05","松尾 静葵",84,"Bench Press 1",190]
["18:56:06","後藤 隆",84,"Bench Press 1",200]
["18:56:08","後藤 隆",84,"Bench Press 1",200]
["18:56:09","後藤 隆",84,"Bench Press 1",200]
["18:56:13","山下 彩",47,"Deadlift 1",100]
["18:56:15","高岡 美穂",47,"Deadlift 1",110]
["18:56:16","酒井 維吹",52,"Deadlift 1",120]
["18:56:17","野口 貴史",57,"Deadlift 1",130]
["18:56:19","安倉 明徳",72,"Deadlift 1",140]
["18:56:20","吉村 雄一",63,"Deadlift 1",150]
["18:56:21","菅原 大輔",57,"Deadlift 1",160]
["18:56:23","久保田 甲斐",72,"Deadlift 1",170]
["18:56:24","阪本 賢一",84,"Deadlift 1",180]
["18:56:25","松尾 静葵",84,"Deadlift 1",190]
["18:56:27","後藤 隆",84,"Deadlift 1",200]
["18:56:28","後藤 隆",84,"Deadlift 1",200]
["18:57:49","山下 彩",47,"Squat 1",100]
["18:57:50","高岡 美穂",47,"Squat 1",110]
["18:57:51","酒井 維吹",52,"Squat 1",120]
["18:57:53","野口 貴史",57,"Squat 1",130]
["18:57:54","安倉 明徳",72,"Squat 1",140]
["18:57:56","吉村 雄一",63,"Squat 1",150]
["18:57:58","菅原 大輔",57,"Squat 1",160]
["18:57:59","久保田 甲斐",72,"Squat 1",170]
["18:58:01","阪本 賢一",84,"Squat 1",180]
["18:58:02","松尾 静葵",84,"Squat 1",190]
["18:58:04","後藤 隆",84,"Squat 1",200]
["18:58:09","山下 彩",47,"Bench Press 1",100]
["18:58:11","高岡 美穂",47,"Bench Press 1",110]
["18:58:12","酒井 維吹",52,"Bench Press 1",120]
["18:58:42","野口 貴史",57,"Bench Press 1",130]
["18:58:43","安倉 明徳",72,"Bench Press 1",140]
["18:58:45","吉村 雄一",63,"Bench Press 1",150]
["18:58:46","菅原 大輔",57,"Bench Press 1",160]
["18:58:48","久保田 甲斐",72,"Bench Press 1",170]
["18:58:49","阪本 賢一",84,"Bench Press 1",180]
["18:58:50","松尾 静葵",84,"Bench Press 1",190]
["18:58:52","後藤 隆",84,"Bench Press 1",200]
["18:58:53","後藤 隆",84,"Bench Press 1",200]
["18:58:59","山下 彩",47,"Deadlift 1",100,300]
["18:59:01","高岡 美穂",47,"Deadlift 1",110,330]
["18:59:02","酒井 維吹",52,"Deadlift 1",120,360]
["18:59:03","野口 貴史",57,"Deadlift 1",130,390]
["18:59:05","安倉 明徳",72,"Deadlift 1",140,420]
["18:59:06","吉村 雄一",63,"Deadlift 1",150,450]
["18:59:08","菅原 大輔",57,"Deadlift 1",160,480]
["18:59:09","久保田 甲斐",72,"Deadlift 1",170,510]
["18:59:10","阪本 賢一",84,"Deadlift 1",180,540]
["18:59:12","松尾 静葵",84,"Deadlift 1",190,570]
["18:59:13","後藤 隆",84,"Deadlift 1",200,600]
["18:59:15","後藤 隆",84,"Deadlift 1",200,600]
["18:59:15","後藤 隆",84,"Deadlift 1",200,600]
["12:39:43","後藤 隆",84,"Deadlift 1",200,600]
["12:39:44","後藤 隆",84,"Deadlift 1",200,600]
["12:39:46","後藤 隆",84,"Deadlift 1",200,600]
["12:39:55","植野 哲","84+","Deadlift 1",250]
["12:39:56","山本 僚介","84+","Deadlift 1",210]
["12:39:58","西田 貴胤","84+","Deadlift 1",240]
["12:39:59","上田 真司","84+","Deadlift 1",-220]
["12:40:00","山下 保樹","84+","Deadlift 1",260]
["12:40:02","岩本 隆全","84+","Deadlift 1",-270]
["12:40:03","山下 彩",47,"Deadlift 1",-100]
["12:40:05","高岡 美穂",47,"Deadlift 1",-110]
["12:40:07","酒井 維吹",52,"Deadlift 1",-120]
["12:40:19","山本 僚介","84+","Deadlift 1",210]
["12:40:21","上田 真司","84+","Deadlift 1",220]
["12:40:22","塚村 英夫",52,"Deadlift 1",230]
["12:40:23","西田 貴胤","84+","Deadlift 1",240]
["12:40:24","植野 哲","84+","Deadlift 1",250]
["12:40:25","山下 保樹","84+","Deadlift 1",260]
["12:40:27","岩本 隆全","84+","Deadlift 1",270]
["12:40:28","岩本 隆全","84+","Deadlift 1",270]
["12:40:50","山本 僚介","84+","Bench Press 1",210]
["12:40:51","上田 真司","84+","Bench Press 1",220]
["12:40:53","塚村 英夫",52,"Bench Press 1",230]
["12:40:54","西田 貴胤","84+","Bench Press 1",240]
["12:40:55","植野 哲","84+","Bench Press 1",250]
["12:40:57","山下 保樹","84+","Bench Press 1",260]
["12:40:58","岩本 隆全","84+","Bench Press 1",270]
["12:40:59","岩本 隆全","84+","Bench Press 1",270]
["12:41:00","岩本 隆全","84+","Bench Press 1",270]
["12:41:10","山本 僚介","84+","Squat 1",210,630]
["12:41:11","上田 真司","84+","Squat 1",220,660]
["12:41:13","塚村 英夫",52,"Squat 1",230,690]
["12:41:14","西田 貴胤","84+","Squat 1",240,720]
["12:41:16","植野 哲","84+","Squat 1",250,750]
["12:41:17","山下 保樹","84+","Squat 1",260,780]
["12:41:18","岩本 隆全","84+","Squat 1",270,810]
["12:41:20","岩本 隆全","84+","Squat 1",270,810]
["21:03:40","中川 貴美子",47,"Squat 1",100]
["21:03:41","伊藤 由実子",47,"Squat 1",-110]
["21:03:42","丸山 武",52,"Squat 1",120]
["21:03:43","立脇 和弥",57,"Squat 1",-130]
["21:03:45","小脇 剛",72,"Squat 1",140]
["21:03:46","松尾 直樹",63,"Squat 1",-150]
["21:03:47","三木 聖也",57,"Squat 1",160]
["21:03:48","山本 泰資",74,"Squat 1",-170]
["21:03:50","大西 康平",83,"Squat 1",180]
["21:03:51","佐藤 啓",83,"Squat 1",-190]
["21:03:52","大寺 康平",83,"Squat 1",200]
["21:04:20","中川 貴美子",47,"Squat 2",110]
["21:04:21","伊藤 由実子",47,"Squat 2",120]
["21:04:22","丸山 武",52,"Squat 2",130]
["21:04:23","立脇 和弥",57,"Squat 2",140]
["21:04:25","小脇 剛",72,"Squat 2",150]
["21:04:26","松尾 直樹",63,"Squat 2",160]
["21:04:27","三木 聖也",57,"Squat 2",170]
["21:04:28","山本 泰資",74,"Squat 2",180]
["21:04:29","大西 康平",83,"Squat 2",190]
["21:04:31","佐藤 啓",83,"Squat 2",200]
["21:04:32","大寺 康平",83,"Squat 2",210]
["21:04:53","芳村 晃",120,"Squat 1",210]
["21:04:54","瀧井 章男","120+","Squat 1",220]
["21:04:55","吉岡 弘和",59,"Squat 1",230]
["21:04:56","田口 航大",120,"Squat 1",240]
["21:04:58","光安 隆史",93,"Squat 1",250]
["21:04:59","石田 浩士","120+","Squat 1",260]
["21:05:00","堀 滋","120+","Squat 1",270]
["21:05:23","中川 貴美子",47,"Bench Press 1",100]
["21:05:24","伊藤 由実子",47,"Bench Press 1",110]
["21:05:26","丸山 武",52,"Bench Press 1",120]
["21:05:27","立脇 和弥",57,"Bench Press 1",130]
["21:05:28","小脇 剛",72,"Bench Press 1",140]
["21:05:29","松尾 直樹",63,"Bench Press 1",150]
["21:05:30","三木 聖也",57,"Bench Press 1",160]
["21:05:32","山本 泰資",74,"Bench Press 1",170]
["21:05:33","大西 康平",83,"Bench Press 1",180]
["21:05:34","佐藤 啓",83,"Bench Press 1",190]
["21:05:35","大寺 康平",83,"Bench Press 1",200]
["21:05:36","大寺 康平",83,"Bench Press 1",200]
["21:05:47","芳村 晃",120,"Bench Press 1",210]
["21:05:48","瀧井 章男","120+","Bench Press 1",220]
["21:05:49","吉岡 弘和",59,"Bench Press 1",230]
["21:05:50","田口 航大",120,"Bench Press 1",240]
["21:05:51","光安 隆史",93,"Bench Press 1",250]
["21:05:53","石田 浩士","120+","Bench Press 1",260]
["21:05:54","堀 滋","120+","Bench Press 1",270]
["21:05:55","堀 滋","120+","Bench Press 1",270]
["21:05:56","堀 滋","120+","Bench Press 1",270]
["21:06:14","中川 貴美子",47,"Deadlift 1",100,310]
["21:06:15","伊藤 由実子",47,"Deadlift 1",110,340]
["21:06:16","丸山 武",52,"Deadlift 1",120,370]
["21:06:18","立脇 和弥",57,"Deadlift 1",130,400]
["21:06:19","小脇 剛",72,"Deadlift 1",140,430]
["21:06:20","松尾 直樹",63,"Deadlift 1",150,460]
["21:06:21","三木 聖也",57,"Deadlift 1",160,490]
["21:06:22","山本 泰資",74,"Deadlift 1",170,520]
["21:06:23","大西 康平",83,"Deadlift 1",180,550]
["21:06:32","佐藤 啓",83,"Deadlift 1",190,580]
["21:06:33","大寺 康平",83,"Deadlift 1",200,610]
["21:06:45","芳村 晃",120,"Deadlift 1",210,630]
["21:06:46","瀧井 章男","120+","Deadlift 1",220,660]
["21:06:47","吉岡 弘和",59,"Deadlift 1",230,690]
["21:06:48","田口 航大",120,"Deadlift 1",240,720]
["21:06:49","光安 隆史",93,"Deadlift 1",250,750]
["21:06:51","石田 浩士","120+","Deadlift 1",260,780]
["21:06:52","堀 滋","120+","Deadlift 1",270,810]
["21:06:53","堀 滋","120+","Deadlift 1",270,810]
["21:22:34","中川 貴美子",47,"Squat 1",100]
["21:22:35","伊藤 由実子",47,"Squat 1",110]
["21:22:36","丸山 武",52,"Squat 1",120]
["21:22:37","立脇 和弥",57,"Squat 1",130]
["21:22:37","小脇 剛",72,"Squat 1",140]
["21:22:38","松尾 直樹",63,"Squat 1",150]
["21:22:39","三木 聖也",57,"Squat 1",160]
["21:22:40","山本 泰資",72,"Squat 1",170]
["21:22:41","大西 康平",84,"Squat 1",180]
["21:22:42","佐藤 啓",84,"Squat 1",190]
["21:23:07","大寺 康平",84,"Squat 1",200]
["21:23:16","大寺 康平",84,"Squat 1",200]
["21:23:25","芳村 晃","84+","Squat 1",210]
["21:23:26","瀧井 章男","84+","Squat 1",220]
["21:23:27","吉岡 弘和",52,"Squat 1",230]
["21:23:28","田口 航大","84+","Squat 1",240]
["21:23:29","光安 隆史","84+","Squat 1",250]
["21:23:30","石田 浩士","84+","Squat 1",260]
["21:24:48","芳村 晃","84+","Bench Press 1",210]
["21:24:49","瀧井 章男","84+","Bench Press 1",220]
["21:24:50","吉岡 弘和",52,"Bench Press 1",230]
["21:24:51","田口 航大","84+","Bench Press 1",240]
["21:24:52","光安 隆史","84+","Bench Press 1",250]
["21:24:53","石田 浩士","84+","Bench Press 1",260]
["21:24:54","堀 滋","84+","Bench Press 1",270]
["21:24:55","堀 滋","84+","Bench Press 1",270]
["21:24:55","堀 滋","84+","Bench Press 1",270]
["21:25:04","堀 滋","84+","Bench Press 1",270]
["21:25:05","堀 滋","84+","Bench Press 1",270]
["21:25:06","堀 滋","84+","Bench Press 1",270]
["21:25:09","中川 貴美子",47,"Bench Press 1",100]
["21:25:10","伊藤 由実子",47,"Bench Press 1",110]
["21:25:11","丸山 武",52,"Bench Press 1",120]
["21:25:12","立脇 和弥",57,"Bench Press 1",130]
["21:25:13","小脇 剛",72,"Bench Press 1",140]
["21:25:14","松尾 直樹",63,"Bench Press 1",150]
["21:25:15","三木 聖也",57,"Bench Press 1",160]
["21:25:15","山本 泰資",72,"Bench Press 1",170]
["21:25:16","大西 康平",84,"Bench Press 1",180]
["21:25:17","佐藤 啓",84,"Bench Press 1",190]
["21:25:18","大寺 康平",84,"Bench Press 1",200]
["21:25:19","大寺 康平",84,"Bench Press 1",200]
["21:25:19","大寺 康平",84,"Bench Press 1",200]
["21:25:20","大寺 康平",84,"Bench Press 1",200]
["21:25:20","大寺 康平",84,"Bench Press 1",200]
["21:25:21","大寺 康平",84,"Bench Press 1",200]
["21:25:21","大寺 康平",84,"Bench Press 1",200]
["21:25:26","中川 貴美子",47,"Deadlift 1",100,300]
["21:25:27","伊藤 由実子",47,"Deadlift 1",110,330]
["21:25:28","丸山 武",52,"Deadlift 1",120,360]
["21:25:29","立脇 和弥",57,"Deadlift 1",130,390]
["21:25:30","小脇 剛",72,"Deadlift 1",140,420]
["21:25:31","松尾 直樹",63,"Deadlift 1",150,450]
["21:25:32","三木 聖也",57,"Deadlift 1",160,480]
["21:25:33","山本 泰資",72,"Deadlift 1",170,510]
["21:25:34","大西 康平",84,"Deadlift 1",180,540]
["21:25:35","佐藤 啓",84,"Deadlift 1",190,570]
["21:25:36","大寺 康平",84,"Deadlift 1",200,600]
["21:25:37","大寺 康平",84,"Deadlift 1",200,600]
["21:25:37","大寺 康平",84,"Deadlift 1",200,600]
["21:25:45","大寺 康平",84,"Deadlift 1",200,600]
["21:25:54","芳村 晃","84+","Deadlift 1",210,630]
["21:25:55","瀧井 章男","84+","Deadlift 1",220,660]
["21:25:56","吉岡 弘和",52,"Deadlift 1",230,690]
["21:25:57","田口 航大","84+","Deadlift 1",240,720]
["21:25:58","光安 隆史","84+","Deadlift 1",250,750]
["21:25:59","石田 浩士","84+","Deadlift 1",260,780]
["21:26:01","堀 滋","84+","Deadlift 1",270]
["21:26:02","堀 滋","84+","Deadlift 1",270]
["00:03:13","中川 貴美子",47,"Squat 1",100]
["00:03:14","伊藤 由実子",47,"Squat 1",110]
["00:03:16","丸山 武",52,"Squat 1",120]
["00:03:17","立脇 和弥",57,"Squat 1",130]
["00:03:18","小脇 剛",72,"Squat 1",140]
["00:03:19","松尾 直樹",63,"Squat 1",150]
["00:03:20","三木 聖也",57,"Squat 1",160]
["00:03:21","山本 泰資",72,"Squat 1",170]
["00:03:23","大西 康平",84,"Squat 1",180]
["00:03:24","佐藤 啓",84,"Squat 1",190]
["00:03:25","大寺 康平",84,"Squat 1",200]
["00:03:26","大寺 康平",84,"Squat 1",200]
["00:03:27","大寺 康平",84,"Squat 1",200]
["00:03:39","芳村 晃","84+","Squat 1",210]
["00:03:40","瀧井 章男","84+","Squat 1",220]
["00:03:41","吉岡 弘和",52,"Squat 1",230]
["00:03:42","田口 航大","84+","Squat 1",240]
["00:03:43","光安 隆史","84+","Squat 1",250]
["00:03:45","石田 浩士","84+","Squat 1",260]
["00:03:46","堀 滋","84+","Squat 1",270]
["00:03:47","堀 滋","84+","Squat 1",270]
["00:03:48","堀 滋","84+","Squat 1",270]
["00:03:48","堀 滋","84+","Squat 1",270]
["00:03:54","芳村 晃","84+","Bench Press 1",210]
["00:03:56","瀧井 章男","84+","Bench Press 1",220]
["00:03:57","吉岡 弘和",52,"Bench Press 1",230]
["00:03:58","田口 航大","84+","Bench Press 1",240]
["00:03:59","光安 隆史","84+","Bench Press 1",250]
["00:04:00","石田 浩士","84+","Bench Press 1",260]
["00:04:01","堀 滋","84+","Bench Press 1",270]
["00:04:03","堀 滋","84+","Bench Press 1",270]
["00:04:03","堀 滋","84+","Bench Press 1",270]
["00:04:07","芳村 晃","84+","Deadlift 1",210,630]
["00:04:08","瀧井 章男","84+","Deadlift 1",220,660]
["00:04:09","吉岡 弘和",52,"Deadlift 1",230,690]
["00:04:10","田口 航大","84+","Deadlift 1",240,720]
["00:04:11","光安 隆史","84+","Deadlift 1",250,750]
["00:04:12","石田 浩士","84+","Deadlift 1",260,780]
["00:04:13","堀 滋","84+","Deadlift 1",270,810]
["00:04:28","中川 貴美子",47,"Deadlift 1",100]
["00:04:29","伊藤 由実子",47,"Deadlift 1",110]
["00:04:30","丸山 武",52,"Deadlift 1",120]
["00:04:31","立脇 和弥",57,"Deadlift 1",130]
["00:04:32","小脇 剛",72,"Deadlift 1",140]
["00:04:33","松尾 直樹",63,"Deadlift 1",150]
["00:04:34","三木 聖也",57,"Deadlift 1",160]
["00:04:36","山本 泰資",72,"Deadlift 1",170]
["00:04:37","大西 康平",84,"Deadlift 1",180]
["00:04:38","佐藤 啓",84,"Deadlift 1",190]
["00:04:39","大寺 康平",84,"Deadlift 1",200]
["00:04:40","大寺 康平",84,"Deadlift 1",200]
["00:04:41","大寺 康平",84,"Deadlift 1",200]
["00:04:41","大寺 康平",84,"Deadlift 1",200]
["00:04:42","大寺 康平",84,"Deadlift 1",200]
["00:04:45","中川 貴美子",47,"Bench Press 1",100,300]
["00:04:46","伊藤 由実子",47,"Bench Press 1",110,330]
["00:04:48","丸山 武",52,"Bench Press 1",120,360]
["00:04:49","立脇 和弥",57,"Bench Press 1",130,390]
["00:04:50","小脇 剛",72,"Bench Press 1",140,420]
["00:04:51","松尾 直樹",63,"Bench Press 1",150,450]
["00:04:52","三木 聖也",57,"Bench Press 1",160,480]
["00:04:54","山本 泰資",72,"Bench Press 1",170,510]
["00:04:55","大西 康平",84,"Bench Press 1",180,540]
["00:04:56","佐藤 啓",84,"Bench Press 1",190,570]
["00:04:57","大寺 康平",84,"Bench Press 1",200,600]
["00:04:58","大寺 康平",84,"Bench Press 1",200,600]
["00:04:59","大寺 康平",84,"Bench Press 1",200,600]
["00:14:55","丸山 武",59,"Deadlift 2",130,370]
["00:14:57","立脇 和弥",59,"Deadlift 2",140,400]
["00:14:58","小脇 剛",66,"Deadlift 2",150,430]
["00:14:59","松尾 直樹",66,"Deadlift 2",160,460]
["00:15:00","山本 泰資",74,"Deadlift 2",180,520]
["00:15:01","佐藤 啓",83,"Deadlift 2",195,575]
["00:15:03","中川 貴美子",59,"Deadlift 2",200,400]
["00:15:04","伊藤 由実子",59,"Deadlift 2",200,420]
["00:15:05","大西 康平",83,"Deadlift 2",200,560]
["00:15:06","大寺 康平",83,"Deadlift 2",220,620]
["00:15:07","三木 聖也",59,"Deadlift 2",260,580]
["00:15:09","三木 聖也",59,"Deadlift 2",260,580]
["00:15:09","三木 聖也",59,"Deadlift 2",260,580]
["00:15:18","芳村 晃","84+","Deadlift 2",-230,630]
["00:15:20","吉岡 弘和",59,"Deadlift 2",-240,690]
["00:15:21","瀧井 章男","84+","Deadlift 2",-260,660]
["00:15:22","田口 航大","84+","Deadlift 2",-260,720]
["00:15:23","光安 隆史","84+","Deadlift 2",-260,750]
["00:15:24","石田 浩士","84+","Deadlift 2",-270,780]
["00:15:25","堀 滋","84+","Deadlift 2",-280,810]
["14:14:14","中川 貴美子",59,"Squat 1",100]
["14:14:18","伊藤 由実子",59,"Squat 1",-110]
["14:14:24","丸山 武",59,"Squat 1",120]
["14:14:28","立脇 和弥",59,"Squat 1",130]
["14:14:33","小脇 剛",66,"Squat 1",140]
["14:14:36","松尾 直樹",66,"Squat 1",150]
["14:14:40","三木 聖也",59,"Squat 1",-160]
["14:14:45","山本 泰資",74,"Squat 1",170]
["14:14:48","大西 康平",83,"Squat 1",-180]
["14:14:54","佐藤 啓",83,"Squat 1",190]
["14:14:57","大寺 康平",83,"Squat 1",200]
["14:15:07","伊藤 由実子",59,"Squat 2",110]
["14:15:11","中川 貴美子",59,"Squat 2",-120,300]
["14:15:15","丸山 武",59,"Squat 2",-125,360]
["14:15:18","立脇 和弥",59,"Squat 2",135]
["14:15:22","小脇 剛",66,"Squat 2",160]
["14:15:26","三木 聖也",59,"Squat 2",160]
["14:15:31","山本 泰資",74,"Squat 2",175]
["14:15:34","松尾 直樹",66,"Squat 2",-180,450]
["14:15:38","大西 康平",83,"Squat 2",180]
["14:15:42","佐藤 啓",83,"Squat 2",200]
["14:15:45","大寺 康平",83,"Squat 2",-210,600]
["14:15:52","中川 貴美子",59,"Squat 3",-120,300]
["14:15:54","伊藤 由実子",59,"Squat 3",120]
["14:15:55","丸山 武",59,"Squat 3",-125,360]
["14:15:56","立脇 和弥",59,"Squat 3",140]
["14:15:57","三木 聖也",59,"Squat 3",165]
["14:15:58","小脇 剛",66,"Squat 3",170]
["14:16:00","松尾 直樹",66,"Squat 3",-180,450]
["14:16:01","山本 泰資",74,"Squat 3",180]
["14:16:02","大西 康平",83,"Squat 3",190]
["14:16:03","佐藤 啓",83,"Squat 3",210]
["14:16:04","大寺 康平",83,"Squat 3",210]
["14:16:05","大寺 康平",83,"Squat 3",210]
["14:16:18","芳村 晃",120,"Squat 1",210]
["14:16:25","瀧井 章男","120+","Squat 1",220]
["14:16:29","吉岡 弘和",59,"Squat 1",-230]
["14:16:33","田口 航大",120,"Squat 1",240]
["14:16:38","光安 隆史",93,"Squat 1",250]
["14:16:53","石田 浩士","120+","Squat 1",260]
["14:16:58","堀 滋","120+","Squat 1",270]
["14:17:05","芳村 晃",120,"Squat 2",220]
["14:17:12","瀧井 章男","120+","Squat 2",230]
["14:17:13","吉岡 弘和",59,"Squat 2",-230]
["14:17:23","田口 航大",120,"Squat 2",245]
["14:17:24","光安 隆史",93,"Squat 2",255]
["14:17:25","石田 浩士","120+","Squat 2",265]
["14:17:26","堀 滋","120+","Squat 2",280]
["14:17:30","芳村 晃",120,"Squat 3",230]
["14:17:31","吉岡 弘和",59,"Squat 3",-230]
["14:17:32","瀧井 章男","120+","Squat 3",240]
["14:17:52","中川 貴美子",59,"Bench Press 1",100]
["14:17:54","伊藤 由実子",59,"Bench Press 1",-110]
["14:17:55","丸山 武",59,"Bench Press 1",120]
["14:18:16","立脇 和弥",59,"Bench Press 1",130]
["14:18:18","小脇 剛",66,"Bench Press 1",140]
["14:18:19","松尾 直樹",66,"Bench Press 1",150]
["14:18:20","三木 聖也",59,"Bench Press 1",-160,525]
["14:18:21","山本 泰資",74,"Bench Press 1",170]
["14:18:22","大西 康平",83,"Bench Press 1",180]
["14:18:23","佐藤 啓",83,"Bench Press 1",190]
["14:18:25","大寺 康平",83,"Bench Press 1",200]
["14:18:29","中川 貴美子",59,"Bench Press 2",-140,300]
["14:18:30","伊藤 由実子",59,"Bench Press 2",-150]
["14:18:31","丸山 武",59,"Bench Press 2",160]
["14:18:33","立脇 和弥",59,"Bench Press 2",170]
["14:18:34","小脇 剛",66,"Bench Press 2",180]
["14:18:35","松尾 直樹",66,"Bench Press 2",190]
["14:18:36","三木 聖也",59,"Bench Press 2",200]
["14:18:37","山本 泰資",74,"Bench Press 2",210]
["14:18:38","大寺 康平",83,"Bench Press 2",210]
["14:18:40","大西 康平",83,"Bench Press 2",220]
["14:18:41","佐藤 啓",83,"Bench Press 2",230]
["14:18:49","伊藤 由実子",59,"Bench Press 3",-150]
["14:19:00","芳村 晃",120,"Bench Press 1",210]
["14:19:01","瀧井 章男","120+","Bench Press 1",-220,690]
["14:19:02","吉岡 弘和",59,"Bench Press 1",-230]
["14:19:03","田口 航大",120,"Bench Press 1",240]
["14:19:04","光安 隆史",93,"Bench Press 1",250]
["14:19:05","石田 浩士","120+","Bench Press 1",260]
["14:19:07","堀 滋","120+","Bench Press 1",270]
["14:19:11","芳村 晃",120,"Bench Press 2",220]
["14:19:12","瀧井 章男","120+","Bench Press 2",230]
["14:19:14","吉岡 弘和",59,"Bench Press 2",240]
["14:19:15","田口 航大",120,"Bench Press 2",250]
["14:19:16","光安 隆史",93,"Bench Press 2",260]
["14:19:17","石田 浩士","120+","Bench Press 2",270]
["14:19:18","堀 滋","120+","Bench Press 2",280]
["14:19:19","堀 滋","120+","Bench Press 2",280]
["14:19:24","芳村 晃",120,"Deadlift 1",210,660]
["14:19:25","瀧井 章男","120+","Deadlift 1",220,690]
["14:19:26","吉岡 弘和",59,"Deadlift 1",230]
["14:19:27","田口 航大",120,"Deadlift 1",240,735]
["14:19:28","光安 隆史",93,"Deadlift 1",250,765]
["14:19:29","石田 浩士","120+","Deadlift 1",260,795]
["14:19:31","堀 滋","120+","Deadlift 1",270,830]
["14:19:43","中川 貴美子",59,"Deadlift 1",100,300]
["14:19:44","伊藤 由実子",59,"Deadlift 1",110]
["14:19:45","丸山 武",59,"Deadlift 1",120,400]
["14:19:46","立脇 和弥",59,"Deadlift 1",130,440]
["14:19:47","小脇 剛",66,"Deadlift 1",140,490]
["14:19:48","松尾 直樹",66,"Deadlift 1",150,490]
["14:19:49","三木 聖也",59,"Deadlift 1",160,525]
["14:19:51","山本 泰資",74,"Deadlift 1",170,560]
["14:19:52","大西 康平",83,"Deadlift 1",180,590]
["14:19:53","佐藤 啓",83,"Deadlift 1",190,630]
["14:19:54","大寺 康平",83,"Deadlift 1",200,620]
["14:19:55","大寺 康平",83,"Deadlift 1",200,620]
["14:19:56","大寺 康平",83,"Deadlift 1",200,620]
["14:19:56","大寺 康平",83,"Deadlift 1",200,620]
["14:38:33","中川 貴美子",47,"Squat 1",100]
["14:38:35","伊藤 由実子",47,"Squat 1",110]
["14:38:36","丸山 武",52,"Squat 1",120]
["14:38:38","立脇 和弥",57,"Squat 1",130]
["14:38:39","小脇 剛",72,"Squat 1",140]
["14:38:41","松尾 直樹",63,"Squat 1",150]
["14:38:42","三木 聖也",57,"Squat 1",160]
["14:38:44","山本 泰資",72,"Squat 1",170]
["14:38:45","大西 康平",84,"Squat 1",180]
["14:38:47","佐藤 啓",84,"Squat 1",190]
["14:38:49","大寺 康平",84,"Squat 1",200]
["14:38:50","大寺 康平",84,"Squat 1",200]
["14:38:51","大寺 康平",84,"Squat 1",200]
["14:38:52","大寺 康平",84,"Squat 1",200]
["14:38:52","大寺 康平",84,"Squat 1",200]
["14:39:41","中川 貴美子",47,"Squat 1",100]
["14:39:43","伊藤 由実子",47,"Squat 1",110]
["14:39:44","丸山 武",52,"Squat 1",120]
["14:39:45","立脇 和弥",57,"Squat 1",130]
["14:39:47","小脇 剛",72,"Squat 1",140]
["14:39:48","松尾 直樹",63,"Squat 1",150]
["14:39:49","三木 聖也",57,"Squat 1",160]
["14:39:51","山本 泰資",72,"Squat 1",170]
["14:39:52","大西 康平",84,"Squat 1",180]
["14:39:53","佐藤 啓",84,"Squat 1",190]
["14:39:55","大寺 康平",84,"Squat 1",200]
["14:39:56","大寺 康平",84,"Squat 1",200]
["14:40:00","大寺 康平",84,"Squat 1",200]
["14:40:01","大寺 康平",84,"Squat 1",200]
["14:40:06","芳村 晃","84+","Squat 1",210]
["14:40:07","瀧井 章男","84+","Squat 1",220]
["14:40:09","吉岡 弘和",52,"Squat 1",230]
["14:40:10","田口 航大","84+","Squat 1",240]
["14:40:11","光安 隆史","84+","Squat 1",250]
["14:40:13","石田 浩士","84+","Squat 1",260]
["14:40:14","堀 滋","84+","Squat 1",270]
["14:40:20","芳村 晃","84+","Bench Press 1",-210]
["14:40:21","瀧井 章男","84+","Bench Press 1",-220]
["14:40:23","吉岡 弘和",52,"Bench Press 1",230]
["14:40:24","田口 航大","84+","Bench Press 1",240]
["14:40:25","光安 隆史","84+","Bench Press 1",250]
["14:40:27","石田 浩士","84+","Bench Press 1",260]
["14:40:28","堀 滋","84+","Bench Press 1",270]
["14:40:29","堀 滋","84+","Bench Press 1",270]
["14:40:49","中川 貴美子",47,"Bench Press 1",100]
["14:40:50","伊藤 由実子",47,"Bench Press 1",110]
["14:40:52","丸山 武",52,"Bench Press 1",120]
["14:40:53","立脇 和弥",57,"Bench Press 1",130]
["14:40:54","小脇 剛",72,"Bench Press 1",140]
["14:40:56","松尾 直樹",63,"Bench Press 1",150]
["14:40:57","三木 聖也",57,"Bench Press 1",160]
["14:40:58","山本 泰資",72,"Bench Press 1",170]
["14:40:59","大西 康平",84,"Bench Press 1",180]
["14:41:01","佐藤 啓",84,"Bench Press 1",190]
["14:41:02","大寺 康平",84,"Bench Press 1",200]
["14:41:03","大寺 康平",84,"Bench Press 1",200]
["14:41:04","大寺 康平",84,"Bench Press 1",200]
["14:41:04","大寺 康平",84,"Bench Press 1",200]
["14:41:10","中川 貴美子",47,"Deadlift 1",100,300]
["14:41:11","伊藤 由実子",47,"Deadlift 1",110,330]
["14:41:12","丸山 武",52,"Deadlift 1",120,360]
["14:41:14","立脇 和弥",57,"Deadlift 1",130,390]
["14:41:15","小脇 剛",72,"Deadlift 1",140,420]
["14:41:16","松尾 直樹",63,"Deadlift 1",150,450]
["14:41:17","三木 聖也",57,"Deadlift 1",160,480]
["14:41:19","山本 泰資",72,"Deadlift 1",170,510]
["14:41:20","大西 康平",84,"Deadlift 1",180,540]
["14:41:21","佐藤 啓",84,"Deadlift 1",190,570]
["14:41:22","大寺 康平",84,"Deadlift 1",200,600]
["14:41:27","大寺 康平",84,"Deadlift 1",200,600]
["14:41:31","芳村 晃","84+","Deadlift 1",210]
["14:41:33","瀧井 章男","84+","Deadlift 1",220]
["14:41:34","吉岡 弘和",52,"Deadlift 1",230,690]
["14:41:45","田口 航大","84+","Deadlift 1",240,720]
["14:41:47","光安 隆史","84+","Deadlift 1",250,750]
["14:41:48","石田 浩士","84+","Deadlift 1",260,780]
["14:41:49","堀 滋","84+","Deadlift 1",270,810]
["14:41:51","堀 滋","84+","Deadlift 1",270,810]
["23:22:27","中川 貴美子",47,"Squat 1",100]
["23:22:37","伊藤 由実子",47,"Squat 1",110]
["23:22:56","丸山 武",52,"Squat 1",120]
["15:11:29","立脇 和弥",57,"Squat 1",130]
["15:11:35","小脇 剛",72,"Squat 1",140]
["15:11:37","松尾 直樹",63,"Squat 1",150]
["15:11:39","三木 聖也",57,"Squat 1",160]
["15:11:45","山本 泰資",72,"Squat 1",170]
["15:11:50","大西 康平",84,"Squat 1",-180]
["16:47:23","中川 貴美子",47,"Squat 1",100]
["16:47:28","伊藤 由実子",47,"Squat 1",110]
["16:47:30","丸山 武",52,"Squat 1",120]
["16:47:31","立脇 和弥",57,"Squat 1",130]
["16:47:32","小脇 剛",72,"Squat 1",140]
["16:47:35","松尾 直樹",63,"Squat 1",150]
["16:47:36","三木 聖也",57,"Squat 1",160]
["16:47:38","山本 泰資",72,"Squat 1",170]
["16:47:39","大西 康平",84,"Squat 1",180]
["16:47:40","佐藤 啓",84,"Squat 1",190]
["16:47:42","大寺 康平",84,"Squat 1",200]
["16:47:56","芳村 晃","84+","Squat 1",210]
["16:47:57","瀧井 章男","84+","Squat 1",220]
["16:47:58","吉岡 弘和",52,"Squat 1",230]
["16:47:59","田口 航大","84+","Squat 1",240]
["16:48:00","光安 隆史","84+","Squat 1",250]
["16:48:02","石田 浩士","84+","Squat 1",260]
["16:48:03","堀 滋","84+","Squat 1",270]
["16:48:08","芳村 晃","84+","Bench Press 1",210]
["16:48:09","瀧井 章男","84+","Bench Press 1",220]
["16:48:10","吉岡 弘和",52,"Bench Press 1",230]
["16:48:11","田口 航大","84+","Bench Press 1",240]
["16:48:12","光安 隆史","84+","Bench Press 1",250]
["16:48:14","石田 浩士","84+","Bench Press 1",260]
["16:48:15","堀 滋","84+","Bench Press 1",270]
["16:48:24","堀 滋","84+","Bench Press 1",270]
["16:48:28","中川 貴美子",47,"Bench Press 1",100]
["16:48:30","伊藤 由実子",47,"Bench Press 1",110]
["16:48:31","丸山 武",52,"Bench Press 1",120]
["16:48:32","立脇 和弥",57,"Bench Press 1",130]
["16:48:33","小脇 剛",72,"Bench Press 1",140]
["16:48:34","松尾 直樹",63,"Bench Press 1",150]
["16:48:35","三木 聖也",57,"Bench Press 1",160]
["16:48:36","山本 泰資",72,"Bench Press 1",170]
["16:48:38","大西 康平",84,"Bench Press 1",180]
["16:48:39","佐藤 啓",84,"Bench Press 1",190]
["16:48:40","大寺 康平",84,"Bench Press 1",200]
["16:48:44","中川 貴美子",47,"Deadlift 1",100,300]
["16:48:45","伊藤 由実子",47,"Deadlift 1",110,330]
["16:48:46","丸山 武",52,"Deadlift 1",120,360]
["16:48:47","立脇 和弥",57,"Deadlift 1",130,390]
["16:48:48","小脇 剛",72,"Deadlift 1",140,420]
["16:48:49","松尾 直樹",63,"Deadlift 1",150,450]
["16:48:50","三木 聖也",57,"Deadlift 1",160,480]
["16:48:51","山本 泰資",72,"Deadlift 1",170,510]
["16:48:52","大西 康平",84,"Deadlift 1",180,540]
["16:48:54","佐藤 啓",84,"Deadlift 1",190,570]
["16:48:55","大寺 康平",84,"Deadlift 1",200,600]
["16:48:59","大寺 康平",84,"Deadlift 1",200,600]
["16:49:01","大寺 康平",84,"Deadlift 1",200,600]
["16:49:05","芳村 晃","84+","Deadlift 1",210,630]
["16:49:06","瀧井 章男","84+","Deadlift 1",220,660]
["16:49:07","吉岡 弘和",52,"Deadlift 1",230,690]
["16:49:08","田口 航大","84+","Deadlift 1",240,720]
["16:49:09","光安 隆史","84+","Deadlift 1",250,750]
["16:49:10","石田 浩士","84+","Deadlift 1",260,780]
["16:49:11","堀 滋","84+","Deadlift 1",270,810]
["16:49:13","堀 滋","84+","Deadlift 1",270,810]

{"sheet":"KG Records","index":11,"n_rows":151,"n_cols":38,"rows_kept":151,"cut":false,"hidden":true,"merged":[]}
[null,"Y1","Y2","Y3","T1","T2","T3","JR","O","M1a","M1b","M2a","M2b","M3a","M3b","M4a","M4b","M5a","M5b","M6","R-T1","R-T2","R-T3","R-Y1","R-Y2","R-Y3","R-JR","R-O","R-M1A","R-M1B","R-M2A","R-M2B","R-M3A","R-M3B","R-M4A","R-M4B","R-M5A","R-M5B"]
["30-SQ",0,0,0,0,0,0,0,0,0,0,0,0,0,0,0,0,0,0,0,0,0,0,45,45,45,0,0,0,0,0,0,0,0,0,0,0,0]
["30-BP",0,0,0,0,0,0,0,0,0,0,0,0,0,0,0,0,0,0,0,0,0,0,26,26,26,0,0,0,0,0,0,0,0,0,0,0,0]
["30-DL",0,0,0,0,0,0,0,0,0,0,0,0,0,0,0,0,0,0,0,0,0,0,70,70,70,0,0,0,0,0,0,0,0,0,0,0,0]
["30-TL",0,0,0,0,0,0,0,0,0,0,0,0,0,0,0,0,0,0,0,0,0,0,141,141,141,0,0,0,0,0,0,0,0,0,0,0,0]
["35-SQ",0,0,0,0,0,0,0,0,0,0,0,0,0,0,0,0,0,0,0,0,0,0,55,55,55,0,0,0,0,0,0,0,0,0,0,0,0]
["35-BP",0,0,0,0,0,0,0,0,0,0,0,0,0,0,0,0,0,0,0,0,0,0,30,30,30,0,0,0,0,0,0,0,0,0,0,0,0]
["35-DL",0,0,0,0,0,0,0,0,0,0,0,0,0,0,0,0,0,0,0,0,0,0,75,75,75,0,0,0,0,0,0,0,0,0,0,0,0]
["35-TL",0,0,0,0,0,0,0,0,0,0,0,0,0,0,0,0,0,0,0,0,0,0,160,160,160,0,0,0,0,0,0,0,0,0,0,0,0]
["40-SQ",0,0,0,0,0,0,0,0,0,0,0,0,0,0,0,0,0,0,0,0,0,0,0,62.5,81.5,0,0,0,0,0,0,0,0,0,0,0,0]
["40-BP",0,0,0,0,0,0,0,0,0,0,0,0,0,0,0,0,0,0,0,0,0,0,0,36,50,0,0,0,0,0,0,0,0,0,0,0,0]
["40-DL",0,0,0,0,0,0,0,0,0,0,0,0,0,0,0,0,0,0,0,0,0,0,0,93,100.5,0,0,0,0,0,0,0,0,0,0,0,0]
["40-TL",0,0,0,0,0,0,0,0,0,0,0,0,0,0,0,0,0,0,0,0,0,0,0,188,232,0,0,0,0,0,0,0,0,0,0,0,0]
["44-SQ",0,0,0,0,0,0,0,0,0,0,0,0,0,0,0,0,0,0,0,0,0,0,45,75,96,0,0,0,0,0,0,0,0,0,0,0,0]
["44-BP",0,0,0,0,0,0,0,0,0,0,0,0,0,0,0,0,0,0,0,0,0,0,32.5,40,57.5,0,0,0,0,0,0,0,0,0,0,0,0]
["44-DL",0,0,0,0,142.5,142.5,142.5,0,0,0,0,0,0,0,0,0,0,0,0,0,0,0,75,105,130,0,0,0,0,0,0,0,0,0,0,0,0]
["44-TL",0,0,0,0,317.5,317.5,317.5,0,0,0,0,0,0,0,0,0,0,0,0,0,0,0,152.5,220,280,0,0,0,0,0,0,0,0,0,0,0,0]
["48-SQ",0,0,0,0,0,0,0,0,0,0,0,0,0,0,0,0,0,0,0,70,70,70,42.5,55,105,70,70,0,0,0,0,0,0,0,0,0,0]
["48-BP",0,0,0,0,0,0,0,0,0,0,0,0,0,0,0,0,0,0,0,57.5,57.5,57.5,22.5,42.5,62.5,57.5,57.5,0,0,0,0,0,0,0,0,0,0]
["48-DL",0,0,0,0,0,0,0,0,0,0,0,0,0,0,0,0,0,0,0,97.5,97.5,97.5,55,87.5,137.5,97.5,97.5,0,0,0,0,0,0,0,0,0,0]
["48-TL",0,0,0,0,0,0,0,0,0,0,0,0,0,0,0,0,0,0,0,225,225,225,120,180,305,225,225,0,0,0,0,0,0,0,0,0,0]
["53-SQ",0,55,82.5,162.5,210,217.5,217.5,217.5,0,0,0,0,0,0,0,0,0,0,0,142.5,145,165,15,77.5,105,170,165,0,0,0,0,0,0,0,0,0,0]
["53-BP",0,35.5,62.5,97.5,157.5,157.5,157.5,145,0,0,0,0,0,0,0,0,0,0,0,82.5,95,115,20,45,72.5,117.5,115,0,0,0,0,0,0,0,0,0,0]
["53-DL",0,97.5,120,195,207.5,230,250,237.5,0,0,0,0,0,0,0,0,0,0,0,201,201,230,52.5,112.5,140,271.5,232.5,0,0,0,0,0,0,0,0,0,0]
["53-TL",0,188,265,450,530,547.5,642.5,642.5,0,550,502.5,502.5,500,0,0,0,0,0,0,421,421,502.5,157.5,257.5,317.5,559,740,0,0,0,0,0,0,0,0,0,0]
["59-SQ",0,0,105,197.5,215.5,242.5,250,255.5,253,253,253,152.5,152.5,152.5,142.5,0,0,0,0,165,195,212.5,35,72.5,112.5,212.5,242.5,192.5,192.5,192.5,171,171,117.5,105,77.5,77.5,0]
["59-BP",0,0,52.5,125,149.69999999999999,150,167.5,167.5,142.5,132.5,117.5,117.5,97.5,97.5,97.5,0,0,0,0,115.5,115.5,127.5,40,40,72.5,150,150,110,102.5,95,95,95,80,80,42.5,42.5,0]
["59-DL",0,0,115,205,217.5,227.5,258.5,262.5,255,255,252.5,177.5,177.5,177.5,177.5,0,0,0,0,201,217.5,242.5,60,100,137.5,250,252.5,252.5,252.5,252.5,201,201,137.5,160,102.5,102.5,0]
["59-TL",0,240,272.5,527.5,537.5,590,605.5,648,612.5,612.5,610.5,430,412.5,412.5,412.5,0,0,0,0,462.5,525,557.5,240,240,315,577.5,577.5,545,545,535,396,396,340,340,222.5,222.5,0]
["66-SQ",0,0,82.5,205,245,272.5,317.5,317.5,250,225,225,200,200,200,165,112.5,0,0,0,170,193,207.5,0,150,150,253,255,197.5,191,191,190,185.5,122.5,122.5,82.5,82.5,82.5]
["66-BP",0,0,57.5,132.5,152.5,205,230,230,142.5,147.5,147.5,137.5,137.5,137.5,132.5,75,0,0,0,132.5,137.5,142.5,0,57.5,78,167.5,167.5,147.5,147.5,142.5,142.5,110,92.5,92.5,77.5,62.5,62.5]
["66-DL",0,0,100,220,240,260,275,277.5,272.2,272.2,272.2,225,210,210,157.5,120,0,0,0,205,212.5,228,0,75,155,270,277.5,262.5,235,230,205,190,150.5,150.5,122.5,100,100]
["66-TL",0,0,240,507.5,605,700,770,770,625,587.5,577.5,537.5,515,515,430,282.5,0,0,0,507.5,507.5,575,0,272.5,352.5,688,688,567.5,536,536,517.5,465.5,350,350,245,245,245]
["74-SQ",0,0,0,232.5,255,305,327.5,327.5,280,267.5,267.5,242.5,235,200,175,152.5,67.5,0,0,200,215,255.5,0,0,200,263.5,265.5,247.5,220,197.5,183,175.5,160,160,130,125,0]
["74-BP",0,0,0,145,160,200.5,235,235,187.5,170,170,145,145,140,140,110,62.5,0,0,142.5,142.5,165,0,0,97.5,177.5,192.5,179,179,179,117.5,117.5,117.5,117.5,92.5,90,0]
["74-DL",0,0,0,227.5,292.60000000000002,297.5,330,330,302.5,272.5,272.5,255,230,225,220,197.5,125,0,0,192.5,252.5,280.5,0,0,182.5,305,307.5,307.5,240,240,240,202.5,195,195,167.5,155,0]
["74-TL",0,0,0,572.5,662.5,757.5,820,820,760,697.5,697.5,600,572.5,534.9,510,457.5,255,0,0,480,605,670.5,0,0,480,735,750,717.5,582.5,566.5,533,467.5,452.5,452.5,395,370,0]
["83-SQ",0,0,0,290.5,325,325,352.5,370,337.5,337.5,317.5,305,222.5,220,197.5,160,160,160,0,207.5,240,260,0,0,177.5,300.5,300.5,270,260,237.5,205.5,192.5,192.5,162.5,147.5,147.5,65]
["83-BP",0,0,0,160,200,215,300,300,250,242.5,212.5,197.5,173.5,152.5,147.5,125,107.5,90,0,137.5,175,177.5,0,0,97.5,195,201.5,187.5,180,180,155,140.5,133,115,91,82.5,80]
["83-DL",0,0,0,277.5,310,312.5,327.5,337.5,332.5,320,319.89999999999998,307.5,255,244.9,230,192.5,190,175,0,227.5,282.5,317.5,0,0,180,320.5,340,290,287.5,285,277.5,240,240,213.5,185,182.5,117.5]
["83-TL",0,0,0,728,817.5,817.5,877.5,907.5,862.5,862.5,772.5,760,600,557.5,560,457.5,440,420,0,535,645,740,0,0,455,810,813,707.5,685,677.5,602.5,532.5,532.5,491,410,410,242.5]
["93-SQ",0,40,0,250,317.5,342.5,375,375,347.5,347.5,347.5,325,280,222.5,200,170,150,65,0,220,263.5,290,0,30,170,327.5,327.5,325.5,325.5,325.5,325.5,208,208,180,145,145,0]
["93-BP",0,42.5,0,170,207.5,232.5,260,267.5,262.5,260,230,217.5,182.5,148,137.4,115,102.1,85,0,147.5,182.5,182.5,0,32.5,120,200,230,230,230,215,210,167.5,125,115.5,115,87.5,0]
["93-DL",0,92.5,0,257.5,322.5,350,377.5,377.5,343,332.5,328,325,265,260,245,199.9,172.5,125,0,237.5,317.5,327.5,0,77.5,170,352.5,352.5,320,310,310,310,263.10000000000002,263.10000000000002,220,180.5,180.5,0]
["93-TL",0,175,0,617.5,800,900,972.5,972.5,900,900,900,830,677.5,607.5,547.5,460,417.5,275,0,567.5,735,792.5,0,140,460,840,840,830,830,830,830,612.5,555.5,510,417.5,405,0]
["105-SQ",0,0,0,277.5,330,337.5,355,382.5,355,355,345,320,295,250,217.5,170,115,0,0,240,280,285,0,0,140,312.5,331.5,292.5,275,275,275,235,195,180,127.5,105,0]
["105-BP",0,0,0,182.5,207.5,242.5,285,323.5,243,243,242.5,242.5,227.5,188.2,175,147.5,100,0,0,147.5,172.5,187.5,0,0,110,215,238.5,232.5,232.5,185,170,158,153,120,107.5,102.5,0]
["105-DL",0,0,0,262.5,300,322.10000000000002,342.5,377.5,335,332.5,315,315,315,260,253,220,147.5,0,0,245,287.5,325,0,0,157.5,347.5,367.5,315,295,295,295,277.5,230.5,210,200,152.5,0]
["105-TL",0,0,0,682.5,765,862.5,907.5,986,915,915,836,822.5,770,630.5,612.5,502.5,362.5,0,0,632.5,735,795,0,0,407.5,842.5,890,773,745,715,712.5,600,578.5,505,435,360,0]
["120-SQ",0,0,0,282.5,360,365.5,405,413,413,412.5,350,317.5,267.5,247.5,205,0,0,0,0,230,280,317.5,0,0,150,372.5,386,378.5,378.5,378.5,275,232.5,232.5,187.5,92.5,0,0]
["120-BP",0,0,0,162.5,245,282.5,295,320,312.5,262.5,262.5,242.5,195,187.5,165,0,0,0,0,145,182.5,205,0,0,75,242.5,253,220,205,197.5,185,175,160,147.5,110,0,0]
["120-DL",0,0,0,260,307.5,330,365,372.5,355.5,332.5,325,320,320,281.5,260,0,0,0,0,255,282.5,306.2,0,0,155,365,372,372,372,342.5,292.5,280,280,230,147.5,0,0]
["120-TL",0,0,0,690,872.5,950.5,1035,1042.5,1015.5,957.5,945,822.5,717.5,706,622.5,0,0,0,0,585.5,732.5,805,0,0,380,890,978.5,944.5,944.5,895,720,640,640,525,335,0,0]
["120+-SQ",0,0,0,290,365,424.8,424.8,505,430.9,430.9,402.5,320,310,272.5,210,92.5,0,0,0,330,365.5,425.5,0,197.5,197.5,425.5,485,340,337.5,330,257.5,228,190,182.5,92.5,82.5,0]
["120+-BP",0,0,0,175,260,272.5,350,410,350,297.5,292.5,292.5,235,195,155,100,0,0,0,175,190,207.5,0,135,135,235,265.5,260,245,232.5,190,183.7,145,145,100,77.5,0]
["120+-DL",0,0,0,257.5,319.8,317.5,365,410,400,342.5,320,319.89999999999998,290,257.5,190,142.5,0,0,0,267.5,287.5,306,0,220,220,335.5,392.5,380,380,325,277.5,250,245,182.5,142.5,115,0]
["120+-TL",0,0,0,722.5,907.5,950,1057.5,1272.5,1057.5,1052.5,945,862.5,785,705,520,335,0,0,0,722.5,790.5,920.5,0,552.5,552.5,932.5,1105,937.5,937.5,868,707.5,622.5,577.5,510,335,267.5,0]
["30-BPO",0,0,0,0,0,0,0,0,0,0,0,0,0,0,0,0,0,0,0,0,0,0,26,26,26,0,0,0,0,0,0,0,0,0,0,0,0]
["35-BPO",0,0,0,0,0,0,0,0,0,0,0,0,0,0,0,0,0,0,0,0,0,0,30,30,30,0,0,0,0,0,0,0,0,0,0,0,0]
["40-BPO",0,0,0,0,0,0,0,0,0,0,0,0,0,0,0,0,0,0,0,45,45,45,0,45,50,45,45,0,0,0,0,0,0,0,0,0,0]
["44-BPO",0,0,0,0,0,0,0,0,0,0,0,0,0,0,0,0,0,0,0,0,0,0,32.5,40,57.5,0,0,0,0,0,0,0,0,0,0,0,0]
["48-BPO",0,0,0,0,0,0,0,0,0,0,0,0,0,0,0,0,0,0,0,57.5,57.5,57.5,22.5,42.5,62.5,57.5,57.5,0,0,0,0,0,0,0,0,0,0]
["53-BPO",0,35.5,62.5,97.5,157.5,157.5,157.5,145,0,0,0,0,0,0,0,0,0,0,0,82.5,95,115,20,45,72.5,117.5,115,0,0,0,0,0,0,0,0,0,0]
["59-BPO",0,0,52.5,125,150.5,150.5,167.5,142.5,142.5,150,135,135,135,120,97.5,82.5,57.5,0,0,115.5,115.5,142.5,40,40,72.5,150,155,115,107.5,105.5,105.5,105.5,102.5,85,85,42.5,0]
["66-BPO",0,0,0,132.5,160,213.5,240,240,170,170,147.5,132.5,132.5,137.5,132.5,0,40,0,0,132.5,137.5,142.5,0,57.5,78,167.5,170,147.5,147.5,142.5,142.5,128,127.5,97.5,97.5,92.5,62.5]
["74-BPO",0,0,0,145,160,212.5,235,235,195,195,190,175.5,175.5,145,140,113.5,105,0,0,142.5,142.5,165,0,50,97.5,193,195,182.5,182.5,180,148.5,148.5,128,128,105,105,0]
["83-BPO",0,0,0,165.6,200,220,300,300,263,255,225,215,180,170,160.5,125,107.5,90,37.5,137.5,175,185,0,0,97.5,195,202.5,217.5,197.5,197.5,160,147.5,137.5,137.5,108,83,83]
["93-BPO",0,42.5,0,170,207.5,260,265,320,319,275,230,218.5,192.5,192.5,182.5,115,110,85,0,147.5,200,200,0,32.5,120,200,233.5,233.5,233.5,222.5,210,167.5,145,142.5,116,77.5,0]
["105-BPO",0,0,0,182.5,207.5,288.5,288.5,337,337,337,337,252.5,227.5,170,200,147.5,125,0,0,147.5,172.5,187.5,0,0,110,215,242.5,232.5,232.5,195,187.5,170,160,145,145,122.5,0]
["120-BPO",0,0,0,170,245,283,295,356.5,315.5,302.5,302.5,242.5,217.5,200,197.5,155,0,0,0,145,162.4,205,0,0,75,242.5,253,240,240,240,207.5,190,160,147.5,127.5,0,0]
["120+-BPO",0,0,0,175,260,272.5,350,410,385,362.5,320,320,287.5,232.5,180,100,0,0,0,175,190,207.5,0,135,135,272.5,290,260,247.5,237.5,228,228,160,145,130,77.5,0]
["30-DLO",0,0,0,0,0,0,0,0,0,0,0,0,0,0,0,0,0,0,0,0,0,0,70,70,70,0,0,0,0,0,0,0,0,0,0,0,0]
["35-DLO",0,0,0,0,0,0,0,0,0,0,0,0,0,0,0,0,0,0,0,0,0,0,75,75,75,0,0,0,0,0,0,0,0,0,0,0,0]
["40-DLO",0,0,0,0,0,0,0,0,0,0,0,0,0,0,0,0,0,0,0,90,90,90,0,93,100.5,90,90,0,0,0,0,0,0,0,0,0,0]
["44-DLO",0,0,0,0,142.5,142.5,142.5,0,0,0,0,0,0,0,0,0,0,0,0,0,0,0,75,105,130,0,0,0,0,0,0,0,0,0,0,0,0]
["48-DLO",0,0,0,0,0,0,0,0,0,0,0,0,0,0,0,0,0,0,0,97.5,97.5,97.5,55,87.5,137.5,97.5,97.5,0,0,0,0,0,0,0,0,0,0]
["53-DLO",0,97.5,120,195,207.5,230,257.5,237.5,0,0,0,0,0,0,0,0,0,0,0,201,201,230,52.5,112.5,140,271.5,232.5,0,0,0,0,0,0,0,0,0,0]
["59-DLO",0,0,115,205,217.5,227.5,258.5,262.5,255,255,252.5,177.5,177.5,177.5,177.5,0,0,0,0,201,217.5,242.5,60,100,137.5,250,252.5,252.5,252.5,252.5,201,201,137.5,160,102.5,102.5,0]
["66-DLO",0,0,0,220,240,260,275,277.5,272.2,272.2,272.2,225,210,210,157.5,0,0,0,0,205,212.5,228,0,75,155,270,277.5,262.5,235,230,205,190,150.5,150.5,122.5,100,100]
["74-DLO",0,0,0,227.5,292.60000000000002,297.5,330,330,302.5,265,272.5,255,230,225,220,197.5,125,0,0,192.5,252.5,280.5,0,0,182.5,305,307.5,307.5,240,240,240,202.5,195,195,167.5,155,0]
["83-DLO",0,0,0,277.5,310,312.5,327.5,340,332.5,320,320,307.5,255,245,230,192.5,190,175,0,227.5,282.5,317.5,0,0,180,320.5,340,290,287.5,285,277.5,240,240,213.5,185,182.5,117.5]
["93-DLO",0,92.5,0,257.5,322.5,367.5,377.5,377.5,349.3,332.5,328,325,265,260,245,200,172.5,125,0,237.5,317.5,327.5,0,77.5,170,352.5,352.5,320,312.5,312.5,312.5,277,263.10000000000002,220,180.5,180.5,0]
["105-DLO",0,0,0,262.5,300,322.10000000000002,382.5,387.5,335,307.5,307.5,305,315,260,253,220,0,0,0,245,287.5,325,0,0,157.5,347.5,367.5,315,295,295,295,277.5,230.5,210,200,0,0]
["120-DLO",0,0,0,690,690,690,690,372.5,355.5,355.5,347.5,301.60000000000002,320,281.5,260,0,0,0,0,255,282.5,306.2,0,0,155,365,372,372,372,342.5,292.5,280,280,230,177.5,0,0]
["120+-DLO",0,0,0,272.5,319.8,320,385.6,410,400,362.9,320,320,290,257.5,190,142.5,0,0,0,267.5,287.5,306,0,220,220,335.5,392.5,380,380,325,280,251.8,245,182.5,142.5,0,0]
["30-SQ",0,0,0,0,0,0,0,0,0,0,0,0,0,0,0,0,0,0,0,0,0,0,47.5,47.5,47.5,0,0,0,0,0,0,0,0,0,0,0,0]
["30-BP",0,0,0,0,0,0,0,0,0,0,0,0,0,0,0,0,0,0,0,0,0,0,25,25.5,25.5,0,0,0,0,0,0,0,0,0,0,0,0]
["30-DL",0,0,0,0,0,0,0,0,0,0,0,0,0,0,0,0,0,0,0,0,0,0,60,65,65,0,0,0,0,0,0,0,0,0,0,0,0]
["30-TL",0,0,0,0,0,0,0,0,0,0,0,0,0,0,0,0,0,0,0,0,0,0,122.5,135.5,135.5,0,0,0,0,0,0,0,0,0,0,0,0]
["35-SQ",45,0,0,0,0,0,0,0,0,0,0,0,0,0,0,0,0,0,0,0,0,0,60.5,60.5,60.5,0,0,0,0,0,0,0,0,0,0,0,0]
["35-BP",25,0,0,0,0,0,0,0,0,0,0,0,0,0,0,0,0,0,0,0,0,0,31,31,31,0,0,0,0,0,0,0,0,0,0,0,0]
["35-DL",57.5,0,0,0,0,0,0,0,0,0,0,0,0,0,0,0,0,0,0,0,0,0,76,76,76,0,0,0,0,0,0,0,0,0,0,0,0]
["35-TL",127.5,0,0,0,0,0,0,0,0,0,0,0,0,0,0,0,0,0,0,0,0,0,166.5,166.5,166.5,0,0,0,0,0,0,0,0,0,0,0,0]
["40-SQ",0,0,0,0,0,0,0,0,0,0,0,0,0,0,0,0,0,0,0,0,0,0,47.5,70.5,70.5,0,0,0,0,0,0,0,0,0,0,0,0]
["40-BP",0,0,0,0,0,0,0,0,0,0,0,0,0,0,0,0,0,0,0,0,0,0,30,45,45,0,0,0,0,0,0,0,0,0,0,0,0]
["40-DL",0,0,0,0,0,0,0,0,0,0,0,0,0,0,0,0,0,0,0,0,0,0,72.5,87.5,90.7,0,0,0,0,0,0,0,0,0,0,0,0]
["40-TL",0,0,0,0,0,0,0,0,0,0,0,0,0,0,0,0,0,0,0,0,0,0,147.5,202.5,202.5,0,0,0,0,0,0,0,0,0,0,0,0]
["43-SQ",0,0,0,92.5,137.5,137.5,137.5,125,0,0,0,0,0,0,0,0,0,0,0,97.5,100.5,100.5,0,65,75,100.5,85,0,0,0,0,0,0,0,0,0,0]
["43-BP",0,0,0,47.5,77.5,83,83,62.5,0,0,0,0,0,0,0,0,0,0,0,52.5,62.5,70,0,32.5,43,70,62.5,0,0,0,0,0,0,0,0,0,0]
["43-DL",0,0,0,92.5,142.5,142.5,142.5,142.5,0,0,0,0,0,0,0,0,0,0,0,105,125,125,0,75,92.5,125,125,0,0,0,0,0,0,0,0,0,0]
["43-TL",0,0,0,282.5,342.5,348,348,320,207.5,0,0,0,0,0,0,0,0,0,0,252.5,272.5,277.5,0,172.5,207.5,277.5,272.5,207.5,237.5,0,0,0,0,0,0,0,0]
["47-SQ",0,0,52.5,132.5,137.5,140,152.5,165,132.5,132.5,122.5,112.5,102.5,102.5,100,0,0,0,0,105,105,105,47.5,47.5,97.5,125,142.5,125,102.5,102.5,88,88,88,85,0,0,0]
["47-BP",0,0,37.5,72.5,82.5,82.5,92.5,92.5,77.099999999999994,77.099999999999994,65,65,50,50,45,0,0,0,0,65,65,75,27.5,27.5,65,85,85,65,48,48,45,45,45,40,0,0,0]
["47-DL",0,0,77.5,147.5,147.5,160,162.5,162.5,152.5,152.5,145,142.5,127.5,127.5,127.5,0,0,0,0,125,125,132.5,72.5,72.5,122.5,151,182.5,147.5,120,120,120,120,120,120,0,0,0]
["47-TL",0,242.5,242.5,350,347.5,370,392.5,402.5,357.5,357.5,327.5,317.5,272.5,272.5,272.5,0,0,0,0,285,285,292.5,147.5,177.5,285,335,397.5,335,265,265,251,251,251,245,0,0,0]
["52-SQ",0,0,100,160,177.5,180,194,194,182.5,182.5,130,120,115,100,76,76,0,0,36.299999999999997,102.5,107.5,117.5,20,75,80,142.5,156.5,156.5,156.5,152.5,100,100,85,80,65,0,0]
["52-BP",0,0,52.5,102.5,102.5,102.5,132.5,132.5,110,92.5,77.5,75,75,51,51,51,0,0,22.7,70,70,80,20,45,47.5,82.5,97.5,97.5,80.5,80.5,65,65,52.5,52.5,42.5,0,0]
["52-DL",0,0,90,170,183,180,183,192.5,170,170,157.5,145,123.5,102.5,88,88,0,0,61.2,132.5,132.5,147.4,35,110.5,95,166.5,187.5,187.5,162.5,158,132.5,132.5,115.5,115.5,80,0,0]
["52-TL",0,0,242.5,397.5,425,437.5,501.5,501.5,442.5,440,350,337.5,292.5,250,211,211,0,0,120.2,295,300,327.5,75,230.5,210,363.5,430,430,394,391,295,295,247.5,225.5,187.5,0,0]
["57-SQ",0,0,0,165,200,205,205,205,155,150,150,122.5,102.5,75,75,75,0,0,0,130,143,143,0,77.5,102.5,152.5,174.5,142.5,132.5,125.5,90,87.5,85,70,62.5,0,0]
["57-BP",0,0,0,83,110,115,137.5,137.5,120,97.5,97.5,97.5,71.5,71.5,71.5,71.5,0,0,0,75,85,95,0,45,63,95,100,80,80,80,65,60,47.5,45,40,0,0]
["57-DL",0,0,0,175,183.5,192.5,192.5,197.5,182.5,177.5,177.5,147.5,132.5,95,92.5,90,0,0,0,137.5,167.5,170,0,92.5,113,185,193,162.5,162.5,151,125,120,115,97.5,77.5,0,0]
["57-TL",0,0,177.5,412.5,475.5,500,522.5,522.5,445,397.5,392.5,365,292.5,207.5,207.5,207.5,0,0,0,327.5,370,390,177.5,215,262.5,418,463,370.5,347.5,335.5,280,267.5,247.5,212.5,180,0,0]
["63-SQ",0,37.5,0,165,182.5,202.5,202.5,215,200,187.5,175,162.5,110,110,90,67.5,0,0,0,146,146,152.5,0,68,107.5,160,180,155,155,132.5,131,102.5,90,82.5,32.5,0,0]
["63-BP",0,25,0,92.5,102.5,117.5,125,150,140.5,130,130,85,75,72.5,72.5,35,0,0,0,65,82.5,95,0,32.5,58,100,142.5,142.5,142.5,80,75,73,62.5,62.5,32.5,0,0]
["63-DL",0,52.5,0,181.4,205,215,215,227.5,197.5,190,183,180,137.5,130,130,80,0,0,0,164.5,166,195,0,95.5,140,197.5,221,202.5,202.5,175.5,160,135.5,125,125,60,0,0]
["63-TL",0,115,0,417.5,477.5,500,500,547.5,507.5,457.5,452.5,417.5,312.5,297.5,292.5,182.5,0,0,0,363,376,417.5,0,192.5,305.5,442.5,499.5,499.5,499.5,353,352.5,311,270,267.5,125,0,0]
["72-SQ",0,0,0,175,200,217.5,222.5,255,245,240,170,162.5,152.5,142.5,140,38.6,0,0,0,125,168.5,180,0,77.5,113,180,188,175,147.5,145.5,145.5,120.5,105,105,45,0,0]
["72-BP",0,0,0,90,120,132.5,137.5,170,165,165,115,105,92.5,90,90,27.2,0,0,0,67,107.5,115,0,32.5,58,115,144,144,115,87.5,80.5,80.5,70,67.5,42.5,0,0]
["72-DL",0,0,0,170,220,220,220,252.5,249,249,180,180,157.5,157.5,150,61.2,0,0,0,147.5,200.5,205,0,107.5,132.5,205,246,205,195,195,195,150.5,130,125,92.5,0,0]
["72-TL",0,0,0,430,500,530,542.5,654,654,654,450,445,390,390,377.5,127,0,0,0,337.5,476.5,497.5,0,225,303.5,497.5,549,487.5,452.5,418.5,418.5,332.5,305,297.5,180,0,0]
["84-SQ",0,37.5,55,180,210.5,227.5,240.5,273.5,247.5,245,180,145,105,105,105,97.5,0,0,0,130,180,222.5,0,62.5,125,225,222.5,200,200,145,142.5,115.5,100,82.5,82.5,0,0]
["84-BP",0,27.5,35,100,137.5,140,166,192.5,192.5,192.5,130.5,102.5,75,75,75,72.5,0,0,0,67.5,105,127.5,0,42.5,52.5,127.5,127.5,125,125,100,90,72.5,72.5,57.5,52.5,0,0]
["84-DL",0,0,87.5,200,200,225,235,235,228,228,210,152.5,135,135,135,122.5,0,0,0,181.4,205,227.5,0,93,137.5,227.5,235,227.5,227.5,170,152.5,152.5,132.5,125,125,0,0]
["84-TL",0,175,175,475,507.5,555,612.5,671,663.5,663.5,483,392.5,307.5,307.5,307.5,280,0,0,0,337.5,490,572.5,0,198,315,572.5,572.5,512.5,512.5,395,372.5,330,305,255,252.5,0,0]
["84+-SQ",0,0,162.5,202.5,262.5,290,292.5,315,255,255,255,255,237.5,150,0,0,0,0,0,182.5,262.5,262.5,0,45,110,262.5,273,195,182.5,175,138.4,115,100.5,90,90,52.5,0]
["84+-BP",0,0,47.5,112.5,168,178,190,210,185,157.5,157.5,157.5,122.5,67.5,0,0,0,0,0,65,120,120,0,42.5,50,120,151.5,121,120,115.5,93,80,80,80,55,40,0]
["84+-DL",0,0,135,212.5,230,230,230,260.5,227.5,227.5,227.5,220,215,152.5,0,0,0,0,0,127.5,238,238,0,102.5,132.5,238,247,212.5,200,200,157.5,147.5,122.5,120,120,115,0]
["84+-TL",0,345,345,502.5,603.5,625,625,778,612.5,612.5,612.5,612.5,575,370,0,0,0,0,0,445,615.5,615.5,0,190,292.5,615.5,671.5,500,480,480,369.7,300,285.5,265,265,202.5,0]
["30-BPO",0,0,0,0,0,0,0,0,0,0,0,0,0,0,0,0,0,0,0,0,0,0,25,25.5,25.5,0,0,0,0,0,0,0,0,0,0,0,0]
["35-BPO",25,0,0,0,0,0,0,0,0,0,0,0,0,0,0,0,0,0,0,0,0,0,31,31,31,0,0,0,0,0,0,0,0,0,0,0,0]
["40-BPO",0,0,0,0,0,0,0,0,0,0,0,0,0,0,0,0,0,0,0,0,0,0,30,45,45,0,0,0,0,0,0,0,0,0,0,0,0]
["43-BPO",0,0,0,47.5,77.5,83,83,62.5,0,0,0,0,0,0,0,0,0,0,0,60,62.5,70,0,32.5,43,70,62.5,0,0,0,0,0,0,0,0,0,0]
["47-BPO",0,0,37.5,72.5,82.5,85,92.5,92.5,77.099999999999994,77.099999999999994,72.5,72.5,50,50,45,40,0,0,0,65,65,75,27.5,27.5,65,85,85,65,48,48,52.5,52.5,45,40,0,0,0]
["52-BPO",0,0,0,102.5,107.5,107.5,132.5,132.5,112.5,92.5,87.5,87.5,75,67.5,51,51,0,25,22.7,70,85,85,20,45,47.5,100,100,97.5,80.5,80.5,65,65,52.5,52.5,42.5,0,0]
["57-BPO",0,0,0,83,110,115,137.5,137.5,130,112.5,112.5,112.5,60.5,71.5,71.5,71.5,0,0,0,75,85,95,0,45,63,95,100,82.5,80,80,67.5,60,47.5,47.5,40,0,0]
["63-BPO",0,25,0,92.5,110,117.5,125,150,140.5,130,130,102.5,77.5,72.5,72.5,35,0,0,0,65,82.5,95,0,32.5,58,100,144,144,144,80,75,73,62.5,62.5,32.5,0,0]
["72-BPO",0,0,0,90,120,132.5,140,170,165,165,115,105,92.5,92.5,90,50,0,0,0,67,107.5,115,0,32.5,58,115,144,144,115,105,80.5,80.5,70,67.5,42.5,30,30]
["84-BPO",0,27.5,35,122.5,140,155,166,192.5,192.5,192.5,130.5,97.5,87.5,65,75,75,0,0,0,77.5,105,127.5,0,42.5,52.5,127.5,127.5,125,125,100,92.5,75,75,75,75,25,0]
["84+-BPO",0,0,0,112.5,168,178,190,210,190.5,182.5,172.5,160,122.5,85,80,0,0,0,0,95,120,120,0,42.5,50,120,151.5,122.5,120,120,93,85,80,80,71.5,40,0]
["30-DLO",0,0,0,0,0,0,0,0,0,0,0,0,0,0,0,0,0,0,0,0,0,0,60,65,65,0,0,0,0,0,0,0,0,0,0,0,0]
["35-DLO",57.5,0,0,0,0,0,0,0,0,0,0,0,0,0,0,0,0,0,0,0,0,0,76,76,76,0,0,0,0,0,0,0,0,0,0,0,0]
["40-DLO",0,0,0,0,0,0,0,0,0,0,0,0,0,0,0,0,0,0,0,0,0,0,72.5,87.5,90.7,0,0,0,0,0,0,0,0,0,0,0,0]
["43-DLO",0,0,0,92.5,142.5,142.5,142.5,142.5,0,0,0,0,0,0,0,0,0,0,0,105,125,125,0,75,92.5,125,125,0,0,0,0,0,0,0,0,0,0]
["47-DLO",0,0,77.5,147.5,147.5,160,162.5,162.5,152.5,152.5,145,142.5,127.5,127.5,127.5,0,0,0,0,125,125,132.5,72.5,72.5,122.5,151,182.5,147.5,120,120,120,120,120,120,0,0,0]
["52-DLO",0,0,0,170,183,180,182.5,192.5,170,170,157.5,145,123.5,102.5,88,88,0,0,61.2,132.5,132.5,147.4,35,110.5,102.5,166.5,187.5,187.5,162.5,158,132.5,132.5,115.5,115.5,80,65,0]
["57-DLO",0,0,0,175,183.7,192.5,192.5,197.5,182.5,177.5,177.5,147.5,132.5,95,92.5,90,0,0,0,137.5,167.5,170,0,92.5,113,185,193,162.5,162.5,151,125,120,115,97.5,77.5,0,0]
["63-DLO",0,52.5,0,181.4,205,215,215,227.5,197.5,190,183,180,137.5,130,130,80,0,0,0,164.5,166,195,0,95.5,140,197.5,221,202.5,202.5,175.5,160,135.5,125,125,60,0,0]
["72-DLO",0,0,0,170,220,220,220,257.5,249,249,180,180,157.5,157.5,150,61.2,0,0,0,147.5,200.5,205,0,107.5,132.5,205,246,205,195,195,195,150.5,130,125,92.5,42.5,42.5]
["84-DLO",0,55,87.5,200,204.1,225,235,252.5,228,228,210,152.5,115,115,135,122.5,0,0,0,181.4,205,227.5,0,93,137.5,227.5,235,227.5,227.5,170,152.5,152.5,132.5,115,125,60,0]
["84+-DLO",0,0,0,212.5,230,230,230,260.5,227.5,227.5,227.5,220,215,152.5,125,0,0,0,0,182.5,238,238,0,102.5,132.5,238,247,212.5,200,200,160,160,122.5,120,120,115,0]

{"sheet":"LB Records","index":12,"n_rows":151,"n_cols":38,"rows_kept":151,"cut":false,"hidden":true,"merged":[]}
[null,"Y1","Y2","Y3","T1","T2","T3","JR","O","M1a","M1b","M2a","M2b","M3a","M3b","M4a","M4b","M5a","M5b","M6","R-T1","R-T2","R-T3","R-Y1","R-Y2","R-Y3","R-JR","R-O","R-M1A","R-M1B","R-M2A","R-M2B","R-M3A","R-M3B","R-M4A","R-M4B","R-M5A","R-M5B"]
["66-SQ",0,0,0,0,0,0,0,0,0,0,0,0,0,0,0,0,0,0,0,0,0,0,99.2,99.2,99.2,0,0,0,0,0,0,0,0,0,0,0,0]
["66-BP",0,0,0,0,0,0,0,0,0,0,0,0,0,0,0,0,0,0,0,0,0,0,57.3,57.3,57.3,0,0,0,0,0,0,0,0,0,0,0,0]
["66-DL",0,0,0,0,0,0,0,0,0,0,0,0,0,0,0,0,0,0,0,0,0,0,154.30000000000001,154.30000000000001,154.30000000000001,0,0,0,0,0,0,0,0,0,0,0,0]
["66-TL",0,0,0,0,0,0,0,0,0,0,0,0,0,0,0,0,0,0,0,0,0,0,310.89999999999998,310.89999999999998,310.89999999999998,0,0,0,0,0,0,0,0,0,0,0,0]
["77-SQ",0,0,0,0,0,0,0,0,0,0,0,0,0,0,0,0,0,0,0,0,0,0,121.3,121.3,121.3,0,0,0,0,0,0,0,0,0,0,0,0]
["77-BP",0,0,0,0,0,0,0,0,0,0,0,0,0,0,0,0,0,0,0,0,0,0,66.099999999999994,66.099999999999994,66.099999999999994,0,0,0,0,0,0,0,0,0,0,0,0]
["77-DL",0,0,0,0,0,0,0,0,0,0,0,0,0,0,0,0,0,0,0,0,0,0,165.3,165.3,165.3,0,0,0,0,0,0,0,0,0,0,0,0]
["77-TL",0,0,0,0,0,0,0,0,0,0,0,0,0,0,0,0,0,0,0,0,0,0,352.7,352.7,352.7,0,0,0,0,0,0,0,0,0,0,0,0]
["88-SQ",0,0,0,0,0,0,0,0,0,0,0,0,0,0,0,0,0,0,0,0,0,0,0,137.80000000000001,179.7,0,0,0,0,0,0,0,0,0,0,0,0]
["88-BP",0,0,0,0,0,0,0,0,0,0,0,0,0,0,0,0,0,0,0,0,0,0,0,79.400000000000006,110.2,0,0,0,0,0,0,0,0,0,0,0,0]
["88-DL",0,0,0,0,0,0,0,0,0,0,0,0,0,0,0,0,0,0,0,0,0,0,0,205,221.6,0,0,0,0,0,0,0,0,0,0,0,0]
["88-TL",0,0,0,0,0,0,0,0,0,0,0,0,0,0,0,0,0,0,0,0,0,0,0,414.5,511.5,0,0,0,0,0,0,0,0,0,0,0,0]
["97-SQ",0,0,0,0,0,0,0,0,0,0,0,0,0,0,0,0,0,0,0,0,0,0,99.2,165.3,211.6,0,0,0,0,0,0,0,0,0,0,0,0]
["97-BP",0,0,0,0,0,0,0,0,0,0,0,0,0,0,0,0,0,0,0,0,0,0,71.7,88.2,126.8,0,0,0,0,0,0,0,0,0,0,0,0]
["97-DL",0,0,0,0,314.2,314.2,314.2,0,0,0,0,0,0,0,0,0,0,0,0,0,0,0,165.3,231.5,286.60000000000002,0,0,0,0,0,0,0,0,0,0,0,0]
["97-TL",0,0,0,0,700,700,700,0,0,0,0,0,0,0,0,0,0,0,0,0,0,0,336.2,485,617.29999999999995,0,0,0,0,0,0,0,0,0,0,0,0]
["105-SQ",0,0,0,0,0,0,0,0,0,0,0,0,0,0,0,0,0,0,0,154.30000000000001,154.30000000000001,154.30000000000001,93.7,121.3,231.5,154.30000000000001,154.30000000000001,0,0,0,0,0,0,0,0,0,0]
["105-BP",0,0,0,0,0,0,0,0,0,0,0,0,0,0,0,0,0,0,0,126.8,126.8,126.8,49.6,93.7,137.80000000000001,126.8,126.8,0,0,0,0,0,0,0,0,0,0]
["105-DL",0,0,0,0,0,0,0,0,0,0,0,0,0,0,0,0,0,0,0,215,215,215,121.3,192.9,303.10000000000002,215,215,0,0,0,0,0,0,0,0,0,0]
["105-TL",0,0,0,0,0,0,0,0,0,0,0,0,0,0,0,0,0,0,0,496,496,496,264.60000000000002,396.8,672.4,496,496,0,0,0,0,0,0,0,0,0,0]
["116-SQ",0,121.3,181.9,358.3,463,479.5,479.5,479.5,0,0,0,0,0,0,0,0,0,0,0,314.2,319.7,363.8,33.1,170.9,231.5,374.8,363.8,0,0,0,0,0,0,0,0,0,0]
["116-BP",0,78.3,137.80000000000001,215,347.2,347.2,347.2,319.7,0,0,0,0,0,0,0,0,0,0,0,181.9,209.4,253.5,44.1,99.2,159.80000000000001,259,253.5,0,0,0,0,0,0,0,0,0,0]
["116-DL",0,215,264.60000000000002,429.9,457.5,507.1,551.20000000000005,523.6,0,0,0,0,0,0,0,0,0,0,0,443.1,443.1,507.1,115.7,248,308.60000000000002,598.6,512.6,0,0,0,0,0,0,0,0,0,0]
["116-TL",0,414.5,584.20000000000005,992.1,1168.4000000000001,1207,1416.5,1416.5,0,1212.5,1107.8,1107.8,1102.3,0,0,0,0,0,0,928.1,928.1,1107.8,347.2,567.70000000000005,700,1232.4000000000001,1631.4,0,0,0,0,0,0,0,0,0,0]
["130-SQ",0,0,231.5,435.4,475,534.6,551.20000000000005,563.29999999999995,557.79999999999995,557.79999999999995,557.79999999999995,336.2,336.2,336.2,314.2,0,0,0,0,363.8,429.9,468.5,77.2,159.80000000000001,248,468.5,534.6,424.4,424.4,424.4,377,377,259,231.5,170.9,170.9,0]
["130-BP",0,0,115.7,275.60000000000002,330,330.7,369.3,369.3,314.2,292,259,259,215,215,215,0,0,0,0,254.6,254.6,281.10000000000002,88.2,88.2,159.80000000000001,330.7,330.7,242.5,226,209.4,209.4,209.4,176.4,176.4,93.7,93.7,0]
["130-DL",0,0,253.5,451.9,479.5,501.6,569.9,578.70000000000005,562.20000000000005,562.20000000000005,556.70000000000005,391.3,391.3,391.3,391.3,0,0,0,0,443.1,479.5,534.6,132.30000000000001,220.5,303.10000000000002,551.20000000000005,556.70000000000005,556.70000000000005,556.70000000000005,556.70000000000005,443.1,443.1,303.10000000000002,352.7,226,226,0]
["130-TL",0,529.1,600.79999999999995,1162.9000000000001,1185,1300.7,1334.9,1428.6,1350.3,1350.3,1345.9,948,909.4,909.4,909.4,0,0,0,0,1019.6,1157.4000000000001,1229.0999999999999,529.1,529.1,694.5,1273.2,1273.2,1201.5,1201.5,1179.5,873,873,749.6,749.6,490.5,490.5,0]
["145-SQ",0,0,181.9,451.9,540.1,600.79999999999995,700,700,551.20000000000005,496,496,440.9,440.9,440.9,363.8,248,0,0,0,374.8,425.5,457.5,0,330.7,330.7,557.79999999999995,562.20000000000005,435.4,421.1,421.1,418.9,409,270.10000000000002,270.10000000000002,181.9,181.9,181.9]
["145-BP",0,0,126.8,292.10000000000002,336.2,451.9,507.1,507.1,314.2,325.2,325.2,303.10000000000002,303.10000000000002,303.10000000000002,292.10000000000002,165.3,0,0,0,292.10000000000002,303.10000000000002,314.2,0,126.8,172,369.3,369.3,325.2,325.2,314.2,314.2,242.5,203.9,203.9,170.9,137.80000000000001,137.80000000000001]
["145-DL",0,0,220.5,485,529.1,573.20000000000005,606.29999999999995,611.79999999999995,600,600,600,496,463,463,347.2,264.60000000000002,0,0,0,451.9,468.5,502.7,0,165.3,341.7,595.20000000000005,611.79999999999995,578.70000000000005,518.1,507.1,451.9,418.9,331.8,331.8,270.10000000000002,220.5,220.5]
["145-TL",0,0,529.1,1118.8,1333.8,1543.2,1697.6,1697.6,1377.9,1295.2,1273.2,1185,1135.4000000000001,1135.4000000000001,948,622.79999999999995,0,0,0,1118.8,1118.8,1267.7,0,600.79999999999995,777.1,1516.8,1516.8,1251.0999999999999,1181.7,1181.7,1140.9000000000001,1026.3,771.6,771.6,540.1,540.1,540.1]
["163-SQ",0,0,0,512.6,562.20000000000005,672.4,722,722,617.29999999999995,589.70000000000005,589.70000000000005,534.6,518.1,440.9,385.8,336.2,148.80000000000001,0,0,440.9,474,563.29999999999995,0,0,440.9,580.9,585.29999999999995,545.6,485,435.4,403.4,386.9,352.7,352.7,286.60000000000002,275.60000000000002,0]
["163-BP",0,0,0,319.7,352.7,442,518.1,518.1,413.4,374.8,374.8,319.7,319.7,308.60000000000002,308.60000000000002,242.5,137.80000000000001,0,0,314.2,314.2,363.8,0,0,215,391.3,424.4,394.6,394.6,394.6,259,259,259,259,203.9,198.4,0]
["163-DL",0,0,0,501.6,645.1,655.9,727.5,727.5,666.9,600.79999999999995,600.79999999999995,562.20000000000005,507.1,496,485,435.4,275.60000000000002,0,0,424.4,556.70000000000005,618.4,0,0,402.3,672.4,677.9,677.9,529.1,529.1,529.1,446.4,429.9,429.9,369.3,341.7,0]
["163-TL",0,0,0,1262.0999999999999,1460.6,1670,1807.8,1807.8,1675.5,1537.7,1537.7,1322.8,1262.0999999999999,1179.3,1124.4000000000001,1008.6,562.20000000000005,0,0,1058.2,1333.8,1478.2,0,0,1058.2,1620.4,1653.5,1581.8,1284.2,1248.9000000000001,1175.0999999999999,1030.7,997.6,997.6,870.8,815.7,0]
["183-SQ",0,0,0,640.4,716.5,716.5,777.1,815.7,744.1,744.1,700,672.4,490.5,485,435.4,352.7,352.7,352.7,0,457.5,529.1,573.20000000000005,0,0,391.3,662.5,662.5,595.20000000000005,573.20000000000005,523.6,453,424.4,424.4,358.3,325.2,325.2,143.30000000000001]
["183-BP",0,0,0,352.7,440.9,474,661.4,661.4,551.20000000000005,534.6,468.5,435.4,382.5,336.2,325.2,275.60000000000002,237,198.4,0,303.10000000000002,385.8,391.3,0,0,215,429.9,444.2,413.4,396.8,396.8,341.7,309.7,293.2,253.5,200.6,181.9,176.4]
["183-DL",0,0,0,611.79999999999995,683.4,688.9,722,744.1,733,705.5,705.3,677.9,562.20000000000005,540,507.1,424.4,418.9,385.8,0,501.6,622.79999999999995,700,0,0,396.8,706.6,749.6,639.29999999999995,633.79999999999995,628.29999999999995,611.79999999999995,529.1,529.1,470.7,407.9,402.3,259]
["183-TL",0,0,0,1605,1802.3,1802.3,1934.6,2000.7,1901.5,1901.5,1703.1,1675.5,1322.8,1229.0999999999999,1234.5999999999999,1008.6,970,925.9,0,1179.5,1422,1631.4,0,0,1003.1,1785.7,1792.4,1559.8,1510.2,1493.6,1328.3,1174,1174,1082.5,903.9,903.9,534.6]
["205-SQ",0,88.2,0,551.20000000000005,700,755.1,826.7,826.7,766.1,766.1,766.1,716.5,617.29999999999995,490.5,440.9,374.8,330.7,143.30000000000001,0,485,580.9,639.29999999999995,0,66.099999999999994,374.8,722,722,717.6,717.6,717.6,717.6,458.6,458.6,396.8,319.7,319.7,0]
["205-BP",0,93.7,0,374.8,457.5,512.6,573.20000000000005,589.70000000000005,578.70000000000005,573.20000000000005,507.1,479.5,402.3,326.3,303,253.5,225,187.4,0,325.2,402.3,402.3,0,71.7,264.60000000000002,440.9,507.1,507.1,507.1,474,463,369.3,275.60000000000002,254.6,253.5,192.9,0]
["205-DL",0,203.9,0,567.70000000000005,711,771.6,832.2,832.2,756.2,733,723.1,716.5,584.20000000000005,573.20000000000005,540.1,440.7,380.3,275.60000000000002,0,523.6,700,722,0,170.9,374.8,777.1,777.1,705.5,683.4,683.4,683.4,580,580,485,397.9,397.9,0]
["205-TL",0,385.8,0,1361.4,1763.7,1984.2,2144,2144,1984.2,1984.2,1984.2,1829.8,1493.6,1339.3,1207,1014,920.4,606.29999999999995,0,1251.0999999999999,1620.4,1747.2,0,308.60000000000002,1014.1,1851.9,1851.9,1829.8,1829.8,1829.8,1829.8,1350.3,1224.7,1124.4000000000001,920.4,892.9,0]
["231-SQ",0,0,0,611.79999999999995,727.5,744.1,782.6,843.3,782.6,782.6,760.6,705.5,650.4,551.20000000000005,479.5,374.8,253.5,0,0,529.1,617.29999999999995,628.29999999999995,0,0,308.60000000000002,688.9,730.8,644.9,606.29999999999995,606.29999999999995,606.29999999999995,518.1,429.9,396.8,281.10000000000002,231.5,0]
["231-BP",0,0,0,402.3,457.5,534.6,628.29999999999995,713.2,535.70000000000005,535.70000000000005,534.6,534.6,501.6,415,385.8,325.2,220.5,0,0,325.2,380.3,413.4,0,0,242.5,474,525.79999999999995,512.6,512.6,407.9,374.8,348.3,337.3,264.60000000000002,237,226,0]
["231-DL",0,0,0,578.70000000000005,661.4,710,755,832.2,738.5,733,694.5,694.5,694.5,573.20000000000005,557.79999999999995,485,325.2,0,0,540.1,633.79999999999995,716.5,0,0,347.2,766.1,810.2,694.5,650.4,650.4,650.4,611.79999999999995,508.2,463,440.9,336.2,0]
["231-TL",0,0,0,1504.7,1686.5,1901.5,2000.7,2173.8000000000002,2017.2,2017.2,1843.1,1813.3,1697.6,1390,1350.3,1107.8,799.2,0,0,1394.4,1620.4,1752.7,0,0,898.4,1857.4,1962.1,1704.2,1642.4,1576.3,1570.8,1322.8,1275.4000000000001,1113.3,959,793.7,0]
["264-SQ",0,0,0,622.79999999999995,793.7,805.8,892.9,910.5,910.5,909.4,771.6,700,589.70000000000005,545.6,451.9,0,0,0,0,507.1,617.29999999999995,700,0,0,330.7,821.2,851,834.4,834.4,834.4,606.29999999999995,512.6,512.6,413.4,203.9,0,0]
["264-BP",0,0,0,358.3,540.1,622.79999999999995,650.4,705.5,688.9,578.70000000000005,578.70000000000005,534.6,429.9,413.4,363.8,0,0,0,0,319.7,402.3,451.9,0,0,165.3,534.6,557.79999999999995,485,451.9,435.4,407.9,385.8,352.7,325.2,242.5,0,0]
["264-DL",0,0,0,573.20000000000005,677.9,727.5,804.7,821.2,783.7,733,716.5,705.5,705.5,620.6,573.20000000000005,0,0,0,0,562.20000000000005,622.79999999999995,675,0,0,341.7,804.7,820.1,820.1,820.1,755.1,644.9,617.29999999999995,617.29999999999995,507.1,325.2,0,0]
["264-TL",0,0,0,1521.2,1923.5,2095.5,2281.8000000000002,2298.3000000000002,2238.8000000000002,2110.9,2083.4,1813.3,1581.8,1556.5,1372.4,0,0,0,0,1290.8,1614.9,1774.7,0,0,837.8,1962.1,2157.1999999999998,2082.3000000000002,2082.3000000000002,1973.1,1587.3,1411,1411,1157.4000000000001,738.5,0,0]
["264+-SQ",0,0,0,639.29999999999995,804.7,936.5,936.5,1113.3,950,950,887.4,705.5,683.4,600.79999999999995,463,203.9,0,0,0,727.5,805.8,938.1,0,435.4,435.4,938.1,1069.2,749.6,744.1,727.5,567.70000000000005,502.7,418.9,402.3,203.9,181.9,0]
["264+-BP",0,0,0,385.8,573.20000000000005,600.79999999999995,771.6,903.9,771.6,655.9,644.9,644.9,518.1,429.9,341.7,220.5,0,0,0,385.8,418.9,457.5,0,297.60000000000002,297.60000000000002,518.1,585.29999999999995,573.20000000000005,540.1,512.6,418.9,405,319.7,319.7,220.5,170.9,0]
["264+-DL",0,0,0,567.70000000000005,705,700,804.7,903.9,881.8,755.1,705.5,705.3,639.29999999999995,567.70000000000005,418.9,314.2,0,0,0,589.70000000000005,633.79999999999995,674.6,0,485,485,739.7,865.3,837.8,837.8,716.5,611.79999999999995,551.20000000000005,540.1,402.3,314.2,253.5,0]
["264+-TL",0,0,0,1592.8,2000.7,2094.4,2331.4,2805.4,2331.4,2320.4,2083.4,1901.5,1730.6,1554.3,1146.4000000000001,738.5,0,0,0,1592.8,1742.8,2029.4,0,1218.0999999999999,1218.0999999999999,2055.8000000000002,2436.1,2066.8000000000002,2066.8000000000002,1913.6,1559.8,1372.4,1273.2,1124.4000000000001,738.5,589.70000000000005,0]
["66-BPO",0,0,0,0,0,0,0,0,0,0,0,0,0,0,0,0,0,0,0,0,0,0,57.3,57.3,57.3,0,0,0,0,0,0,0,0,0,0,0,0]
["77-BPO",0,0,0,0,0,0,0,0,0,0,0,0,0,0,0,0,0,0,0,0,0,0,66.099999999999994,66.099999999999994,66.099999999999994,0,0,0,0,0,0,0,0,0,0,0,0]
["88-BPO",0,0,0,0,0,0,0,0,0,0,0,0,0,0,0,0,0,0,0,99.2,99.2,99.2,0,99.2,110.2,99.2,99.2,0,0,0,0,0,0,0,0,0,0]
["97-BPO",0,0,0,0,0,0,0,0,0,0,0,0,0,0,0,0,0,0,0,0,0,0,71.7,88.2,126.8,0,0,0,0,0,0,0,0,0,0,0,0]
["105-BPO",0,0,0,0,0,0,0,0,0,0,0,0,0,0,0,0,0,0,0,126.8,126.8,126.8,49.6,93.7,137.80000000000001,126.8,126.8,0,0,0,0,0,0,0,0,0,0]
["116-BPO",0,78.3,137.80000000000001,215,347.2,347.2,347.2,319.7,0,0,0,0,0,0,0,0,0,0,0,181.9,209.4,253.5,44.1,99.2,159.80000000000001,259,253.5,0,0,0,0,0,0,0,0,0,0]
["130-BPO",0,0,115.7,275.60000000000002,331.8,331.8,369.3,314.2,314.2,330.7,297.60000000000002,297.60000000000002,297.60000000000002,264.60000000000002,215,181.9,126.8,0,0,254.6,254.6,314.2,88.2,88.2,159.80000000000001,330.7,341.7,253.5,237,232.6,232.6,232.6,226,187.4,187.4,93.7,0]
["145-BPO",0,0,0,292.10000000000002,352.7,470.7,529.1,529.1,374.8,374.8,325.2,292.10000000000002,292.10000000000002,303.10000000000002,292.10000000000002,0,88.2,0,0,292.10000000000002,303.10000000000002,314.2,0,126.8,172,369.3,374.8,325.2,325.2,314.2,314.2,282.2,281.10000000000002,215,215,203.9,137.80000000000001]
["163-BPO",0,0,0,319.7,352.7,468.5,518.1,518.1,429.9,429.9,418.9,386.9,386.9,319.7,308.60000000000002,250.2,231.5,0,0,314.2,314.2,363.8,0,110.2,215,425.5,429.9,402.3,402.3,396.8,327.39999999999998,327.39999999999998,282.2,282.2,231.5,231.5,0]
["183-BPO",0,0,0,365,440.9,485,661.4,661.4,579.79999999999995,562.20000000000005,496,474,396.8,374.8,353.8,275.60000000000002,237,198.4,82.7,303.10000000000002,385.8,407.9,0,0,215,429.9,446.4,479.5,435.4,435.4,352.7,325.2,303.10000000000002,303.10000000000002,238.1,183,183]
["205-BPO",0,93.7,0,374.8,457.5,573.20000000000005,584.20000000000005,705.5,703.3,606.29999999999995,507.1,481.7,424.4,424.4,402.3,253.5,242.5,187.4,0,325.2,440.9,440.9,0,71.7,264.60000000000002,440.9,514.79999999999995,514.79999999999995,514.79999999999995,490.5,463,369.3,319.7,314.2,255.7,170.9,0]
["231-BPO",0,0,0,402.3,457.5,636,636,743,743,743,743,556.70000000000005,501.6,374.8,440.9,325.2,275.60000000000002,0,0,325.2,380.3,413.4,0,0,242.5,474,534.6,512.6,512.6,429.9,413.4,374.8,352.7,319.7,319.7,270.10000000000002,0]
["264-BPO",0,0,0,374.8,540.1,623.9,650.4,785.9,695.6,666.9,666.9,534.6,479.5,440.9,435.4,341.7,0,0,0,319.7,358,451.9,0,0,165.3,534.6,557.79999999999995,529.1,529.1,529.1,457.5,418.9,352.7,325.2,281.10000000000002,0,0]
["264+-BPO",0,0,0,385.8,573.20000000000005,600.79999999999995,771.6,903.9,848.8,799.2,705.5,705.5,633.79999999999995,512.6,396.8,220.5,0,0,0,385.8,418.9,457.5,0,297.60000000000002,297.60000000000002,600.79999999999995,639.29999999999995,573.20000000000005,545.6,523.6,502.7,502.7,352.7,319.7,286.60000000000002,170.9,0]
["66-DLO",0,0,0,0,0,0,0,0,0,0,0,0,0,0,0,0,0,0,0,0,0,0,154.30000000000001,154.30000000000001,154.30000000000001,0,0,0,0,0,0,0,0,0,0,0,0]
["77-DLO",0,0,0,0,0,0,0,0,0,0,0,0,0,0,0,0,0,0,0,0,0,0,165.3,165.3,165.3,0,0,0,0,0,0,0,0,0,0,0,0]
["88-DLO",0,0,0,0,0,0,0,0,0,0,0,0,0,0,0,0,0,0,0,198.4,198.4,198.4,0,205,221.6,198.4,198.4,0,0,0,0,0,0,0,0,0,0]
["97-DLO",0,0,0,0,314.2,314.2,314.2,0,0,0,0,0,0,0,0,0,0,0,0,0,0,0,165.3,231.5,286.60000000000002,0,0,0,0,0,0,0,0,0,0,0,0]
["105-DLO",0,0,0,0,0,0,0,0,0,0,0,0,0,0,0,0,0,0,0,215,215,215,121.3,192.9,303.10000000000002,215,215,0,0,0,0,0,0,0,0,0,0]
["116-DLO",0,215,264.60000000000002,429.9,457.5,507.1,567.70000000000005,523.6,0,0,0,0,0,0,0,0,0,0,0,443.1,443.1,507.1,115.7,248,308.60000000000002,598.6,512.6,0,0,0,0,0,0,0,0,0,0]
["130-DLO",0,0,253.5,451.9,479.5,501.6,569.9,578.70000000000005,562.20000000000005,562.20000000000005,556.70000000000005,391.3,391.3,391.3,391.3,0,0,0,0,443.1,479.5,534.6,132.30000000000001,220.5,303.10000000000002,551.20000000000005,556.70000000000005,556.70000000000005,556.70000000000005,556.70000000000005,443.1,443.1,303.10000000000002,352.7,226,226,0]
["145-DLO",0,0,0,485,529.1,573.20000000000005,606.29999999999995,611.79999999999995,600,600,600,496,463,463,347.2,0,0,0,0,451.9,468.5,502.7,0,165.3,341.7,595.20000000000005,611.79999999999995,578.70000000000005,518.1,507.1,451.9,418.9,331.8,331.8,270.10000000000002,220.5,220.5]
["163-DLO",0,0,0,501.6,645.1,655.9,727.5,727.5,666.9,584.20000000000005,600.79999999999995,562.20000000000005,507.1,496,485,435.4,275.60000000000002,0,0,424.4,556.70000000000005,618.4,0,0,402.3,672.4,677.9,677.9,529.1,529.1,529.1,446.4,429.9,429.9,369.3,341.7,0]
["183-DLO",0,0,0,611.79999999999995,683.4,688.9,722,749.6,733,705.5,705.5,677.9,562.20000000000005,540.1,507.1,424.4,418.9,385.8,0,501.6,622.79999999999995,700,0,0,396.8,706.6,749.6,639.29999999999995,633.79999999999995,628.29999999999995,611.79999999999995,529.1,529.1,470.7,407.9,402.3,259]
["205-DLO",0,203.9,0,567.70000000000005,711,810.2,832.2,832.2,770,733,723.1,716.5,584.20000000000005,573.20000000000005,540.1,440.9,380.3,275.60000000000002,0,523.6,700,722,0,170.9,374.8,777.1,777.1,705.5,688.9,688.9,688.9,610.70000000000005,580,485,397.9,397.9,0]
["231-DLO",0,0,0,578.70000000000005,661.4,710,843.3,854.3,738.5,677.9,677.9,672.4,694.5,573.20000000000005,557.79999999999995,485,0,0,0,540.1,633.79999999999995,716.5,0,0,347.2,766.1,810.2,694.5,650.4,650.4,650.4,611.79999999999995,508.2,463,440.9,0,0]
["264-DLO",0,0,0,1521.2,1521.2,1521.2,1521.2,821.2,783.7,783.7,766.1,665,705.5,620.6,573.20000000000005,0,0,0,0,562.20000000000005,622.79999999999995,675,0,0,341.7,804.7,820.1,820.1,820.1,755.1,644.9,617.29999999999995,617.29999999999995,507.1,391.3,0,0]
["264+-DLO",0,0,0,600.79999999999995,705,705.5,850,903.9,881.8,800,705.5,705.5,639.29999999999995,567.70000000000005,418.9,314.2,0,0,0,589.70000000000005,633.79999999999995,674.6,0,485,485,739.7,865.3,837.8,837.8,716.5,617.29999999999995,555,540.1,402.3,314.2,0,0]
["66-SQ",0,0,0,0,0,0,0,0,0,0,0,0,0,0,0,0,0,0,0,0,0,0,104.7,104.7,104.7,0,0,0,0,0,0,0,0,0,0,0,0]
["66-BP",0,0,0,0,0,0,0,0,0,0,0,0,0,0,0,0,0,0,0,0,0,0,55.1,56.2,56.2,0,0,0,0,0,0,0,0,0,0,0,0]
["66-DL",0,0,0,0,0,0,0,0,0,0,0,0,0,0,0,0,0,0,0,0,0,0,132.30000000000001,143.30000000000001,143.30000000000001,0,0,0,0,0,0,0,0,0,0,0,0]
["66-TL",0,0,0,0,0,0,0,0,0,0,0,0,0,0,0,0,0,0,0,0,0,0,270.10000000000002,298.7,298.7,0,0,0,0,0,0,0,0,0,0,0,0]
["77-SQ",99.2,0,0,0,0,0,0,0,0,0,0,0,0,0,0,0,0,0,0,0,0,0,133.4,133.4,133.4,0,0,0,0,0,0,0,0,0,0,0,0]
["77-BP",55.1,0,0,0,0,0,0,0,0,0,0,0,0,0,0,0,0,0,0,0,0,0,68.3,68.3,68.3,0,0,0,0,0,0,0,0,0,0,0,0]
["77-DL",126.8,0,0,0,0,0,0,0,0,0,0,0,0,0,0,0,0,0,0,0,0,0,167.6,167.6,167.6,0,0,0,0,0,0,0,0,0,0,0,0]
["77-TL",281.10000000000002,0,0,0,0,0,0,0,0,0,0,0,0,0,0,0,0,0,0,0,0,0,367.1,367.1,367.1,0,0,0,0,0,0,0,0,0,0,0,0]
["88-SQ",0,0,0,0,0,0,0,0,0,0,0,0,0,0,0,0,0,0,0,0,0,0,104.7,155.4,155.4,0,0,0,0,0,0,0,0,0,0,0,0]
["88-BP",0,0,0,0,0,0,0,0,0,0,0,0,0,0,0,0,0,0,0,0,0,0,66.099999999999994,99.2,99.2,0,0,0,0,0,0,0,0,0,0,0,0]
["88-DL",0,0,0,0,0,0,0,0,0,0,0,0,0,0,0,0,0,0,0,0,0,0,159.80000000000001,192.9,200,0,0,0,0,0,0,0,0,0,0,0,0]
["88-TL",0,0,0,0,0,0,0,0,0,0,0,0,0,0,0,0,0,0,0,0,0,0,325.2,446.4,446.4,0,0,0,0,0,0,0,0,0,0,0,0]
["94-SQ",0,0,0,203.9,303.10000000000002,303.10000000000002,303.10000000000002,275.60000000000002,0,0,0,0,0,0,0,0,0,0,0,215,221.6,221.6,0,143.30000000000001,165.3,221.6,187.4,0,0,0,0,0,0,0,0,0,0]
["94-BP",0,0,0,104.7,170.9,183,183,137.80000000000001,0,0,0,0,0,0,0,0,0,0,0,115.7,137.80000000000001,154.30000000000001,0,71.7,94.8,154.30000000000001,137.80000000000001,0,0,0,0,0,0,0,0,0,0]
["94-DL",0,0,0,203.9,314.2,314.2,314.2,314.2,0,0,0,0,0,0,0,0,0,0,0,231.5,275.60000000000002,275.60000000000002,0,165.3,203.9,275.60000000000002,275.60000000000002,0,0,0,0,0,0,0,0,0,0]
["94-TL",0,0,0,622.79999999999995,755.1,767.2,767.2,705.5,457.5,0,0,0,0,0,0,0,0,0,0,556.70000000000005,600.79999999999995,611.79999999999995,0,380.3,457.5,611.79999999999995,600.79999999999995,457.5,523.6,0,0,0,0,0,0,0,0]
["103-SQ",0,0,115.7,292.10000000000002,303.10000000000002,308.60000000000002,336.2,363.8,292.10000000000002,292.10000000000002,270.10000000000002,248,226,226,220.5,0,0,0,0,231.5,231.5,231.5,104.7,104.7,215,275.60000000000002,314.2,275.60000000000002,226,226,194,194,194,187.4,0,0,0]
["103-BP",0,0,82.7,159.80000000000001,181.9,181.9,203.9,203.9,170,170,143.30000000000001,143.30000000000001,110.2,110.2,99.2,0,0,0,0,143.30000000000001,143.30000000000001,165.3,60.6,60.6,143.30000000000001,187.4,187.4,143.30000000000001,105.8,105.8,99.2,99.2,99.2,88.2,0,0,0]
["103-DL",0,0,170.9,325.2,325.2,352.7,358.3,358.3,336.2,336.2,319.7,314.2,281.10000000000002,281.10000000000002,281.10000000000002,0,0,0,0,275.60000000000002,275.60000000000002,292.10000000000002,159.80000000000001,159.80000000000001,270.10000000000002,332.9,402.3,325.2,264.60000000000002,264.60000000000002,264.60000000000002,264.60000000000002,264.60000000000002,264.60000000000002,0,0,0]
["103-TL",0,534.6,534.6,771.6,766.1,815.7,865.3,887.4,788.2,788.2,722,700,600.79999999999995,600.79999999999995,600.79999999999995,0,0,0,0,628.29999999999995,628.29999999999995,644.9,325.2,391.3,628.29999999999995,738.5,876.3,738.5,584.20000000000005,584.20000000000005,553.4,553.4,553.4,540.1,0,0,0]
["114-SQ",0,0,220.5,352.7,391.3,396.8,427.7,427.7,402.3,402.3,286.60000000000002,264.60000000000002,253.5,220.5,167.6,167.6,0,0,80,226,237,259,44.1,165.3,176.4,314.2,345,345,345,336.2,220.5,220.5,187.4,176.4,143.30000000000001,0,0]
["114-BP",0,0,115.7,226,226,226,292.10000000000002,292.10000000000002,242.5,203.9,170.9,165.3,165.3,112.4,112.4,112.4,0,0,50,154.30000000000001,154.30000000000001,176.4,44.1,99.2,104.7,181.9,215,215,177.5,177.5,143.30000000000001,143.30000000000001,115.7,115.7,93.7,0,0]
["114-DL",0,0,198.4,374.8,403.4,396.8,403.4,424.4,374.8,374.8,347.2,319.7,272.3,226,194,194,0,0,135,292.10000000000002,292.10000000000002,325,77.2,243.6,209.4,367.1,413.4,413.4,358.3,348.3,292.10000000000002,292.10000000000002,254.6,254.6,176.4,0,0]
["114-TL",0,0,534.6,876.3,937,964.5,1105.5999999999999,1105.5999999999999,975.5,970,771.6,744.1,644.79999999999995,551.20000000000005,465.2,465.2,0,0,265,650.4,661.4,722,165.3,508.2,463,801.4,948,948,868.6,862,650.4,650.4,545.6,497.1,413.4,0,0]
["125-SQ",0,0,0,363.8,440.9,451.9,451.9,451.9,341.7,330.7,330.7,270.10000000000002,226,165.3,165.3,165.3,0,0,0,286.60000000000002,315.3,315.3,0,170.9,226,336.2,384.7,314.2,292.10000000000002,276.7,198.4,192.9,187.4,154.30000000000001,137.80000000000001,0,0]
["125-BP",0,0,0,183,242.5,253.5,303.10000000000002,303.10000000000002,264.60000000000002,215,215,215,157.6,157.6,157.6,157.6,0,0,0,165.3,187.4,209.4,0,99.2,138.9,209.4,220.5,176.4,176.4,176.4,143.30000000000001,132.30000000000001,104.7,99.2,88.2,0,0]
["125-DL",0,0,0,385.8,404.5,424.4,424.4,435.4,402.3,391.3,391.3,325.2,292.10000000000002,209.4,203.9,198.4,0,0,0,303.10000000000002,369.3,374.8,0,203.9,249.1,407.9,425.5,358.3,358.3,332.9,275.60000000000002,264.60000000000002,253.5,215,170.9,0,0]
["125-TL",0,0,391.3,909.4,1048.3,1102.3,1151.9000000000001,1151.9000000000001,981.1,876.3,865.3,804.7,644.9,457.5,457.5,457.5,0,0,0,722,815.7,859.8,391.3,474,578.70000000000005,921.5,1020.7,816.8,766.1,739.7,617.29999999999995,589.70000000000005,545.6,468.5,396.8,0,0]
["138-SQ",0,82.7,0,363.8,402.3,446.4,446.4,474,440.9,413.4,385.8,358.3,242.5,242.5,198.4,148.80000000000001,0,0,0,321.89999999999998,321.89999999999998,336.2,0,149.9,237,352.7,396.8,341.7,341.7,292.10000000000002,288.8,226,198.4,181.9,71.7,0,0]
["138-BP",0,55.1,0,203.9,226,259,275.60000000000002,330.7,309.7,286.60000000000002,286.60000000000002,187.4,165.3,159.80000000000001,159.80000000000001,77.2,0,0,0,143.30000000000001,181.9,209.4,0,71.7,127.9,220.5,314.2,314.2,314.2,176.4,165.3,160.9,137.80000000000001,137.80000000000001,71.7,0,0]
["138-DL",0,115.7,0,400,451.9,474,474,501.6,435.4,418.9,403.4,396.8,303.10000000000002,286.60000000000002,286.60000000000002,176.4,0,0,0,362.7,366,429.9,0,210.5,308.60000000000002,435.4,487.2,446.4,446.4,386.9,352.7,298.7,275.60000000000002,275.60000000000002,132.30000000000001,0,0]
["138-TL",0,253.5,0,920.4,1052.7,1102.3,1102.3,1207,1118.8,1008.6,997.6,920.4,688.9,655.9,644.9,402.3,0,0,0,800.3,828.9,920.4,0,424.4,673.5,975.5,1101.2,1101.2,1101.2,778.2,777.1,685.6,595.20000000000005,589.70000000000005,275.60000000000002,0,0]
["158-SQ",0,0,0,385.8,440.9,479.5,490.5,562.20000000000005,540.1,529.1,374.8,358.3,336.2,314.2,308.60000000000002,85,0,0,0,275.60000000000002,371.5,396.8,0,170.9,249.1,396.8,414.5,385.8,325.2,320.8,320.8,265.7,231.5,231.5,99.2,0,0]
["158-BP",0,0,0,198.4,264.60000000000002,292.10000000000002,303.10000000000002,374.8,363.8,363.8,253.5,231.5,203.9,198.4,198.4,60,0,0,0,147.69999999999999,237,253.5,0,71.7,127.9,253.5,317.5,317.5,253.5,192.9,177.5,177.5,154.30000000000001,148.80000000000001,93.7,0,0]
["158-DL",0,0,0,374.8,485,485,485,556.70000000000005,549,549,396.8,396.8,347.2,347.2,330.7,135,0,0,0,325.2,442,451.9,0,237,292.10000000000002,451.9,542.29999999999995,451.9,429.9,429.9,429.9,331.8,286.60000000000002,275.60000000000002,203.9,0,0]
["158-TL",0,0,0,948,1102.3,1168.4000000000001,1196,1441.8,1441.8,1441.8,992.1,981.1,859.8,859.8,832.2,280,0,0,0,744.1,1050.5,1096.8,0,496,669.1,1096.8,1210.3,1074.8,997.6,922.6,922.6,733,672.4,655.9,396.8,0,0]
["185-SQ",0,82.7,121.3,396.8,464.1,501.6,530.20000000000005,603,545.6,540.1,396.8,319.7,231.5,231.5,231.5,215,0,0,0,286.60000000000002,396.8,490.5,0,137.80000000000001,275.60000000000002,496,490.5,440.9,440.9,319.7,314.2,254.6,220.5,181.9,181.9,0,0]
["185-BP",0,60.6,77.2,220.5,303.10000000000002,308.60000000000002,366,424.4,424.4,424.4,287.7,226,165.3,165.3,165.3,159.80000000000001,0,0,0,148.80000000000001,231.5,281.10000000000002,0,93.7,115.7,281.10000000000002,281.10000000000002,275.60000000000002,275.60000000000002,220.5,198.4,159.80000000000001,159.80000000000001,126.8,115.7,0,0]
["185-DL",0,0,192.9,440.9,440.9,496,518.1,518.1,502.7,502.7,463,336.2,297.60000000000002,297.60000000000002,297.60000000000002,270.10000000000002,0,0,0,400,451.9,501.6,0,205,303.10000000000002,501.6,518.1,501.6,501.6,374.8,336.2,336.2,292.10000000000002,275.60000000000002,275.60000000000002,0,0]
["185-TL",0,385.8,385.8,1047.2,1118.8,1223.5999999999999,1350.3,1479.3,1462.8,1462.8,1064.8,865.3,677.9,677.9,677.9,617.29999999999995,0,0,0,744.1,1080.3,1262.0999999999999,0,436.5,694.5,1262.0999999999999,1262.0999999999999,1129.9000000000001,1129.9000000000001,870.8,821.2,727.5,672.4,562.20000000000005,556.70000000000005,0,0]
["185+-SQ",0,0,358.3,446.4,578.70000000000005,639.29999999999995,644.9,694.5,562.20000000000005,562.20000000000005,562.20000000000005,562.20000000000005,523.6,330.7,0,0,0,0,0,402.3,578.70000000000005,578.70000000000005,0,99.2,242.5,578.70000000000005,601.9,429.9,402.3,385.8,305,253.5,221.6,198.4,198.4,115.7,0]
["185+-BP",0,0,104.7,248,370.4,392.4,418.9,463,407.9,347.2,347.2,347.2,270.10000000000002,148.80000000000001,0,0,0,0,0,143.30000000000001,264.60000000000002,264.60000000000002,0,93.7,110.2,264.60000000000002,334,266.8,264.60000000000002,254.6,205,176.4,176.4,176.4,121.3,88.2,0]
["185+-DL",0,0,297.60000000000002,468.5,507.1,507.1,507.1,574.29999999999995,501.6,501.6,501.6,485,474,336.2,0,0,0,0,0,281.10000000000002,524.70000000000005,524.70000000000005,0,226,292.10000000000002,524.70000000000005,544.5,468.5,440.9,440.9,347.2,325.2,270.10000000000002,264.60000000000002,264.60000000000002,253.5,0]
["185+-TL",0,760.6,760.6,1107.8,1330.5,1377.9,1377.9,1715.2,1350.3,1350.3,1350.3,1350.3,1267.7,815.7,0,0,0,0,0,981.1,1356.9,1356.9,0,418.9,644.9,1356.9,1480.4,1102.3,1058.2,1058.2,815,661.4,629.4,584.20000000000005,584.20000000000005,446.4,0]
["66-BPO",0,0,0,0,0,0,0,0,0,0,0,0,0,0,0,0,0,0,0,0,0,0,55.1,56.2,56.2,0,0,0,0,0,0,0,0,0,0,0,0]
["77-BPO",55.1,0,0,0,0,0,0,0,0,0,0,0,0,0,0,0,0,0,0,0,0,0,68.3,68.3,68.3,0,0,0,0,0,0,0,0,0,0,0,0]
["88-BPO",0,0,0,0,0,0,0,0,0,0,0,0,0,0,0,0,0,0,0,0,0,0,66.099999999999994,99.2,99.2,0,0,0,0,0,0,0,0,0,0,0,0]
["94-BPO",0,0,0,104.7,170.9,183,183,137.80000000000001,0,0,0,0,0,0,0,0,0,0,0,132.30000000000001,137.80000000000001,154.30000000000001,0,71.7,94.8,154.30000000000001,137.80000000000001,0,0,0,0,0,0,0,0,0,0]
["103-BPO",0,0,82.7,159.80000000000001,181.9,187.4,203.9,203.9,170,170,159.80000000000001,159.80000000000001,110.2,110.2,99.2,88.2,0,0,0,143.30000000000001,143.30000000000001,165.3,60.6,60.6,143.30000000000001,187.4,187.4,143.30000000000001,105.8,105.8,115.7,115.7,99.2,88.2,0,0,0]
["114-BPO",0,0,0,226,237,237,292.10000000000002,292.10000000000002,248,203.9,192.9,192.9,165.3,148.80000000000001,112.4,112.4,0,55.1,50,154.30000000000001,187.4,187.4,44.1,99.2,104.7,220.5,220.5,215,177.5,177.5,143.30000000000001,143.30000000000001,115.7,115.7,93.7,0,0]
["125-BPO",0,0,0,183,242.5,253.5,303.10000000000002,303.10000000000002,286.60000000000002,248,248,248,133.4,157.6,157.6,157.6,0,0,0,165.3,187.4,209.4,0,99.2,138.9,209.4,220.5,181.9,176.4,176.4,148.80000000000001,132.30000000000001,104.7,104.7,88.2,0,0]
["138-BPO",0,55.1,0,203.9,242.5,259,275.60000000000002,330.7,309.7,286.60000000000002,286.60000000000002,226,170.9,159.80000000000001,159.80000000000001,77.2,0,0,0,143.30000000000001,181.9,209.4,0,71.7,127.9,220.5,317.5,317.5,317.5,176.4,165.3,160.9,137.80000000000001,137.80000000000001,71.7,0,0]
["158-BPO",0,0,0,198.4,264.60000000000002,292.10000000000002,308.60000000000002,374.8,363.8,363.8,253.5,231.5,203.9,203.9,198.4,110.2,0,0,0,147.69999999999999,237,253.5,0,71.7,127.9,253.5,317.5,317.5,253.5,231.5,177.5,177.5,154.30000000000001,148.80000000000001,93.7,66.099999999999994,66.099999999999994]
["185-BPO",0,60.6,77.2,270.10000000000002,308.60000000000002,341.7,366,424.4,424.4,424.4,287.7,215,192.9,143.30000000000001,165.3,165.3,0,0,0,170.9,231.5,281.10000000000002,0,93.7,115.7,281.10000000000002,281.10000000000002,275.60000000000002,275.60000000000002,220.5,203.9,165.3,165.3,165.3,165.3,55.1,0]
["185+-BPO",0,0,0,248,370.4,392.4,418.9,463,420,402.3,380.3,352.7,270.10000000000002,187.4,176.4,0,0,0,0,209.4,264.60000000000002,264.60000000000002,0,93.7,110.2,264.60000000000002,334,270.10000000000002,264.60000000000002,264.60000000000002,205,187.4,176.4,176.4,157.6,88.2,0]
["66-DLO",0,0,0,0,0,0,0,0,0,0,0,0,0,0,0,0,0,0,0,0,0,0,132.30000000000001,143.30000000000001,143.30000000000001,0,0,0,0,0,0,0,0,0,0,0,0]
["77-DLO",126.8,0,0,0,0,0,0,0,0,0,0,0,0,0,0,0,0,0,0,0,0,0,167.6,167.6,167.6,0,0,0,0,0,0,0,0,0,0,0,0]
["88-DLO",0,0,0,0,0,0,0,0,0,0,0,0,0,0,0,0,0,0,0,0,0,0,159.80000000000001,192.9,200,0,0,0,0,0,0,0,0,0,0,0,0]
["94-DLO",0,0,0,203.9,314.2,314.2,314.2,314.2,0,0,0,0,0,0,0,0,0,0,0,231.5,275.60000000000002,275.60000000000002,0,165.3,203.9,275.60000000000002,275.60000000000002,0,0,0,0,0,0,0,0,0,0]
["103-DLO",0,0,170.9,325.2,325.2,352.7,358.3,358.3,336.2,336.2,319.7,314.2,281.10000000000002,281.10000000000002,281.10000000000002,0,0,0,0,275.60000000000002,275.60000000000002,292.10000000000002,159.80000000000001,159.80000000000001,270.10000000000002,332.9,402.3,325.2,264.60000000000002,264.60000000000002,264.60000000000002,264.60000000000002,264.60000000000002,264.60000000000002,0,0,0]
["114-DLO",0,0,0,374.8,403.4,396.8,402.3,424.4,374.8,374.8,347.2,319.7,272.3,226,194,194,0,0,135,292.10000000000002,292.10000000000002,325,77.2,243.6,226,367.1,413.4,413.4,358.3,348.3,292.10000000000002,292.10000000000002,254.6,254.6,176.4,143.30000000000001,0]
["125-DLO",0,0,0,385.8,405,424.4,424.4,435.4,402.3,391.3,391.3,325.2,292.10000000000002,209.4,203.9,198.4,0,0,0,303.10000000000002,369.3,374.8,0,203.9,249.1,407.9,425.5,358.3,358.3,332.9,275.60000000000002,264.60000000000002,253.5,215,170.9,0,0]
["138-DLO",0,115.7,0,400,451.9,474,474,501.6,435.4,418.9,403.4,396.8,303.10000000000002,286.60000000000002,286.60000000000002,176.4,0,0,0,362.7,366,429.9,0,210.5,308.60000000000002,435.4,487.2,446.4,446.4,386.9,352.7,298.7,275.60000000000002,275.60000000000002,132.30000000000001,0,0]
["158-DLO",0,0,0,374.8,485,485,485,567.70000000000005,549,549,396.8,396.8,347.2,347.2,330.7,135,0,0,0,325.2,442,451.9,0,237,292.10000000000002,451.9,542.29999999999995,451.9,429.9,429.9,429.9,331.8,286.60000000000002,275.60000000000002,203.9,93.7,93.7]
["185-DLO",0,121.3,192.9,440.9,450,496,518.1,556.70000000000005,502.7,502.7,463,336.2,253.5,253.5,297.60000000000002,270.10000000000002,0,0,0,400,451.9,501.6,0,205,303.10000000000002,501.6,518.1,501.6,501.6,374.8,336.2,336.2,292.10000000000002,253.5,275.60000000000002,132.30000000000001,0]
["185+-DLO",0,0,0,468.5,507.1,507.1,507.1,574.29999999999995,501.6,501.6,501.6,485,474,336.2,275.60000000000002,0,0,0,0,402.3,524.70000000000005,524.70000000000005,0,226,292.10000000000002,524.70000000000005,544.5,468.5,440.9,440.9,352.7,352.7,270.10000000000002,264.60000000000002,264.60000000000002,253.5,0]

{"sheet":"Quick-Reference","index":13,"n_rows":35,"n_cols":7,"rows_kept":35,"cut":false,"hidden":true,"merged":[]}
[null,null,null,null,null,null,"Quick Reference Sheet"]
[null,null,null,null,null,null,"video tutorial:  https://www.youtube.com/watch?v=o-PyI1n_EMI"]
[]
[null,"1.      Setup sheet"]
[null,"a.      Reset for New Contest"]
[null,"b.      Contest Name"]
[null,"c.       Select type of meet from the drop down menu."]
[null,"d.      Use drop downs to enter the actual weights on the platform"]
[null,"e.      Enter Divisions – Abbreviation, Description, Placing code "]
[null,"f.       Enter Teams & Abbreviations"]
[null,"g.      Enter Flights/Groups you will use in your contest"]
[null,"h.      Select the weight of bar & collars"]
[null,"2.      Before the contest, insert your Contest logo into the Awards sheet - change font, background and text colors."]
[null,"3.      Weigh-in sheet"]
[null,"a.      If you copy/paste data into the Weigh-in sheet, paste Values only to preserve formatting and validation.  Red Text indicates an error."]
[null,"b.      Print Speaker Cards"]
[null,"                                                     i.     Click Print Cards button on Weigh-in sheet to print cards with data"]
[null,"                                                   ii.     For blank cards, go to the SpeakersCard sheet and click Print Blank Cards"]
[null,"c.       Do not leave blank rows between Lifters"]
[null,"d.      Click the button at the top of the sheet to copy weighed-in athletes to the Lifting sheet"]
[null,"4.      Lifting sheet"]
[null,"a.      Select the 1st flight/group from the pulldown in cell A11"]
[null,"b.      Select Squat 1, Benchpress 1 or Deadlift 1 from the pulldown"]
[null,"c.       Select the an option to advance to the next lifter - Auto, Delay, Man"]
[null,"                                                     i.     Auto to advance without delay after a Good or NoLift"]
[null,"                                                   ii.     Delay for livestreamed contests – then select a Delay time (2-5 seconds)"]
[null,"                                                  iii.     Man for manual advance during 3rd attempts – then click Next to advance to the next lifter"]
[null,"d.      Click Good or NoLift"]
[null,"e.      Use Ctrl + G (good) or Ctrl + N (no-lift) to go back and fix an incorrect entry"]
[null,"f.       Add DQ to Events Entered column for disqualified lifters.  Add DT to the events for a drug tested lifter."]
[null,"g.      Re-attempts - type the weight in the cell when a re-attempt is granted"]
[null,"                                                     i.     Use the dropdown menu in the name block (cell A1) to select a lifter for a re-attempt "]
[null,"h.      Printouts - Use the dropdown menu next to the printer icon to select the type of printout desired – click the printer icon to print"]
[null,"i.        Select Sorted Results at the end of the lifting session for a sorted printout (this step is necessary to load data for the Awards sheet.  Have the referees sign a printout of this sheet."]
[null,"5.      Awards sheet.  Use the dropdown menu to select the awards to display (only the divisions, weight classes, and events actually used in the contest will be in the menu)"]

{"sheet":"IPF Formula","index":14,"n_rows":18,"n_cols":5,"rows_kept":18,"cut":false,"hidden":false,"merged":[[0,0,1,0],[0,1,0,2],[0,3,0,4]]}
[null,"Mean",null,"Standard Deviation"]
[null,"Parameter 1","Parameter 2","Parameter 1","Parameter 2"]
["Men CL 3-Lift",310.67,857.78499999999997,53.216000000000001,147.08349999999999]
["Men CL Squat",123.1,363.08499999999998,25.166699999999999,75.431100000000001]
["Men CL Bench",86.474500000000006,259.15499999999997,17.578499999999998,53.122]
["Men CL Deadlift",103.5355,244.76499999999999,15.37134,31.502199999999998]
["Men EQ 3-Lift",387.26499999999999,1121.28,80.632400000000004,222.4896]
["Men EQ Squat",150.48500000000001,446.44499999999999,36.515500000000003,103.70610000000001]
["Men EQ Bench",133.94,441.46499999999997,35.393799999999999,113.0057]
["Men EQ Deadlift",110.13500000000001,263.66000000000003,14.996,23.010999999999999]
["Women CL 3-Lift",125.1435,228.03,34.5246,86.830100000000002]
["Women CL Squat",50.478999999999999,105.63200000000001,19.1846,56.221499999999999]
["Women CL Bench",25.048500000000001,43.847999999999999,6.7172000000000001,13.952]
["Women CL Deadlift",47.136000000000003,67.349000000000004,9.1555,13.67]
["Women EQ 3-Lift",176.58,373.315,48.453400000000002,110.0103]
["Women EQ Squat",74.685500000000005,171.58500000000001,21.947500000000002,52.294800000000002]
["Women EQ Bench",49.106000000000002,124.209,23.199000000000002,67.492599999999996]
["Women EQ Deadlift",51.002000000000002,69.826499999999996,8.5801999999999996,5.7257999999999996]

{"sheet":"Sheet1","index":15,"n_rows":818,"n_cols":64,"rows_kept":818,"cut":false,"hidden":true,"merged":[]}
[null,null,null,null,null,null,null,null,null,null,null,null,null,null,null,null,null,null,null,null,null,null,null,null,null,1]
[{"$f":"Setup!Q3","v":"Grp"},"Name","MemberID","Team","M/F-Div","Bwt - kg","lot#","Birth Year","SQ rack",{"$f":"CONCATENATE(\"SQ-1 (\",T2,\")\")","v":"SQ-1 (Kg)"},"BP rack",{"$f":"CONCATENATE(\"BP-1 (\",T2,\")\")","v":"BP-1 (Kg)"},{"$f":"CONCATENATE(\"DL-1 (\",T2,\")\")","v":"DL-1 (Kg)"},"Events Entered","State","Print Card","Nominated Wt Class",null,null,{"$f":"Setup!G15","v":"Kg"},{"$f":"COUNTA(F:F)+1","v":20},{"$f":"CONCATENATE(\"Setup!I6:I\",COUNTA(Setup!I:I)+3)","v":"Setup!I6:I37"},{"$f":"CONCATENATE(\"Setup!M6:M\",COUNTA(Setup!M:M)+3)","v":"Setup!M6:M5"},{"$f":"CONCATENATE(\"Setup!Q5:Q\",COUNTA(Setup!Q:Q)+4)","v":"Setup!Q5:Q14"},{"$f":"CONCATENATE(\"DATA!$M$2:$M$61\")","v":"DATA!$M$2:$M$61"},1,{"$f":"COUNTA(F:F)+1","v":20},null,null,null,null,null,null,null,null,null,null,null,null,"flight sort data","att sort data",null,null,null,null,null,null,null,null,null,"SQ-1","SQ-2","SQ-3","Best SQ Att","BP rack","BP-1","BP-2","BP-3","Best BP Att","Sub Total","DL-1","DL-2","DL-3","Best DL Att"]
[null,null,null,null,null,42,1,100,100,100,100,100,100,"PL"]
[null,null,null,null,null,46,2,110,110,110,110,110,110,"PL"]
[null,null,null,null,null,50,3,120,120,120,120,120,120,"PL"]
[null,null,null,null,null,55,4,130,130,130,130,130,130,"PL"]
[null,null,null,null,null,65,5,140,140,140,140,140,140,"PL"]
[null,null,null,null,null,60,6,150,150,150,150,150,150,"PL"]
[null,null,null,null,null,54,7,160,160,160,160,160,160,"PL"]
[null,null,null,null,null,70,8,170,170,170,170,170,170,"PL"]
[null,null,null,null,null,80,9,180,180,180,180,180,180,"PL"]
[null,null,null,null,null,75,10,190,190,190,190,190,190,"PL"]
[null,null,null,null,null,75,11,200,200,200,200,200,200,"PL"]
[null,null,null,null,null,120,12,210,210,210,210,210,210,"PL"]
[null,null,null,null,null,130,13,220,220,220,220,220,220,"PL"]
[null,null,null,null,null,52,14,230,230,230,230,230,230,"PL"]
[null,null,null,null,null,120,15,240,240,240,240,240,240,"PL"]
[null,null,null,null,null,85,16,250,250,250,250,250,250,"PL"]
[null,null,null,null,null,140,17,260,260,260,260,260,260,"PL"]
[null,null,null,null,null,150,18,270,270,270,270,270,270,"PL"]
[null,null,null," ","-"]
[null,null,null," ","-"]
[null,null,null," ","-"]
[null,null,null," ","-"]
[null,null,null," ","-"]
[null,null,null," ","-"]
[null,null,null," ","-"]
[null,null,null," ","-"]
[null,null,null," ","-"]
[null,null,null," ","-"]
[null,null,null," ","-"]
[null,null,null," ","-"]
[null,null,null," ","-"]
[null,null,null," ","-"]
[null,null,null," ","-"]
[null,null,null," ","-"]
[null,null,null," ","-"]
[null,null,null," ","-"]
[null,null,null," ","-"]
[null,null,null," ","-"]
[null,null,null," ","-"]
[null,null,null," ","-"]
[null,null,null," ","-"]
[null,null,null," ","-"]
[null,null,null," ","-"]
[null,null,null," ","-"]
[null,null,null," ","-"]
[null,null,null," ","-"]
[null,null,null," ","-"]
[null,null,null," ","-"]
[null,null,null," ","-"]
[null,null,null," ","-"]
[null,null,null," ","-"]
[null,null,null," ","-"]
[null,null,null," ","-"]
[null,null,null," ","-"]
[null,null,null," ","-"]
[null,null,null," ","-"]
[null,null,null," ","-"]
[null,null,null," ","-"]
[null,null,null," ","-"]
[null,null,null," ","-"]
[null,null,null," ","-"]
[null,null,null," ","-"]
[null,null,null," ","-"]
[null,null,null," ","-"]
[null,null,null," ","-"]
[null,null,null," ","-"]
[null,null,null," ","-"]
[null,null,null," ","-"]
[null,null,null," ","-"]
[null,null,null," ","-"]
[null,null,null," ","-"]
[null,null,null," ","-"]
[null,null,null," ","-"]
[null,null,null," ","-"]
[null,null,null," ","-"]
[null,null,null," ","-"]
[null,null,null," ","-"]
[null,null,null," ","-"]
[null,null,null," ","-"]
[null,null,null," ","-"]
[null,null,null," ","-"]
[null,null,null," ","-"]
[null,null,null," ","-"]
[null,null,null," ","-"]
[null,null,null," ","-"]
[null,null,null," ","-"]
[null,null,null," ","-"]
[null,null,null," ","-"]
[null,null,null," ","-"]
[null,null,null," ","-"]
[null,null,null," ","-"]
[null,null,null," ","-"]
[null,null,null," ","-"]
[null,null,null," ","-"]
[null,null,null," ","-"]
[null,null,null," ","-"]
[null,null,null," ","-"]
[null,null,null," ","-"]
[null,null,null," ","-"]
[null,null,null," ","-"]
[null,null,null," ","-"]
[null,null,null," ","-"]
[null,null,null," ","-"]
[null,null,null," ","-"]
[null,null,null," ","-"]
[null,null,null," ","-"]
[null,null,null," ","-"]
[null,null,null," ","-"]
[null,null,null," ","-"]
[null,null,null," ","-"]
[null,null,null," ","-"]
[null,null,null," ","-"]
[null,null,null," ","-"]
[null,null,null," ","-"]
[null,null,null," ","-"]
[null,null,null," ","-"]
[null,null,null," ","-"]
[null,null,null," ","-"]
[null,null,null," ","-"]
[null,null,null," ","-"]
[null,null,null," ","-"]
[null,null,null," ","-"]
[null,null,null," ","-"]
[null,null,null," ","-"]
[null,null,null," ","-"]
[null,null,null," ","-"]
[null,null,null," ","-"]
[null,null,null," ","-"]
[null,null,null," ","-"]
[null,null,null," ","-"]
[null,null,null," ","-"]
[null,null,null," ","-"]
[null,null,null," ","-"]
[null,null,null," ","-"]
[null,null,null," ","-"]
[null,null,null," ","-"]
[null,null,null," ","-"]
[null,null,null," ","-"]
[null,null,null," ","-"]
[null,null,null," ","-"]
[null,null,null," ","-"]
[null,null,null," ","-"]
[null,null,null," ","-"]
[null,null,null," ","-"]
[null,null,null," ","-"]
[null,null,null," ","-"]
[null,null,null," ","-"]
[null,null,null," ","-"]
[null,null,null," ","-"]
[null,null,null," ","-"]
[null,null,null," ","-"]
[null,null,null," ","-"]
[null,null,null," ","-"]
[null,null,null," ","-"]
[null,null,null," ","-"]
[null,null,null," ","-"]
[null,null,null," ","-"]
[null,null,null," ","-"]
[null,null,null," ","-"]
[null,null,null," ","-"]
[null,null,null," ","-"]
[null,null,null," ","-"]
[null,null,null," ","-"]
[null,null,null," ","-"]
[null,null,null," ","-"]
[null,null,null," ","-"]
[null,null,null," ","-"]
[null,null,null," ","-"]
[null,null,null," ","-"]
[null,null,null," ","-"]
[null,null,null," ","-"]
[null,null,null," ","-"]
[null,null,null," ","-"]
[null,null,null," ","-"]
[null,null,null," ","-"]
[null,null,null," ","-"]
[null,null,null," ","-"]
[null,null,null," ","-"]
[null,null,null," ","-"]
[null,null,null," ","-"]
[null,null,null," ","-"]
[null,null,null," ","-"]
[null,null,null," ","-"]
[null,null,null," ","-"]
[null,null,null," ","-"]
[null,null,null," ","-"]
[null,null,null," ","-"]
[null,null,null," ","-"]
[null,null,null," ","-"]
[null,null,null," ","-"]
[null,null,null," ","-"]
[null,null,null," ","-"]
[null,null,null," ","-"]
[null,null,null," ","-"]
[null,null,null," ","-"]
[null,null,null," ","-"]
[null,null,null," ","-"]
[null,null,null," ","-"]
[null,null,null," ","-"]
[null,null,null," ","-"]
[null,null,null," ","-"]
[null,null,null," ","-"]
[null,null,null," ","-"]
[null,null,null," ","-"]
[null,null,null," ","-"]
[null,null,null," ","-"]
[null,null,null," ","-"]
[null,null,null," ","-"]
[null,null,null," ","-"]
[null,null,null," ","-"]
[null,null,null," ","-"]
[null,null,null," ","-"]
[null,null,null," ","-"]
[null,null,null," ","-"]
[null,null,null," ","-"]
[null,null,null," ","-"]
[null,null,null," ","-"]
[null,null,null," ","-"]
[null,null,null," ","-"]
[null,null,null," ","-"]
[null,null,null," ","-"]
[null,null,null," ","-"]
[null,null,null," ","-"]
[null,null,null," ","-"]
[null,null,null," ","-"]
[null,null,null," ","-"]
[null,null,null," ","-"]
[null,null,null," ","-"]
[null,null,null," ","-"]
[null,null,null," ","-"]
[null,null,null," ","-"]
[null,null,null," ","-"]
[null,null,null," ","-"]
[null,null,null," ","-"]
[null,null,null," ","-"]
[null,null,null," ","-"]
[null,null,null," ","-"]
[null,null,null," ","-"]
[null,null,null," ","-"]
[null,null,null," ","-"]
[null,null,null," ","-"]
[null,null,null," ","-"]
[null,null,null," ","-"]
[null,null,null," ","-"]
[null,null,null," ","-"]
[null,null,null," ","-"]
[null,null,null," ","-"]
[null,null,null," ","-"]
[null,null,null," ","-"]
[null,null,null," ","-"]
[null,null,null," ","-"]
[null,null,null," ","-"]
[null,null,null," ","-"]
[null,null,null," ","-"]
[null,null,null," ","-"]
[null,null,null," ","-"]
[null,null,null," ","-"]
[null,null,null," ","-"]
[null,null,null," ","-"]
[null,null,null," ","-"]
[null,null,null," ","-"]
[null,null,null," ","-"]
[null,null,null," ","-"]
[null,null,null," ","-"]
[null,null,null," ","-"]
[null,null,null," ","-"]
[null,null,null," ","-"]
[null,null,null," ","-"]
[null,null,null," ","-"]
[null,null,null," ","-"]
[null,null,null," ","-"]
[null,null,null," ","-"]
[null,null,null," ","-"]
[null,null,null," ","-"]
[null,null,null," ","-"]
[null,null,null," ","-"]
[null,null,null," ","-"]
[null,null,null," ","-"]
[null,null,null," ","-"]
[null,null,null," ","-"]
[null,null,null," ","-"]
[null,null,null," ","-"]
[null,null,null," ","-"]
[null,null,null," ","-"]
[null,null,null," ","-"]
[null,null,null," ","-"]
[null,null,null," ","-"]
[null,null,null," ","-"]
[null,null,null," ","-"]
[null,null,null," ","-"]
[null,null,null," ","-"]
[null,null,null," ","-"]
[null,null,null," ","-"]
[null,null,null," ","-"]
[null,null,null," ","-"]
[null,null,null," ","-"]
[null,null,null," ","-"]
[null,null,null," ","-"]
[null,null,null," ","-"]
[null,null,null," ","-"]
[null,null,null," ","-"]
[null,null,null," ","-"]
[null,null,null," ","-"]
[null,null,null," ","-"]
[null,null,null," ","-"]
[null,null,null," ","-"]
[null,null,null," ","-"]
[null,null,null," ","-"]
[null,null,null," ","-"]
[null,null,null," ","-"]
[null,null,null," ","-"]
[null,null,null," ","-"]
[null,null,null," ","-"]
[null,null,null," ","-"]
[null,null,null," ","-"]
[null,null,null," ","-"]
[null,null,null," ","-"]
[null,null,null," ","-"]
[null,null,null," ","-"]
[null,null,null," ","-"]
[null,null,null," ","-"]
[null,null,null," ","-"]
[null,null,null," ","-"]
[null,null,null," ","-"]
[null,null,null," ","-"]
[null,null,null," ","-"]
[null,null,null," ","-"]
[null,null,null," ","-"]
[null,null,null," ","-"]
[null,null,null," ","-"]
[null,null,null," ","-"]
[null,null,null," ","-"]
[null,null,null," ","-"]
[null,null,null," ","-"]
[null,null,null," ","-"]
[null,null,null," ","-"]
[null,null,null," ","-"]
[null,null,null," ","-"]
[null,null,null," ","-"]
[null,null,null," ","-"]
[null,null,null," ","-"]
[null,null,null," ","-"]
[null,null,null," ","-"]
[null,null,null," ","-"]
[null,null,null," ","-"]
[null,null,null," ","-"]
[null,null,null," ","-"]
[null,null,null," ","-"]
[null,null,null," ","-"]
[null,null,null," ","-"]
[null,null,null," ","-"]
[null,null,null," ","-"]
[null,null,null," ","-"]
[null,null,null," ","-"]
[null,null,null," ","-"]
[null,null,null," ","-"]
[null,null,null," ","-"]
[null,null,null," ","-"]
[null,null,null," ","-"]
[null,null,null," ","-"]
[null,null,null," ","-"]
[null,null,null," ","-"]
[null,null,null," ","-"]
[null,null,null," ","-"]
[null,null,null," ","-"]
[null,null,null," ","-"]
[null,null,null," ","-"]
[null,null,null," ","-"]
[null,null,null," ","-"]
[null,null,null," ","-"]
[null,null,null," ","-"]
[null,null,null," ","-"]
[null,null,null," ","-"]
[null,null,null," ","-"]
[null,null,null," ","-"]
[null,null,null," ","-"]
[null,null,null," ","-"]
[null,null,null," ","-"]
[null,null,null," ","-"]
[null,null,null," ","-"]
[null,null,null," ","-"]
[null,null,null," ","-"]
[null,null,null," ","-"]
[null,null,null," ","-"]
[null,null,null," ","-"]
[null,null,null," ","-"]
[null,null,null," ","-"]
[null,null,null," ","-"]
[null,null,null," ","-"]
[null,null,null," ","-"]
[null,null,null," ","-"]
[null,null,null," ","-"]
[null,null,null," ","-"]
[null,null,null," ","-"]
[null,null,null," ","-"]
[null,null,null," ","-"]
[null,null,null," ","-"]
[null,null,null," ","-"]
[null,null,null," ","-"]
[null,null,null," ","-"]
[null,null,null," ","-"]
[null,null,null," ","-"]
[null,null,null," ","-"]
[null,null,null," ","-"]
[null,null,null," ","-"]
[null,null,null," ","-"]
[null,null,null," ","-"]
[null,null,null," ","-"]
[null,null,null," ","-"]
[null,null,null," ","-"]
[null,null,null," ","-"]
[null,null,null," ","-"]
[null,null,null," ","-"]
[null,null,null," ","-"]
[null,null,null," ","-"]
[null,null,null," ","-"]
[null,null,null," ","-"]
[null,null,null," ","-"]
[null,null,null," ","-"]
[null,null,null," ","-"]
[null,null,null," ","-"]
[null,null,null," ","-"]
[null,null,null," ","-"]
[null,null,null," ","-"]
[null,null,null," ","-"]
[null,null,null," ","-"]
[null,null,null," ","-"]
[null,null,null," ","-"]
[null,null,null," ","-"]
[null,null,null," ","-"]
[null,null,null," ","-"]
[null,null,null," ","-"]
[null,null,null," ","-"]
[null,null,null," ","-"]
[null,null,null," ","-"]
[null,null,null," ","-"]
[null,null,null," ","-"]
[null,null,null," ","-"]
[null,null,null," ","-"]
[null,null,null," ","-"]
[null,null,null," ","-"]
[null,null,null," ","-"]
[null,null,null," ","-"]
[null,null,null," ","-"]
[null,null,null," ","-"]
[null,null,null," ","-"]
[null,null,null," ","-"]
[null,null,null," ","-"]
[null,null,null," ","-"]
[null,null,null," ","-"]
[null,null,null," ","-"]
[null,null,null," ","-"]
[null,null,null," ","-"]
[null,null,null," ","-"]
[null,null,null," ","-"]
[null,null,null," ","-"]
[null,null,null," ","-"]
[null,null,null," ","-"]
[null,null,null," ","-"]
[null,null,null," ","-"]
[null,null,null," ","-"]
[null,null,null," ","-"]
[null,null,null," ","-"]
[null,null,null," ","-"]
[null,null,null," ","-"]
[null,null,null," ","-"]
[null,null,null," ","-"]
[null,null,null," ","-"]
[null,null,null," ","-"]
[null,null,null," ","-"]
[null,null,null," ","-"]
[null,null,null," ","-"]
[null,null,null," ","-"]
[null,null,null," ","-"]
[null,null,null," ","-"]
[null,null,null," ","-"]
[null,null,null," ","-"]
[null,null,null," ","-"]
[null,null,null," ","-"]
[null,null,null," ","-"]
[null,null,null," ","-"]
[null,null,null," ","-"]
[null,null,null," ","-"]
[null,null,null," ","-"]
[null,null,null," ","-"]
[null,null,null," ","-"]
[null,null,null," ","-"]
[null,null,null," ","-"]
[null,null,null," ","-"]
[null,null,null," ","-"]
[null,null,null," ","-"]
[null,null,null," ","-"]
[null,null,null," ","-"]
[null,null,null," ","-"]
[null,null,null," ","-"]
[null,null,null," ","-"]
[null,null,null," ","-"]
[null,null,null," ","-"]
[null,null,null," ","-"]
[null,null,null," ","-"]
[null,null,null," ","-"]
[null,null,null," ","-"]
[null,null,null," ","-"]
[null,null,null," ","-"]
[null,null,null," ","-"]
[null,null,null," ","-"]
[null,null,null," ","-"]
[null,null,null," ","-"]
[null,null,null," ","-"]
[null,null,null," ","-"]
[null,null,null," ","-"]
[null,null,null," ","-"]
[null,null,null," ","-"]
[null,null,null," ","-"]
[null,null,null," ","-"]
[null,null,null," ","-"]
[null,null,null," ","-"]
[null,null,null," ","-"]
[null,null,null," ","-"]
[null,null,null," ","-"]
[null,null,null," ","-"]
[null,null,null," ","-"]
[null,null,null," ","-"]
[null,null,null," ","-"]
[null,null,null," ","-"]
[null,null,null," ","-"]
[null,null,null," ","-"]
[null,null,null," ","-"]
[null,null,null," ","-"]
[null,null,null," ","-"]
[null,null,null," ","-"]
[null,null,null," ","-"]
[null,null,null," ","-"]
[null,null,null," ","-"]
[null,null,null," ","-"]
[null,null,null," ","-"]
[null,null,null," ","-"]
[null,null,null," ","-"]
[null,null,null," ","-"]
[null,null,null," ","-"]
[null,null,null," ","-"]
[null,null,null," ","-"]
[null,null,null," ","-"]
[null,null,null," ","-"]
[null,null,null," ","-"]
[null,null,null," ","-"]
[null,null,null," ","-"]
[null,null,null," ","-"]
[null,null,null," ","-"]
[null,null,null," ","-"]
[null,null,null," ","-"]
[null,null,null," ","-"]
[null,null,null," ","-"]
[null,null,null," ","-"]
[null,null,null," ","-"]
[null,null,null," ","-"]
[null,null,null," ","-"]
[null,null,null," ","-"]
[null,null,null," ","-"]
[null,null,null," ","-"]
[null,null,null," ","-"]
[null,null,null," ","-"]
[null,null,null," ","-"]
[null,null,null," ","-"]
[null,null,null," ","-"]
[null,null,null," ","-"]
[null,null,null," ","-"]
[null,null,null," ","-"]
[null,null,null," ","-"]
[null,null,null," ","-"]
[null,null,null," ","-"]
[null,null,null," ","-"]
[null,null,null," ","-"]
[null,null,null," ","-"]
[null,null,null," ","-"]
[null,null,null," ","-"]
[null,null,null," ","-"]
[null,null,null," ","-"]
[null,null,null," ","-"]
[null,null,null," ","-"]
[null,null,null," ","-"]
[null,null,null," ","-"]
[null,null,null," ","-"]
[null,null,null," ","-"]
[null,null,null," ","-"]
[null,null,null," ","-"]
[null,null,null," ","-"]
[null,null,null," ","-"]
[null,null,null," ","-"]
[null,null,null," ","-"]
[null,null,null," ","-"]
[null,null,null," ","-"]
[null,null,null," ","-"]
[null,null,null," ","-"]
[null,null,null," ","-"]
[null,null,null," ","-"]
[null,null,null," ","-"]
[null,null,null," ","-"]
[null,null,null," ","-"]
[null,null,null," ","-"]
[null,null,null," ","-"]
[null,null,null," ","-"]
[null,null,null," ","-"]
[null,null,null," ","-"]
[null,null,null," ","-"]
[null,null,null," ","-"]
[null,null,null," ","-"]
[null,null,null," ","-"]
[null,null,null," ","-"]
[null,null,null," ","-"]
[null,null,null," ","-"]
[null,null,null," ","-"]
[null,null,null," ","-"]
[null,null,null," ","-"]
[null,null,null," ","-"]
[null,null,null," ","-"]
[null,null,null," ","-"]
[null,null,null," ","-"]
[null,null,null," ","-"]
[null,null,null," ","-"]
[null,null,null," ","-"]
[null,null,null," ","-"]
[null,null,null," ","-"]
[null,null,null," ","-"]
[null,null,null," ","-"]
[null,null,null," ","-"]
[null,null,null," ","-"]
[null,null,null," ","-"]
[null,null,null," ","-"]
[null,null,null," ","-"]
[null,null,null," ","-"]
[null,null,null," ","-"]
[null,null,null," ","-"]
[null,null,null," ","-"]
[null,null,null," ","-"]
[null,null,null," ","-"]
[null,null,null," ","-"]
[null,null,null," ","-"]
[null,null,null," ","-"]
[null,null,null," ","-"]
[null,null,null," ","-"]
[null,null,null," ","-"]
[null,null,null," ","-"]
[null,null,null," ","-"]
[null,null,null," ","-"]
[null,null,null," ","-"]
[null,null,null," ","-"]
[null,null,null," ","-"]
[null,null,null," ","-"]
[null,null,null," ","-"]
[null,null,null," ","-"]
[null,null,null," ","-"]
[null,null,null," ","-"]
[null,null,null," ","-"]
[null,null,null," ","-"]
[null,null,null," ","-"]
[null,null,null," ","-"]
[null,null,null," ","-"]
[null,null,null," ","-"]
[null,null,null," ","-"]
[null,null,null," ","-"]
[null,null,null," ","-"]
[null,null,null," ","-"]
[null,null,null," ","-"]
[null,null,null," ","-"]
[null,null,null," ","-"]
[null,null,null," ","-"]
[null,null,null," ","-"]
[null,null,null," ","-"]
[null,null,null," ","-"]
[null,null,null," ","-"]
[null,null,null," ","-"]
[null,null,null," ","-"]
[null,null,null," ","-"]
[null,null,null," ","-"]
[null,null,null," ","-"]
[null,null,null," ","-"]
[null,null,null," ","-"]
[null,null,null," ","-"]
[null,null,null," ","-"]
[null,null,null," ","-"]
[null,null,null," ","-"]
[null,null,null," ","-"]
[null,null,null," ","-"]
[null,null,null," ","-"]
[null,null,null," ","-"]
[null,null,null," ","-"]
[null,null,null," ","-"]
[null,null,null," ","-"]
[null,null,null," ","-"]
[null,null,null," ","-"]
[null,null,null," ","-"]
[null,null,null," ","-"]
[null,null,null," ","-"]
[null,null,null," ","-"]
[null,null,null," ","-"]
[null,null,null," ","-"]
[null,null,null," ","-"]
[null,null,null," ","-"]
[null,null,null," ","-"]
[null,null,null," ","-"]
[null,null,null," ","-"]
[null,null,null," ","-"]
[null,null,null," ","-"]
[null,null,null," ","-"]
[null,null,null," ","-"]
[null,null,null," ","-"]
[null,null,null," ","-"]
[null,null,null," ","-"]
[null,null,null," ","-"]
[null,null,null," ","-"]
[null,null,null," ","-"]
[null,null,null," ","-"]
[null,null,null," ","-"]
[null,null,null," ","-"]
[null,null,null," ","-"]
[null,null,null," ","-"]
[null,null,null," ","-"]
[null,null,null," ","-"]
[null,null,null," ","-"]
[null,null,null," ","-"]
[null,null,null," ","-"]
[null,null,null," ","-"]
[null,null,null," ","-"]
[null,null,null," ","-"]
[null,null,null," ","-"]
[null,null,null," ","-"]
[null,null,null," ","-"]
[null,null,null," ","-"]
[null,null,null," ","-"]
[null,null,null," ","-"]
[null,null,null," ","-"]
[null,null,null," ","-"]
[null,null,null," ","-"]
[null,null,null," ","-"]
[null,null,null," ","-"]
[null,null,null," ","-"]
[null,null,null," ","-"]
[null,null,null," ","-"]
[null,null,null," ","-"]
[null,null,null," ","-"]
[null,null,null," ","-"]
[null,null,null," ","-"]
[null,null,null," ","-"]
[null,null,null," ","-"]
[null,null,null," ","-"]
[null,null,null," ","-"]
[null,null,null," ","-"]
[null,null,null," ","-"]
[null,null,null," ","-"]
[null,null,null," ","-"]
[null,null,null," ","-"]
[null,null,null," ","-"]
[null,null,null," ","-"]
[null,null,null," ","-"]
[null,null,null," ","-"]
[null,null,null," ","-"]
[null,null,null," ","-"]
[null,null,null," ","-"]
[null,null,null," ","-"]
[null,null,null," ","-"]
[null,null,null," ","-"]
[null,null,null," ","-"]
[null,null,null," ","-"]
[null,null,null," ","-"]
[null,null,null," ","-"]
[null,null,null," ","-"]
[null,null,null," ","-"]
[null,null,null," ","-"]
[null,null,null," ","-"]
[null,null,null," ","-"]
[null,null,null," ","-"]
[null,null,null," ","-"]
[null,null,null," ","-"]
[null,null,null," ","-"]
[null,null,null," ","-"]
[null,null,null," ","-"]
[null,null,null," ","-"]
[null,null,null," ","-"]
[null,null,null," ","-"]
[null,null,null," ","-"]
[null,null,null," ","-"]
[null,null,null," ","-"]
[null,null,null," ","-"]
[null,null,null," ","-"]
[null,null,null," ","-"]
[null,null,null," ","-"]
[null,null,null," ","-"]
[null,null,null," ","-"]
[null,null,null," ","-"]
[null,null,null," ","-"]
[null,null,null," ","-"]
[null,null,null," ","-"]
[null,null,null," ","-"]
[null,null,null," ","-"]
[null,null,null," ","-"]
[null,null,null," ","-"]
[null,null,null," ","-"]
[null,null,null," ","-"]
[null,null,null," ","-"]
[null,null,null," ","-"]
[null,null,null," ","-"]
[null,null,null," ","-"]
[null,null,null," ","-"]
[null,null,null," ","-"]
[null,null,null," ","-"]
[null,null,null," ","-"]
[null,null,null," ","-"]
[null,null,null," ","-"]
[null,null,null," ","-"]
[null,null,null," ","-"]
[null,null,null," ","-"]
[null,null,null," "]
[null,null,null," "]
[null,null,null," "]
[null,null,null," "]

{"sheet":"Weigh-In (2)","index":16,"n_rows":818,"n_cols":64,"rows_kept":818,"cut":false,"hidden":false,"merged":[]}
[null,null,null,null,null,null,null,null,null,null,null,null,null,null,null,null,null,null,null,null,null,null,null,null,null,3]
[{"$f":"Setup!Q3","v":"Grp"},"Name","MemberID","Team","M/F-Div","Bwt - kg","lot#","Birth Year","SQ rack",{"$f":"CONCATENATE(\"SQ-1 (\",T2,\")\")","v":"SQ-1 (Kg)"},"BP rack",{"$f":"CONCATENATE(\"BP-1 (\",T2,\")\")","v":"BP-1 (Kg)"},{"$f":"CONCATENATE(\"DL-1 (\",T2,\")\")","v":"DL-1 (Kg)"},"Events Entered","State","Print Card","Nominated Wt Class",null,null,{"$f":"Setup!G15","v":"Kg"},{"$f":"COUNTA(F:F)+1","v":51},{"$f":"CONCATENATE(\"Setup!I6:I\",COUNTA(Setup!I:I)+3)","v":"Setup!I6:I37"},{"$f":"CONCATENATE(\"Setup!M6:M\",COUNTA(Setup!M:M)+3)","v":"Setup!M6:M5"},{"$f":"CONCATENATE(\"Setup!Q5:Q\",COUNTA(Setup!Q:Q)+4)","v":"Setup!Q5:Q14"},{"$f":"CONCATENATE(\"DATA!$M$2:$M$61\")","v":"DATA!$M$2:$M$61"},1,{"$f":"COUNTA(F:F)+1","v":51},null,null,null,null,null,null,null,null,null,null,null,null,"flight sort data","att sort data",null,null,null,null,null,null,null,null,null,"SQ-1","SQ-2","SQ-3","Best SQ Att","BP rack","BP-1","BP-2","BP-3","Best BP Att","Sub Total","DL-1","DL-2","DL-3","Best DL Att"]
["A","中川 貴美子",null,"8suki gym","F-O",42,1,1982,100,100,100,100,100,"PL"]
["A","伊藤 由実子",null,"8suki gym","F-O",46,2,1976,110,110,110,110,110,"PL"]
["A","丸山 武",null,"8suki gym","F-O",50,3,1981,120,120,120,120,120,"PL"]
["A","立脇 和弥",null,"8suki gym","F-O",55,4,1986,130,130,130,130,130,"PL"]
["A","小脇 剛",null,"烈剛河内","F-O",65,5,1979,140,140,140,140,140,"PL"]
["A","松尾 直樹",null,"8sukigym","F-O",60,6,1963,150,150,150,150,150,"PL"]
["A","三木 聖也",null,"8sukiGYM","F-O",54,7,1996,160,160,160,160,160,"PL"]
["A","山本 泰資",null,"8sukigym","F-O",70,8,1993,170,170,170,170,170,"PL"]
["A","大西 康平",null,"8suki gym","F-O",80,9,1994,180,180,180,180,180,"PL"]
["A","佐藤 啓",null,"8sukigym","F-O",75,10,1971,190,190,190,190,190,"PL"]
["A","大寺 康平",null,"8suki gym","F-O",75,11,1987,200,200,200,200,200,"PL"]
["B","芳村 晃",null,"8sukigym","F-O",120,12,1975,210,210,210,210,210,"PL"]
["B","瀧井 章男",null,"Ks GYM","F-O",130,13,1984,220,220,220,220,220,"PL"]
["B","吉岡 弘和",null,"8suki gym","F-O",52,14,1963,230,230,230,230,230,"PL"]
["B","田口 航大",null,"8sukigym","F-O",120,15,2002,240,240,240,240,240,"PL"]
["B","光安 隆史",null,"8suki gym","F-O",85,16,1976,250,250,250,250,250,"PL"]
["B","石田 浩士",null,"8suki gym","F-O",140,17,1970,260,260,260,260,260,"PL"]
["B","堀 滋",null,"8suki gym","F-O",150,18,1975,270,270,270,270,270,"PL"]
["C","中川 貴美子",null,"8suki gym","F-M1-U",150,18,1975,280,280,280,280,280,"PL"]
["C","伊藤 由実子",null,"Ks GYM","F-M2-U",150,18,1975,290,290,290,290,290,"PL"]
["C","丸山 武",null,"個人","M-M1-U",150,18,1975,300,300,300,300,300,"PL"]
["C","立脇 和弥",null,"個人","M-M4-U",150,18,1975,310,310,310,310,310,"PL"]
["C","小脇 剛",null,"三菱日立パワーシステムズ","M-M4-U",150,18,1975,320,320,320,320,320,"PL"]
["C","松尾 直樹",null,"藤本ジム","M-M4-U",150,18,1975,330,330,330,330,330,"PL"]
["C","三木 聖也",null,"個人","M-M4-U",150,18,1975,340,340,340,340,340,"PL"]
["C","山本 泰資",null,"鉄腕加西","M-M4-U",150,18,1975,350,350,350,350,350,"PL"]
["C","大西 康平",null,"個人","M-M4-U",150,18,1975,360,360,360,360,360,"PL"]
["C","佐藤 啓",null,"個人","M-M4-U",150,18,1975,370,370,370,370,370,"PL"]
["C","大寺 康平",null,"8suki gym","M-M4-U",150,18,1975,380,380,380,380,380,"PL"]
["C","芳村 晃",null,"ヤスキジム","M-M4-U",150,18,1975,390,390,390,390,390,"PL"]
["C","瀧井 章男",null,"8suki gym","M-M4-U",150,18,1975,400,400,400,400,400,"PL"]
["C","吉岡 弘和",null,"8suki gym","M-M4-U",150,18,1975,410,410,410,410,410,"PL"]
["C","田口 航大",null,"阪南大学ウエイトトレーニング部","M-M4-U",150,18,1975,420,420,420,420,420,"PL"]
["C","光安 隆史",null,"ヤスキジム","M-O-U",150,18,1975,430,430,430,430,430,"PL"]
["D","石田 浩士",null,"フジモトジム","M-O-U",150,18,1975,440,440,440,440,440,"PL"]
["D","堀 滋",null,"個人選手","M-O-U",150,18,1975,450,450,450,450,450,"PL"]
["D","坂東 太郎",null,"8suki gym","M-O-U",150,18,1975,460,460,460,460,460,"PL"]
["D","山本 高史",null,"三菱重工業高砂製作所","M-O-U",150,18,1975,470,470,470,470,470,"PL"]
["D","谷 茂樹",null,"チーム鉄腕","M-O-U",150,18,1975,480,480,480,480,480,"PL"]
["D","松岡 徹",null,"WTC藤井寺","M-O-U",150,18,1975,490,490,490,490,490,"PL"]
["D","出合 翔",null,"個人","M-O-U",150,18,1975,500,500,500,500,500,"PL"]
["D","若崎 晃裕",null,"8suki gym","M-O-U",150,18,1975,510,510,510,510,510,"PL"]
["D","乾 欣正",null,"8sukigym","M-O-U",150,18,1975,520,520,520,520,520,"PL"]
["D","高松 克哉",null,"個人","M-O-U",150,18,1975,530,530,530,530,530,"PL"]
["D","臼木 翔吾",null,"8sukigym","M-O-U",150,18,1975,540,540,540,540,540,"PL"]
["D","木之下 竜也",null,"個人","M-O-U",150,18,1975,550,550,550,550,550,"PL"]
["D","前田 光生",null,"チーム鉄腕","M-O-U",150,18,1975,560,560,560,560,560,"PL"]
["D","中澤 禎郁",null,"8suki ジム","M-O-U",150,18,1975,570,570,570,570,570,"PL"]
["D","斉藤 大明",null,"8suki gym","M-O-U",150,18,1975,580,580,580,580,580,"PL"]
[null,null,null,null,"-"]
[null,null,null,null,"-"]
[null,null,null,null,"-"]
[null,null,null," ","-"]
[null,null,null," ","-"]
[null,null,null," ","-"]
[null,null,null," ","-"]
[null,null,null," ","-"]
[null,null,null," ","-"]
[null,null,null," ","-"]
[null,null,null," ","-"]
[null,null,null," ","-"]
[null,null,null," ","-"]
[null,null,null," ","-"]
[null,null,null," ","-"]
[null,null,null," ","-"]
[null,null,null," ","-"]
[null,null,null," ","-"]
[null,null,null," ","-"]
[null,null,null," ","-"]
[null,null,null," ","-"]
[null,null,null," ","-"]
[null,null,null," ","-"]
[null,null,null," ","-"]
[null,null,null," ","-"]
[null,null,null," ","-"]
[null,null,null," ","-"]
[null,null,null," ","-"]
[null,null,null," ","-"]
[null,null,null," ","-"]
[null,null,null," ","-"]
[null,null,null," ","-"]
[null,null,null," ","-"]
[null,null,null," ","-"]
[null,null,null," ","-"]
[null,null,null," ","-"]
[null,null,null," ","-"]
[null,null,null," ","-"]
[null,null,null," ","-"]
[null,null,null," ","-"]
[null,null,null," ","-"]
[null,null,null," ","-"]
[null,null,null," ","-"]
[null,null,null," ","-"]
[null,null,null," ","-"]
[null,null,null," ","-"]
[null,null,null," ","-"]
[null,null,null," ","-"]
[null,null,null," ","-"]
[null,null,null," ","-"]
[null,null,null," ","-"]
[null,null,null," ","-"]
[null,null,null," ","-"]
[null,null,null," ","-"]
[null,null,null," ","-"]
[null,null,null," ","-"]
[null,null,null," ","-"]
[null,null,null," ","-"]
[null,null,null," ","-"]
[null,null,null," ","-"]
[null,null,null," ","-"]
[null,null,null," ","-"]
[null,null,null," ","-"]
[null,null,null," ","-"]
[null,null,null," ","-"]
[null,null,null," ","-"]
[null,null,null," ","-"]
[null,null,null," ","-"]
[null,null,null," ","-"]
[null,null,null," ","-"]
[null,null,null," ","-"]
[null,null,null," ","-"]
[null,null,null," ","-"]
[null,null,null," ","-"]
[null,null,null," ","-"]
[null,null,null," ","-"]
[null,null,null," ","-"]
[null,null,null," ","-"]
[null,null,null," ","-"]
[null,null,null," ","-"]
[null,null,null," ","-"]
[null,null,null," ","-"]
[null,null,null," ","-"]
[null,null,null," ","-"]
[null,null,null," ","-"]
[null,null,null," ","-"]
[null,null,null," ","-"]
[null,null,null," ","-"]
[null,null,null," ","-"]
[null,null,null," ","-"]
[null,null,null," ","-"]
[null,null,null," ","-"]
[null,null,null," ","-"]
[null,null,null," ","-"]
[null,null,null," ","-"]
[null,null,null," ","-"]
[null,null,null," ","-"]
[null,null,null," ","-"]
[null,null,null," ","-"]
[null,null,null," ","-"]
[null,null,null," ","-"]
[null,null,null," ","-"]
[null,null,null," ","-"]
[null,null,null," ","-"]
[null,null,null," ","-"]
[null,null,null," ","-"]
[null,null,null," ","-"]
[null,null,null," ","-"]
[null,null,null," ","-"]
[null,null,null," ","-"]
[null,null,null," ","-"]
[null,null,null," ","-"]
[null,null,null," ","-"]
[null,null,null," ","-"]
[null,null,null," ","-"]
[null,null,null," ","-"]
[null,null,null," ","-"]
[null,null,null," ","-"]
[null,null,null," ","-"]
[null,null,null," ","-"]
[null,null,null," ","-"]
[null,null,null," ","-"]
[null,null,null," ","-"]
[null,null,null," ","-"]
[null,null,null," ","-"]
[null,null,null," ","-"]
[null,null,null," ","-"]
[null,null,null," ","-"]
[null,null,null," ","-"]
[null,null,null," ","-"]
[null,null,null," ","-"]
[null,null,null," ","-"]
[null,null,null," ","-"]
[null,null,null," ","-"]
[null,null,null," ","-"]
[null,null,null," ","-"]
[null,null,null," ","-"]
[null,null,null," ","-"]
[null,null,null," ","-"]
[null,null,null," ","-"]
[null,null,null," ","-"]
[null,null,null," ","-"]
[null,null,null," ","-"]
[null,null,null," ","-"]
[null,null,null," ","-"]
[null,null,null," ","-"]
[null,null,null," ","-"]
[null,null,null," ","-"]
[null,null,null," ","-"]
[null,null,null," ","-"]
[null,null,null," ","-"]
[null,null,null," ","-"]
[null,null,null," ","-"]
[null,null,null," ","-"]
[null,null,null," ","-"]
[null,null,null," ","-"]
[null,null,null," ","-"]
[null,null,null," ","-"]
[null,null,null," ","-"]
[null,null,null," ","-"]
[null,null,null," ","-"]
[null,null,null," ","-"]
[null,null,null," ","-"]
[null,null,null," ","-"]
[null,null,null," ","-"]
[null,null,null," ","-"]
[null,null,null," ","-"]
[null,null,null," ","-"]
[null,null,null," ","-"]
[null,null,null," ","-"]
[null,null,null," ","-"]
[null,null,null," ","-"]
[null,null,null," ","-"]
[null,null,null," ","-"]
[null,null,null," ","-"]
[null,null,null," ","-"]
[null,null,null," ","-"]
[null,null,null," ","-"]
[null,null,null," ","-"]
[null,null,null," ","-"]
[null,null,null," ","-"]
[null,null,null," ","-"]
[null,null,null," ","-"]
[null,null,null," ","-"]
[null,null,null," ","-"]
[null,null,null," ","-"]
[null,null,null," ","-"]
[null,null,null," ","-"]
[null,null,null," ","-"]
[null,null,null," ","-"]
[null,null,null," ","-"]
[null,null,null," ","-"]
[null,null,null," ","-"]
[null,null,null," ","-"]
[null,null,null," ","-"]
[null,null,null," ","-"]
[null,null,null," ","-"]
[null,null,null," ","-"]
[null,null,null," ","-"]
[null,null,null," ","-"]
[null,null,null," ","-"]
[null,null,null," ","-"]
[null,null,null," ","-"]
[null,null,null," ","-"]
[null,null,null," ","-"]
[null,null,null," ","-"]
[null,null,null," ","-"]
[null,null,null," ","-"]
[null,null,null," ","-"]
[null,null,null," ","-"]
[null,null,null," ","-"]
[null,null,null," ","-"]
[null,null,null," ","-"]
[null,null,null," ","-"]
[null,null,null," ","-"]
[null,null,null," ","-"]
[null,null,null," ","-"]
[null,null,null," ","-"]
[null,null,null," ","-"]
[null,null,null," ","-"]
[null,null,null," ","-"]
[null,null,null," ","-"]
[null,null,null," ","-"]
[null,null,null," ","-"]
[null,null,null," ","-"]
[null,null,null," ","-"]
[null,null,null," ","-"]
[null,null,null," ","-"]
[null,null,null," ","-"]
[null,null,null," ","-"]
[null,null,null," ","-"]
[null,null,null," ","-"]
[null,null,null," ","-"]
[null,null,null," ","-"]
[null,null,null," ","-"]
[null,null,null," ","-"]
[null,null,null," ","-"]
[null,null,null," ","-"]
[null,null,null," ","-"]
[null,null,null," ","-"]
[null,null,null," ","-"]
[null,null,null," ","-"]
[null,null,null," ","-"]
[null,null,null," ","-"]
[null,null,null," ","-"]
[null,null,null," ","-"]
[null,null,null," ","-"]
[null,null,null," ","-"]
[null,null,null," ","-"]
[null,null,null," ","-"]
[null,null,null," ","-"]
[null,null,null," ","-"]
[null,null,null," ","-"]
[null,null,null," ","-"]
[null,null,null," ","-"]
[null,null,null," ","-"]
[null,null,null," ","-"]
[null,null,null," ","-"]
[null,null,null," ","-"]
[null,null,null," ","-"]
[null,null,null," ","-"]
[null,null,null," ","-"]
[null,null,null," ","-"]
[null,null,null," ","-"]
[null,null,null," ","-"]
[null,null,null," ","-"]
[null,null,null," ","-"]
[null,null,null," ","-"]
[null,null,null," ","-"]
[null,null,null," ","-"]
[null,null,null," ","-"]
[null,null,null," ","-"]
[null,null,null," ","-"]
[null,null,null," ","-"]
[null,null,null," ","-"]
[null,null,null," ","-"]
[null,null,null," ","-"]
[null,null,null," ","-"]
[null,null,null," ","-"]
[null,null,null," ","-"]
[null,null,null," ","-"]
[null,null,null," ","-"]
[null,null,null," ","-"]
[null,null,null," ","-"]
[null,null,null," ","-"]
[null,null,null," ","-"]
[null,null,null," ","-"]
[null,null,null," ","-"]
[null,null,null," ","-"]
[null,null,null," ","-"]
[null,null,null," ","-"]
[null,null,null," ","-"]
[null,null,null," ","-"]
[null,null,null," ","-"]
[null,null,null," ","-"]
[null,null,null," ","-"]
[null,null,null," ","-"]
[null,null,null," ","-"]
[null,null,null," ","-"]
[null,null,null," ","-"]
[null,null,null," ","-"]
[null,null,null," ","-"]
[null,null,null," ","-"]
[null,null,null," ","-"]
[null,null,null," ","-"]
[null,null,null," ","-"]
[null,null,null," ","-"]
[null,null,null," ","-"]
[null,null,null," ","-"]
[null,null,null," ","-"]
[null,null,null," ","-"]
[null,null,null," ","-"]
[null,null,null," ","-"]
[null,null,null," ","-"]
[null,null,null," ","-"]
[null,null,null," ","-"]
[null,null,null," ","-"]
[null,null,null," ","-"]
[null,null,null," ","-"]
[null,null,null," ","-"]
[null,null,null," ","-"]
[null,null,null," ","-"]
[null,null,null," ","-"]
[null,null,null," ","-"]
[null,null,null," ","-"]
[null,null,null," ","-"]
[null,null,null," ","-"]
[null,null,null," ","-"]
[null,null,null," ","-"]
[null,null,null," ","-"]
[null,null,null," ","-"]
[null,null,null," ","-"]
[null,null,null," ","-"]
[null,null,null," ","-"]
[null,null,null," ","-"]
[null,null,null," ","-"]
[null,null,null," ","-"]
[null,null,null," ","-"]
[null,null,null," ","-"]
[null,null,null," ","-"]
[null,null,null," ","-"]
[null,null,null," ","-"]
[null,null,null," ","-"]
[null,null,null," ","-"]
[null,null,null," ","-"]
[null,null,null," ","-"]
[null,null,null," ","-"]
[null,null,null," ","-"]
[null,null,null," ","-"]
[null,null,null," ","-"]
[null,null,null," ","-"]
[null,null,null," ","-"]
[null,null,null," ","-"]
[null,null,null," ","-"]
[null,null,null," ","-"]
[null,null,null," ","-"]
[null,null,null," ","-"]
[null,null,null," ","-"]
[null,null,null," ","-"]
[null,null,null," ","-"]
[null,null,null," ","-"]
[null,null,null," ","-"]
[null,null,null," ","-"]
[null,null,null," ","-"]
[null,null,null," ","-"]
[null,null,null," ","-"]
[null,null,null," ","-"]
[null,null,null," ","-"]
[null,null,null," ","-"]
[null,null,null," ","-"]
[null,null,null," ","-"]
[null,null,null," ","-"]
[null,null,null," ","-"]
[null,null,null," ","-"]
[null,null,null," ","-"]
[null,null,null," ","-"]
[null,null,null," ","-"]
[null,null,null," ","-"]
[null,null,null," ","-"]
[null,null,null," ","-"]
[null,null,null," ","-"]
[null,null,null," ","-"]
[null,null,null," ","-"]
[null,null,null," ","-"]
[null,null,null," ","-"]
[null,null,null," ","-"]
[null,null,null," ","-"]
[null,null,null," ","-"]
[null,null,null," ","-"]
[null,null,null," ","-"]
[null,null,null," ","-"]
[null,null,null," ","-"]
[null,null,null," ","-"]
[null,null,null," ","-"]
[null,null,null," ","-"]
[null,null,null," ","-"]
[null,null,null," ","-"]
[null,null,null," ","-"]
[null,null,null," ","-"]
[null,null,null," ","-"]
[null,null,null," ","-"]
[null,null,null," ","-"]
[null,null,null," ","-"]
[null,null,null," ","-"]
[null,null,null," ","-"]
[null,null,null," ","-"]
[null,null,null," ","-"]
[null,null,null," ","-"]
[null,null,null," ","-"]
[null,null,null," ","-"]
[null,null,null," ","-"]
[null,null,null," ","-"]
[null,null,null," ","-"]
[null,null,null," ","-"]
[null,null,null," ","-"]
[null,null,null," ","-"]
[null,null,null," ","-"]
[null,null,null," ","-"]
[null,null,null," ","-"]
[null,null,null," ","-"]
[null,null,null," ","-"]
[null,null,null," ","-"]
[null,null,null," ","-"]
[null,null,null," ","-"]
[null,null,null," ","-"]
[null,null,null," ","-"]
[null,null,null," ","-"]
[null,null,null," ","-"]
[null,null,null," ","-"]
[null,null,null," ","-"]
[null,null,null," ","-"]
[null,null,null," ","-"]
[null,null,null," ","-"]
[null,null,null," ","-"]
[null,null,null," ","-"]
[null,null,null," ","-"]
[null,null,null," ","-"]
[null,null,null," ","-"]
[null,null,null," ","-"]
[null,null,null," ","-"]
[null,null,null," ","-"]
[null,null,null," ","-"]
[null,null,null," ","-"]
[null,null,null," ","-"]
[null,null,null," ","-"]
[null,null,null," ","-"]
[null,null,null," ","-"]
[null,null,null," ","-"]
[null,null,null," ","-"]
[null,null,null," ","-"]
[null,null,null," ","-"]
[null,null,null," ","-"]
[null,null,null," ","-"]
[null,null,null," ","-"]
[null,null,null," ","-"]
[null,null,null," ","-"]
[null,null,null," ","-"]
[null,null,null," ","-"]
[null,null,null," ","-"]
[null,null,null," ","-"]
[null,null,null," ","-"]
[null,null,null," ","-"]
[null,null,null," ","-"]
[null,null,null," ","-"]
[null,null,null," ","-"]
[null,null,null," ","-"]
[null,null,null," ","-"]
[null,null,null," ","-"]
[null,null,null," ","-"]
[null,null,null," ","-"]
[null,null,null," ","-"]
[null,null,null," ","-"]
[null,null,null," ","-"]
[null,null,null," ","-"]
[null,null,null," ","-"]
[null,null,null," ","-"]
[null,null,null," ","-"]
[null,null,null," ","-"]
[null,null,null," ","-"]
[null,null,null," ","-"]
[null,null,null," ","-"]
[null,null,null," ","-"]
[null,null,null," ","-"]
[null,null,null," ","-"]
[null,null,null," ","-"]
[null,null,null," ","-"]
[null,null,null," ","-"]
[null,null,null," ","-"]
[null,null,null," ","-"]
[null,null,null," ","-"]
[null,null,null," ","-"]
[null,null,null," ","-"]
[null,null,null," ","-"]
[null,null,null," ","-"]
[null,null,null," ","-"]
[null,null,null," ","-"]
[null,null,null," ","-"]
[null,null,null," ","-"]
[null,null,null," ","-"]
[null,null,null," ","-"]
[null,null,null," ","-"]
[null,null,null," ","-"]
[null,null,null," ","-"]
[null,null,null," ","-"]
[null,null,null," ","-"]
[null,null,null," ","-"]
[null,null,null," ","-"]
[null,null,null," ","-"]
[null,null,null," ","-"]
[null,null,null," ","-"]
[null,null,null," ","-"]
[null,null,null," ","-"]
[null,null,null," ","-"]
[null,null,null," ","-"]
[null,null,null," ","-"]
[null,null,null," ","-"]
[null,null,null," ","-"]
[null,null,null," ","-"]
[null,null,null," ","-"]
[null,null,null," ","-"]
[null,null,null," ","-"]
[null,null,null," ","-"]
[null,null,null," ","-"]
[null,null,null," ","-"]
[null,null,null," ","-"]
[null,null,null," ","-"]
[null,null,null," ","-"]
[null,null,null," ","-"]
[null,null,null," ","-"]
[null,null,null," ","-"]
[null,null,null," ","-"]
[null,null,null," ","-"]
[null,null,null," ","-"]
[null,null,null," ","-"]
[null,null,null," ","-"]
[null,null,null," ","-"]
[null,null,null," ","-"]
[null,null,null," ","-"]
[null,null,null," ","-"]
[null,null,null," ","-"]
[null,null,null," ","-"]
[null,null,null," ","-"]
[null,null,null," ","-"]
[null,null,null," ","-"]
[null,null,null," ","-"]
[null,null,null," ","-"]
[null,null,null," ","-"]
[null,null,null," ","-"]
[null,null,null," ","-"]
[null,null,null," ","-"]
[null,null,null," ","-"]
[null,null,null," ","-"]
[null,null,null," ","-"]
[null,null,null," ","-"]
[null,null,null," ","-"]
[null,null,null," ","-"]
[null,null,null," ","-"]
[null,null,null," ","-"]
[null,null,null," ","-"]
[null,null,null," ","-"]
[null,null,null," ","-"]
[null,null,null," ","-"]
[null,null,null," ","-"]
[null,null,null," ","-"]
[null,null,null," ","-"]
[null,null,null," ","-"]
[null,null,null," ","-"]
[null,null,null," ","-"]
[null,null,null," ","-"]
[null,null,null," ","-"]
[null,null,null," ","-"]
[null,null,null," ","-"]
[null,null,null," ","-"]
[null,null,null," ","-"]
[null,null,null," ","-"]
[null,null,null," ","-"]
[null,null,null," ","-"]
[null,null,null," ","-"]
[null,null,null," ","-"]
[null,null,null," ","-"]
[null,null,null," ","-"]
[null,null,null," ","-"]
[null,null,null," ","-"]
[null,null,null," ","-"]
[null,null,null," ","-"]
[null,null,null," ","-"]
[null,null,null," ","-"]
[null,null,null," ","-"]
[null,null,null," ","-"]
[null,null,null," ","-"]
[null,null,null," ","-"]
[null,null,null," ","-"]
[null,null,null," ","-"]
[null,null,null," ","-"]
[null,null,null," ","-"]
[null,null,null," ","-"]
[null,null,null," ","-"]
[null,null,null," ","-"]
[null,null,null," ","-"]
[null,null,null," ","-"]
[null,null,null," ","-"]
[null,null,null," ","-"]
[null,null,null," ","-"]
[null,null,null," ","-"]
[null,null,null," ","-"]
[null,null,null," ","-"]
[null,null,null," ","-"]
[null,null,null," ","-"]
[null,null,null," ","-"]
[null,null,null," ","-"]
[null,null,null," ","-"]
[null,null,null," ","-"]
[null,null,null," ","-"]
[null,null,null," ","-"]
[null,null,null," ","-"]
[null,null,null," ","-"]
[null,null,null," ","-"]
[null,null,null," ","-"]
[null,null,null," ","-"]
[null,null,null," ","-"]
[null,null,null," ","-"]
[null,null,null," ","-"]
[null,null,null," ","-"]
[null,null,null," ","-"]
[null,null,null," ","-"]
[null,null,null," ","-"]
[null,null,null," ","-"]
[null,null,null," ","-"]
[null,null,null," ","-"]
[null,null,null," ","-"]
[null,null,null," ","-"]
[null,null,null," ","-"]
[null,null,null," ","-"]
[null,null,null," ","-"]
[null,null,null," ","-"]
[null,null,null," ","-"]
[null,null,null," ","-"]
[null,null,null," ","-"]
[null,null,null," ","-"]
[null,null,null," ","-"]
[null,null,null," ","-"]
[null,null,null," ","-"]
[null,null,null," ","-"]
[null,null,null," ","-"]
[null,null,null," ","-"]
[null,null,null," ","-"]
[null,null,null," ","-"]
[null,null,null," ","-"]
[null,null,null," ","-"]
[null,null,null," ","-"]
[null,null,null," ","-"]
[null,null,null," ","-"]
[null,null,null," ","-"]
[null,null,null," ","-"]
[null,null,null," ","-"]
[null,null,null," ","-"]
[null,null,null," ","-"]
[null,null,null," ","-"]
[null,null,null," ","-"]
[null,null,null," ","-"]
[null,null,null," ","-"]
[null,null,null," ","-"]
[null,null,null," ","-"]
[null,null,null," ","-"]
[null,null,null," ","-"]
[null,null,null," ","-"]
[null,null,null," ","-"]
[null,null,null," ","-"]
[null,null,null," ","-"]
[null,null,null," ","-"]
[null,null,null," ","-"]
[null,null,null," ","-"]
[null,null,null," ","-"]
[null,null,null," ","-"]
[null,null,null," ","-"]
[null,null,null," ","-"]
[null,null,null," ","-"]
[null,null,null," ","-"]
[null,null,null," ","-"]
[null,null,null," ","-"]
[null,null,null," ","-"]
[null,null,null," ","-"]
[null,null,null," ","-"]
[null,null,null," ","-"]
[null,null,null," ","-"]
[null,null,null," ","-"]
[null,null,null," ","-"]
[null,null,null," ","-"]
[null,null,null," ","-"]
[null,null,null," ","-"]
[null,null,null," ","-"]
[null,null,null," ","-"]
[null,null,null," ","-"]
[null,null,null," ","-"]
[null,null,null," ","-"]
[null,null,null," ","-"]
[null,null,null," ","-"]
[null,null,null," ","-"]
[null,null,null," ","-"]
[null,null,null," ","-"]
[null,null,null," ","-"]
[null,null,null," ","-"]
[null,null,null," ","-"]
[null,null,null," ","-"]
[null,null,null," ","-"]
[null,null,null," ","-"]
[null,null,null," ","-"]
[null,null,null," ","-"]
[null,null,null," ","-"]
[null,null,null," ","-"]
[null,null,null," ","-"]
[null,null,null," ","-"]
[null,null,null," ","-"]
[null,null,null," ","-"]
[null,null,null," ","-"]
[null,null,null," ","-"]
[null,null,null," ","-"]
[null,null,null," ","-"]
[null,null,null," ","-"]
[null,null,null," ","-"]
[null,null,null," ","-"]
[null,null,null," ","-"]
[null,null,null," ","-"]
[null,null,null," ","-"]
[null,null,null," ","-"]
[null,null,null," ","-"]
[null,null,null," ","-"]
[null,null,null," ","-"]
[null,null,null," ","-"]
[null,null,null," ","-"]
[null,null,null," ","-"]
[null,null,null," ","-"]
[null,null,null," ","-"]
[null,null,null," ","-"]
[null,null,null," ","-"]
[null,null,null," ","-"]
[null,null,null," ","-"]
[null,null,null," ","-"]
[null,null,null," ","-"]
[null,null,null," ","-"]
[null,null,null," ","-"]
[null,null,null," ","-"]
[null,null,null," ","-"]
[null,null,null," ","-"]
[null,null,null," ","-"]
[null,null,null," ","-"]
[null,null,null," ","-"]
[null,null,null," ","-"]
[null,null,null," ","-"]
[null,null,null," ","-"]
[null,null,null," ","-"]
[null,null,null," ","-"]
[null,null,null," ","-"]
[null,null,null," ","-"]
[null,null,null," ","-"]
[null,null,null," ","-"]
[null,null,null," ","-"]
[null,null,null," ","-"]
[null,null,null," ","-"]
[null,null,null," ","-"]
[null,null,null," ","-"]
[null,null,null," ","-"]
[null,null,null," ","-"]
[null,null,null," "]
[null,null,null," "]
[null,null,null," "]
[null,null,null," "]

{"sheet":"エントリー表","index":17,"n_rows":57,"n_cols":11,"rows_kept":57,"cut":false,"hidden":true,"merged":[[38,0,54,0],[55,0,55,8],[56,0,56,8],[0,0,0,8],[2,0,2,8],[3,0,20,0],[21,0,21,8],[22,0,37,0]]}
["　第２１回兵庫県ベンチプレス選手権"]
["セクション","№","種別","階級","カテゴリー","選手名","年齢","都道府県","所属"]
["第１セッション　検量　７：３０－９：００　　　試技開始　９：３０"]
[1,1,"フルギア","63㎏級","県外","山下 彩",1986,"大阪府","8suki gym"]
[null,2,"フルギア","72㎏級","県外","高岡 美穂",1992,"大阪府","8suki gym"]
[null,3,"フルギア","53㎏級","県外","酒井 維吹",2000,"大阪府","8suki gym"]
[null,4,"フルギア","59㎏級","県外","野口 貴史",1993,"大阪府","8suki gym"]
[null,5,"フルギア","66㎏級","県外","吉村 雄一",1994,"大阪府","8sukigym"]
[null,6,"フルギア","74㎏級","県外","安倉 明徳",1958,"大阪府","烈剛河内"]
[null,7,"フルギア","74㎏級","県外","久保田 甲斐",1991,"大阪府","8sukigym"]
[null,8,"フルギア","74㎏級","県外","松尾 静葵",2000,"大阪府","8sukigym"]
[null,9,"フルギア","74㎏級","県外","後藤 隆",1976,"大阪府","8suki gym"]
[null,10,"フルギア","83㎏級","県外","阪本 賢一",1970,"大阪府","8suki gym"]
[null,11,"フルギア","83㎏級","県外","菅原 大輔",1983,"大阪府","8sukiGYM"]
[null,12,"フルギア","93㎏級","県外","植野 哲",1984,"大阪府","8suki gym"]
[null,13,"フルギア","93㎏級","県外","塚村 英夫",1981,"大阪府","8suki gym"]
[null,14,"フルギア","93㎏級","県外","山本 僚介",1987,"大阪府","8sukigym"]
[null,15,"フルギア","93㎏級","県外","上田 真司",1972,"大阪府","Ks GYM"]
[null,16,"フルギア","93㎏級","県外","西田 貴胤",1976,"大阪府","8sukigym"]
[null,17,"フルギア","93㎏級","県外","山下 保樹",1991,"大阪府","8suki gym"]
[null,18,"フルギア","105㎏級","県外","岩本 隆全",1971,"大阪府","8suki gym"]
["第２セッション　検量　１６：４５－１８：１５　　　試技開始　１８：４５"]
[2,19,"ノーギア","52㎏級","県外","中川 貴美子",1982,"大阪府","8suki gym",null,19]
[null,20,"ノーギア","72㎏級","県外","伊藤 由実子",1976,"大阪府","Ks GYM",null,20]
[null,21,"ノーギア","59㎏級","一般","丸山 武",1981,"兵庫県","個人",null,21]
[null,22,"ノーギア","59㎏級","一般","立脇 和弥",1986,"兵庫県","個人",null,22]
[null,23,"ノーギア","59㎏級","一般","小脇 剛",1979,"兵庫県","三菱日立パワーシステムズ",null,23]
[null,24,"ノーギア","74㎏級","Ｍ２","松尾 直樹",1963,"兵庫県","藤本ジム",null,24]
[null,25,"ノーギア","74㎏級","一般","三木 聖也",1996,"兵庫県","個人",null,25]
[null,26,"ノーギア","74㎏級","一般","山本 泰資",1993,"兵庫県","鉄腕加西",null,26]
[null,27,"ノーギア","74㎏級","一般","大西 康平",1994,"兵庫県","個人",null,27]
[null,28,"ノーギア","74㎏級","県外","佐藤 啓",1971,"大阪府","個人",null,28]
[null,29,"ノーギア","74㎏級","県外","大寺 康平",1987,"大阪府","8suki gym",null,29]
[null,30,"ノーギア","74㎏級","県外","芳村 晃",1975,"大阪府","ヤスキジム",null,30]
[null,31,"ノーギア","74㎏級","県外","瀧井 章男",1984,"大阪府","8suki gym",null,31]
[null,32,"ノーギア","74㎏級","県外","吉岡 弘和",1963,"大阪府","8suki gym",null,32]
[null,33,"ノーギア","74㎏級","県外","田口 航大",2002,"大阪府","阪南大学ウエイトトレーニング部",null,33]
[null,34,"ノーギア","74㎏級","県外","光安 隆史",1976,"大阪府","ヤスキジム",null,34]
[3,35,"ノーギア","66㎏級","Ｍ２","石田 浩士",1970,"兵庫県","フジモトジム",null,35]
[null,36,"ノーギア","66㎏級","県外","堀 滋",1975,"大阪府","個人選手",null,36]
[null,37,"ノーギア","66㎏級","県外","坂東 太郎",1994,"大阪府","8suki gym",null,37]
[null,38,"ノーギア","83㎏級","一般","山本 高史",1972,"兵庫県","三菱重工業高砂製作所",null,38]
[null,39,"ノーギア","83㎏級","一般","谷 茂樹",1986,"兵庫県","チーム鉄腕",null,39]
[null,40,"ノーギア","83㎏級","県外","松岡 徹",1976,"大阪府","WTC藤井寺",null,40]
[null,41,"ノーギア","83㎏級","県外","出合 翔",1991,"大阪府","個人",null,41]
[null,42,"ノーギア","83㎏級","県外","若崎 晃裕",1987,"大阪府","8suki gym",null,42]
[null,43,"ノーギア","83㎏級","県外","乾 欣正",1980,"大阪府","8sukigym",null,43]
[null,44,"ノーギア","83㎏級","県外","高松 克哉",1980,"大阪府","個人",null,44]
[null,45,"ノーギア","93㎏級","県外","臼木 翔吾",1992,"大阪府","8sukigym",null,45]
[null,46,"ノーギア","105㎏級","ＪＲ","木之下 竜也",2001,"兵庫県","個人",null,46]
[null,47,"ノーギア","105㎏級","Ｍ３","前田 光生",1960,"兵庫県","チーム鉄腕",null,47]
[null,48,"ノーギア","105㎏級","県外","中澤 禎郁",1966,"大阪府","8suki ジム",null,48]
[null,49,"ノーギア","105㎏級","県外","斉藤 大明",1985,"大阪府","8suki gym",null,49]
[null,50,"ノーギア","105㎏級","県外","豊島 泰弘",1992,"大阪府","8suki gym",null,50]
[null,51,"ノーギア","105㎏級","県外","野口 昌利",1994,"大阪府","8suki gym",null,51]
["試技終了予定　２０：３０"]
["試技終了し、賞状発行して受領しましたらご帰宅お願いします。"]